{"text_format":"1","workbook":"xlsx","n_sheets":9,"sheets":["Instructions","Clearing Cross Section Report","Seeding_quantities report","Manual Inputs","Clearing","Seeding","Summary","Data","Clearing Calculations"],"not_rendered":{"charts":0,"images":7,"macros":1,"external_links":1,"defined_names":6,"comments":0,"pivot_tables":0},"unopened":[],"bounds":{"document_bytes":16777216,"sheet_cells":100000,"rows_first":2000,"rows_last":500,"rows_between":2000,"halvings":0,"cell_chars":16384,"cell_head_chars":4096},"cells_cut":0,"cells_raw":0,"read":"whole","date_system":"1900"}

{"sheet":"Instructions","index":0,"n_rows":51,"n_cols":3,"rows_kept":51,"cut":false,"hidden":false,"merged":[[13,2,17,2]]}
[]
[null,"Instructions - Clearing"]
[null,1,"Draw cross section named boundaries for area that needs reported."]
[null,2,"Run the cross section report from:  OpenRoads Modeling>Home>Model Analysis and Reporting>Civil Analysis>Cross Section Report"]
[null,null,"Select the cross section named boundary"]
[null,null,"Change Which Features to Selection"]
[null,null,"Select the 3D cut/fill lines; make sure to get all of them"]
[null,3,"In the report window select Evaluation>CrossSectionGradebookfromCL.xsl"]
[null,null,"Right click on the report and select export to excel"]
[]
{"$rows_left_out":42}
{"sheet":"Clearing Cross Section Report","index":1,"n_rows":0,"n_cols":0,"rows_kept":0,"cut":false,"hidden":false,"merged":[]}

{"sheet":"Seeding_quantities report","index":2,"n_rows":0,"n_cols":0,"rows_kept":0,"cut":false,"hidden":false,"merged":[]}

{"sheet":"Manual Inputs","index":3,"n_rows":11,"n_cols":13,"rows_kept":11,"cut":false,"hidden":false,"merged":[[1,1,1,3],[1,8,1,12]]}
[]
[null,"Clearing Report Values",null,null,null,null,null,null,"Seeding Report Values"]
[null,null,null,null,null,null,null,null,"Number of Rows",null,null,null,"Station Range"]
[null,null,null,null,null,null,null,null,{"$f":"LOOKUP(2,1/('Seeding_quantities report'!A:A<>\"\"),ROW('Seeding_quantities report'!A:A))","v":{"$error":"#N/A"}},null,null,"Add Starting Station",0]
[null,"Cut Slope Rounding",5,"ft",null,null,null,null,null,null,null,null,725]
[null,null,null,null,null,null,null,null,null,null,null,null,1450]
[null,"Additional Clearing in Cut",5,"ft"]
[]
[null,"Additonal Clearing in Fill",5,"ft"]
[]
{"$rows_left_out":2}
{"sheet":"Clearing","index":4,"n_rows":2000,"n_cols":17,"rows_kept":2000,"cut":false,"hidden":false,"merged":[[7,9,7,10],[6,9,6,10],[5,4,6,4],[5,6,6,6],[5,5,6,5],[0,9,5,9],[0,10,5,10],[2,1,2,4],[5,1,6,2],[5,3,6,3]]}
[null,null,null,null,null,null,null,null,null,"<---Type Beginning Row Number","<---Automatic calculates except for last row"]
["NOTE TO DESIGNER:  Input data into yellow-shaded columns only."]
[null,null,null,null,null,null,43560]
["TOTALS",{"$f":"SUM(B9:B2000)","v":{"$error":"#VALUE!"}},{"$f":"SUM(C9:C2000)","v":{"$error":"#VALUE!"}},{"$error":"#VALUE!"},0,0,0]
[]
[null,null,null,"Total","Total Area (SQFT)","Total Area (SQYD)","Total Area (acre)"]
[null,null,null,null,null,null,null,null,null,"Rows from"]
["Station to Station","Clearing Distance LT","Clearing Distance RT","Total Clearing (FT)","Area","Area","Area",null,null,"Clearing",null,null,null,null,"ACRE","SQFT","SQYD"]
[{"$f":"IF('Clearing Calculations'!A3=\"\",\"\",'Clearing Calculations'!A3)","v":{"$error":"#VALUE!"}},{"$f":"IF('Clearing Calculations'!A3,'Clearing Calculations'!J3,\"\")","v":{"$error":"#VALUE!"}},{"$f":"IF('Clearing Calculations'!A3,'Clearing Calculations'!K3,\"\")","v":{"$error":"#VALUE!"}},{"$f":"IF(A9=\"\",\"\",$B9+$C9)","v":{"$error":"#VALUE!"}},null,null,"",null,null,null,null,"Station","to","Station","Clearing","Clearing","Clearing"]
[{"$f":"IF('Clearing Calculations'!A4=\"\",\"\",'Clearing Calculations'!A4)","v":""},{"$f":"IF('Clearing Calculations'!A4,'Clearing Calculations'!J4,\"\")","v":""},{"$f":"IF('Clearing Calculations'!A4,'Clearing Calculations'!K4,\"\")","v":""},{"$f":"IF(A10=\"\",\"\",$B10+$C10)","v":""},{"$f":"IF(A10=\"\",\"\",(D10+D9)/2*(A10-A9))","v":""},{"$f":"IF(A10=\"\",\"\",(E10/9))","v":""},{"$f":"IF(A10=\"\",\"\",E10/$G$3)","v":""},null,null,null,{"$f":"IF(J11=\"\",\"\",+J11-1)","v":""},{"$f":"IF(J10=\"\",\"\",INDIRECT(CONCATENATE($J$8,\"!\",\"A\",J10)))","v":""},{"$f":"IF(J10=\"\",\"\",\"-\")","v":""},{"$f":"IF(J10=\"\",\"\",INDIRECT(CONCATENATE($J$8,\"!\",\"A\",K10)))","v":""},{"$f":"IF(J10=\"\",\"\",ROUND(SUM(INDIRECT(CONCATENATE($J$8,\"!\",\"G\",$J10,\":\",\"G\",$K10))),4))","v":""},{"$f":"IF(K10=\"\",\"\",ROUND(SUM(INDIRECT(CONCATENATE($J$8,\"!\",\"E\",$J10,\":\",\"E\",$K10))),0))","v":""},{"$f":"IF(L10=\"\",\"\",ROUND(SUM(INDIRECT(CONCATENATE($J$8,\"!\",\"f\",$J10,\":\",\"f\",$K10))),0))","v":""}]
{"$rows_left_out":1991}
{"sheet":"Seeding","index":5,"n_rows":240,"n_cols":16,"rows_kept":240,"cut":false,"hidden":false,"merged":[[0,9,5,9],[0,10,5,10],[3,2,3,3],[6,9,6,10],[7,9,7,10]]}
[null,null,null,null,"Pay Column","Pay Column",null,null,null,"<---Type Beginning Row Number","<---Automatic calculates except for last row"]
[null,null,null,null,null,43560]
["TOTALS",null,{"$f":"SUM(C8:C999999)","v":0},{"$f":"SUM(D8:D32)","v":0},{"$f":"SUM(E8:E32)","v":0},{"$f":"SUM(F8:F32)","v":0}]
[null,null,"Seeding",null,"Total","Total"]
[null,null,"Seeding in Cut\nSQFT","Seeding in Fill\nSQFT","SQFT","ACRE"]
["ORD Component Name",null,"XS_TC_Cut: ","XS_TC_Fill: ","Total Seeding","Total Seeding"]
["Enter Start of Project",{"$f":"IFERROR(INDEX('Manual Inputs'!M:M,SMALL(IF('Manual Inputs'!M:M<>\"\",ROW('Manual Inputs'!M:M)),ROW(2:2))),\"\")","v":0},null,null,null,null,null,null,null,"Rows from"]
[null,{"$f":"IFERROR(INDEX('Manual Inputs'!M:M,SMALL(IF('Manual Inputs'!M:M<>\"\",ROW('Manual Inputs'!M:M)),ROW(3:3))),\"\")","v":725},{"$f":"IF(B8=\"\",\"\",IFERROR(INDEX('Seeding_quantities report'!$F$2:$F$10003,SMALL(IF('Seeding_quantities report'!$A$2:$A$10003=C$6,ROW('Seeding_quantities report'!$A$2:$A$10003)-1,\"\"),ROWS($B$8:$B8))),\"0\"))","v":"0"},{"$f":"IF(B8=\"\",\"\",IFERROR(INDEX('Seeding_quantities report'!$F$2:$F$10003,SMALL(IF('Seeding_quantities report'!$A$2:$A$10003=D$6,ROW('Seeding_quantities report'!$A$2:$A$10003)-1,\"\"),ROWS($B$8:$B8))),\"0\"))","v":"0"},{"$f":"IF(B8=\"\",\"\",$C8+$D8)","v":0},{"$f":"IF(C8=\"\",\"\",($C8+$D8)/$F$2)","v":0},null,null,null,"Seeding",null,null,null,null,"ACRE","SQFT"]
[null,{"$f":"IFERROR(INDEX('Manual Inputs'!M:M,SMALL(IF('Manual Inputs'!M:M<>\"\",ROW('Manual Inputs'!M:M)),ROW(4:4))),\"\")","v":1450},{"$f":"IF(B9=\"\",\"\",IFERROR(INDEX('Seeding_quantities report'!$F$2:$F$10003,SMALL(IF('Seeding_quantities report'!$A$2:$A$10003=C$6,ROW('Seeding_quantities report'!$A$2:$A$10003)-1,\"\"),ROWS($B$8:$B9))),\"0\"))","v":"0"},{"$f":"IF(B9=\"\",\"\",IFERROR(INDEX('Seeding_quantities report'!$F$2:$F$10003,SMALL(IF('Seeding_quantities report'!$A$2:$A$10003=D$6,ROW('Seeding_quantities report'!$A$2:$A$10003)-1,\"\"),ROWS($B$8:$B9))),\"0\"))","v":"0"},{"$f":"IF(B9=\"\",\"\",$C9+$D9)","v":0},{"$f":"IF(C9=\"\",\"\",($C9+$D9)/$F$2)","v":0},null,null,null,null,null,"Station","to","Station","Clearing","Clearing"]
[null,{"$f":"IFERROR(INDEX('Manual Inputs'!M:M,SMALL(IF('Manual Inputs'!M:M<>\"\",ROW('Manual Inputs'!M:M)),ROW(5:5))),\"\")","v":""},{"$f":"IF(B10=\"\",\"\",IFERROR(INDEX('Seeding_quantities report'!$F$2:$F$10003,SMALL(IF('Seeding_quantities report'!$A$2:$A$10003=C$6,ROW('Seeding_quantities report'!$A$2:$A$10003)-1,\"\"),ROWS($B$8:$B10))),\"0\"))","v":""},{"$f":"IF(B10=\"\",\"\",IFERROR(INDEX('Seeding_quantities report'!$F$2:$F$10003,SMALL(IF('Seeding_quantities report'!$A$2:$A$10003=D$6,ROW('Seeding_quantities report'!$A$2:$A$10003)-1,\"\"),ROWS($B$8:$B10))),\"0\"))","v":""},"","",null,null,null,null,{"$f":"IF(J11=\"\",\"\",J11)","v":""},{"$f":"_xlfn.SINGLE(IF(J10=\"\",\"\",INDIRECT(CONCATENATE($J$8,\"!\",\"B\",J10))))","v":""},{"$f":"IF(J10=\"\",\"\",\"-\")","v":""},{"$f":"IF(J10=\"\",\"\",INDIRECT(CONCATENATE($J$8,\"!\",\"B\",K10)))","v":""},{"$f":"IF(L10=\"\",\"\",ROUND(SUM(INDIRECT(CONCATENATE($J$8,\"!\",\"F\",$K10))),2))","v":""},{"$f":"IF(L10=\"\",\"\",ROUND(SUM(INDIRECT(CONCATENATE($J$8,\"!\",\"E\",$K10))),0))","v":""}]
{"$rows_left_out":231}
{"sheet":"Summary","index":6,"n_rows":116,"n_cols":13,"rows_kept":116,"cut":false,"hidden":false,"merged":[[2,11,2,14],[38,2,38,6],[112,0,112,2],[5,3,5,6],[6,2,7,2],[6,3,7,5],[6,6,7,6],[107,0,107,2],[69,2,69,6],[100,2,100,6],[102,0,102,2],[7,0,7,1],[4,3,4,6]]}
[null,null,null,null,null,"Pay Item File:","N:\\CFL-DPIT\\Excel\\Payitems14.csv"]
[null,null,null,null,null,null,null,"Leave this column HIDDEN!!! Do not delete"]
["Check Column - do not delete",null,null,null,null,null,null,{"$f":"IF(ISERROR(VLOOKUP(H2,Data!$A:$C,2,FALSE)),\"\",VLOOKUP(H2,Data!$A:$C,2,FALSE))","v":""},null,null,null,"Do not manually add columns to the spreadsheet.  The macro will become inoperable if columns are added to the left of the remarks column."]
[]
[null,null,null,"CLEARING AND GRUBBING SUMMARY",null,null,null,null,null,null,null,"*Remember to Merge and Center the Title over the entire table"]
[null,null,null,"Item Number",null,null,null,{"$f":"H2","v":"Leave this column HIDDEN!!! Do not delete"}]
[null,null,"Schedule","Station to Station",null,null,"Side",{"$f":"IF(ISBLANK(H2),\"\",LOOKUP(H2,'[1]FP14 Pay Items'!$A$1:$A$65536,'[1]FP14 Pay Items'!$D$1:$D$65536))","v":"FUNDING RECLASSIFICATION"},"Remarks"]
[null,null,null,null,null,null,null,{"$f":"IF(ISBLANK(H2),\"\",LOOKUP(H2,'[1]FP14 Pay Items'!$A$1:$A$65536,'[1]FP14 Pay Items'!$E$1:$E$65536))","v":"LPSM"}]
[]
[]
{"$rows_left_out":107}
{"sheet":"Data","index":7,"n_rows":3,"n_cols":7,"rows_kept":3,"cut":false,"hidden":false,"merged":[]}
["Pay Item Number","Description","Unit","Num Items",null,"Sides","Schedules"]
[null,null,null,{"$f":"COUNTA(A:A)-1","v":0},null,"RT",1]
[null,null,null,null,null,"LT"]

{"sheet":"Clearing Calculations","index":8,"n_rows":25,"n_cols":11,"rows_kept":25,"cut":false,"hidden":false,"merged":[[0,5,0,6],[0,7,0,8],[0,9,0,10]]}
["Station: ","Offset","Offset","Feature","Feature","With Rounding",null,"Additonal Clearing",null,"Total Clearing"]
[null,"LT","RT",null,null,"LT","RT","LT","RT","LT","RT"]
[{"$f":"_xlfn._xlws.FILTER('Clearing Cross Section Report'!B:B,'Clearing Cross Section Report'!A:A='Clearing Calculations'!A1)","v":{"$error":"#VALUE!"}},{"$f":"ABS(_xlfn._xlws.FILTER('Clearing Cross Section Report'!B:B,'Clearing Cross Section Report'!A:A='Clearing Calculations'!B1))","v":{"$error":"#VALUE!"}},{"$f":"ABS(_xlfn._xlws.FILTER('Clearing Cross Section Report'!C:C,'Clearing Cross Section Report'!A:A='Clearing Calculations'!B1))","v":{"$error":"#VALUE!"}},{"$f":"_xlfn._xlws.FILTER('Clearing Cross Section Report'!B:B,'Clearing Cross Section Report'!A:A='Clearing Calculations'!D1)","v":{"$error":"#VALUE!"}},{"$f":"_xlfn._xlws.FILTER('Clearing Cross Section Report'!C:C,'Clearing Cross Section Report'!A:A='Clearing Calculations'!E1)","v":{"$error":"#VALUE!"}},{"$f":"IF(ISBLANK(A3),\"\",IF(ISNUMBER(SEARCH(\"cut\",E3,10)),'Manual Inputs'!$C$5,\"0\"))","v":"0"},{"$f":"IF(ISBLANK(B3),\"\",IF(ISNUMBER(SEARCH(\"cut\",E3,10)),'Manual Inputs'!$C$5,\"0\"))","v":"0"},{"$f":"IF(ISBLANK(A3),\"\",IF(ISNUMBER(SEARCH(\"cut\",D3,10)),'Manual Inputs'!$C$7,IF(ISNUMBER(SEARCH(\"fill\",D3,10)),'Manual Inputs'!$C$9,\"0\")))","v":"0"},{"$f":"IF(ISBLANK(A3),\"\",IF(ISNUMBER(SEARCH(\"cut\",E3,10)),'Manual Inputs'!$C$7,IF(ISNUMBER(SEARCH(\"fill\",E3,10)),'Manual Inputs'!$C$9,\"0\")))","v":"0"},{"$f":"IF(ISBLANK(A3),\"\",IF((B3+F3+H3)>'Manual Inputs'!$C$11,(B3+F3+H3),'Manual Inputs'!$C$11))","v":{"$error":"#VALUE!"}},{"$f":"IF(ISBLANK(A3),\"\",IF((C3+G3+I3)>'Manual Inputs'!$C$11,(C3+G3+I3),'Manual Inputs'!$C$11))","v":{"$error":"#VALUE!"}}]
[null,null,null,null,null,{"$f":"IF(ISBLANK(A4),\"\",IF(ISNUMBER(SEARCH(\"cut\",D4,10)),'Manual Inputs'!$C$5,\"0\"))","v":""},{"$f":"IF(ISBLANK(B4),\"\",IF(ISNUMBER(SEARCH(\"cut\",E4,10)),'Manual Inputs'!$C$5,\"0\"))","v":""},{"$f":"IF(ISBLANK(A4),\"\",IF(ISNUMBER(SEARCH(\"cut\",D4,10)),'Manual Inputs'!$C$7,IF(ISNUMBER(SEARCH(\"fill\",D4,10)),'Manual Inputs'!$C$9,\"0\")))","v":""},{"$f":"IF(ISBLANK(A4),\"\",IF(ISNUMBER(SEARCH(\"cut\",E4,10)),'Manual Inputs'!$C$7,IF(ISNUMBER(SEARCH(\"fill\",E4,10)),'Manual Inputs'!$C$9,\"0\")))","v":""},{"$f":"IF(ISBLANK(A4),\"\",IF((B4+F4+H4)>'Manual Inputs'!$C$11,(B4+F4+H4),'Manual Inputs'!$C$11))","v":""},{"$f":"IF(ISBLANK(A4),\"\",IF((C4+G4+I4)>'Manual Inputs'!$C$11,(C4+G4+I4),'Manual Inputs'!$C$11))","v":""}]
[null,null,null,null,null,{"$f":"IF(ISBLANK(A5),\"\",IF(ISNUMBER(SEARCH(\"cut\",D5,10)),'Manual Inputs'!$C$5,\"0\"))","v":""},{"$f":"IF(ISBLANK(B5),\"\",IF(ISNUMBER(SEARCH(\"cut\",E5,10)),'Manual Inputs'!$C$5,\"0\"))","v":""},{"$f":"IF(ISBLANK(A5),\"\",IF(ISNUMBER(SEARCH(\"cut\",D5,10)),'Manual Inputs'!$C$7,IF(ISNUMBER(SEARCH(\"fill\",D5,10)),'Manual Inputs'!$C$9,\"0\")))","v":""},{"$f":"IF(ISBLANK(A5),\"\",IF(ISNUMBER(SEARCH(\"cut\",E5,10)),'Manual Inputs'!$C$7,IF(ISNUMBER(SEARCH(\"fill\",E5,10)),'Manual Inputs'!$C$9,\"0\")))","v":""},{"$f":"IF(ISBLANK(A5),\"\",IF((B5+F5+H5)>'Manual Inputs'!$C$11,(B5+F5+H5),'Manual Inputs'!$C$11))","v":""},{"$f":"IF(ISBLANK(A5),\"\",IF((C5+G5+I5)>'Manual Inputs'!$C$11,(C5+G5+I5),'Manual Inputs'!$C$11))","v":""}]
[null,null,null,null,null,{"$f":"IF(ISBLANK(A6),\"\",IF(ISNUMBER(SEARCH(\"cut\",D6,10)),'Manual Inputs'!$C$5,\"0\"))","v":""},{"$f":"IF(ISBLANK(B6),\"\",IF(ISNUMBER(SEARCH(\"cut\",E6,10)),'Manual Inputs'!$C$5,\"0\"))","v":""},{"$f":"IF(ISBLANK(A6),\"\",IF(ISNUMBER(SEARCH(\"cut\",D6,10)),'Manual Inputs'!$C$7,IF(ISNUMBER(SEARCH(\"fill\",D6,10)),'Manual Inputs'!$C$9,\"0\")))","v":""},{"$f":"IF(ISBLANK(A6),\"\",IF(ISNUMBER(SEARCH(\"cut\",E6,10)),'Manual Inputs'!$C$7,IF(ISNUMBER(SEARCH(\"fill\",E6,10)),'Manual Inputs'!$C$9,\"0\")))","v":""},{"$f":"IF(ISBLANK(A6),\"\",IF((B6+F6+H6)>'Manual Inputs'!$C$11,(B6+F6+H6),'Manual Inputs'!$C$11))","v":""},{"$f":"IF(ISBLANK(A6),\"\",IF((C6+G6+I6)>'Manual Inputs'!$C$11,(C6+G6+I6),'Manual Inputs'!$C$11))","v":""}]
[null,null,null,null,null,{"$f":"IF(ISBLANK(A7),\"\",IF(ISNUMBER(SEARCH(\"cut\",D7,10)),'Manual Inputs'!$C$5,\"0\"))","v":""},{"$f":"IF(ISBLANK(B7),\"\",IF(ISNUMBER(SEARCH(\"cut\",E7,10)),'Manual Inputs'!$C$5,\"0\"))","v":""},{"$f":"IF(ISBLANK(A7),\"\",IF(ISNUMBER(SEARCH(\"cut\",D7,10)),'Manual Inputs'!$C$7,IF(ISNUMBER(SEARCH(\"fill\",D7,10)),'Manual Inputs'!$C$9,\"0\")))","v":""},{"$f":"IF(ISBLANK(A7),\"\",IF(ISNUMBER(SEARCH(\"cut\",E7,10)),'Manual Inputs'!$C$7,IF(ISNUMBER(SEARCH(\"fill\",E7,10)),'Manual Inputs'!$C$9,\"0\")))","v":""},{"$f":"IF(ISBLANK(A7),\"\",IF((B7+F7+H7)>'Manual Inputs'!$C$11,(B7+F7+H7),'Manual Inputs'!$C$11))","v":""},{"$f":"IF(ISBLANK(A7),\"\",IF((C7+G7+I7)>'Manual Inputs'!$C$11,(C7+G7+I7),'Manual Inputs'!$C$11))","v":""}]
[null,null,null,null,null,{"$f":"IF(ISBLANK(A8),\"\",IF(ISNUMBER(SEARCH(\"cut\",D8,10)),'Manual Inputs'!$C$5,\"0\"))","v":""},{"$f":"IF(ISBLANK(B8),\"\",IF(ISNUMBER(SEARCH(\"cut\",E8,10)),'Manual Inputs'!$C$5,\"0\"))","v":""},{"$f":"IF(ISBLANK(A8),\"\",IF(ISNUMBER(SEARCH(\"cut\",D8,10)),'Manual Inputs'!$C$7,IF(ISNUMBER(SEARCH(\"fill\",D8,10)),'Manual Inputs'!$C$9,\"0\")))","v":""},{"$f":"IF(ISBLANK(A8),\"\",IF(ISNUMBER(SEARCH(\"cut\",E8,10)),'Manual Inputs'!$C$7,IF(ISNUMBER(SEARCH(\"fill\",E8,10)),'Manual Inputs'!$C$9,\"0\")))","v":""},{"$f":"IF(ISBLANK(A8),\"\",IF((B8+F8+H8)>'Manual Inputs'!$C$11,(B8+F8+H8),'Manual Inputs'!$C$11))","v":""},{"$f":"IF(ISBLANK(A8),\"\",IF((C8+G8+I8)>'Manual Inputs'!$C$11,(C8+G8+I8),'Manual Inputs'!$C$11))","v":""}]
[null,null,null,null,null,{"$f":"IF(ISBLANK(A9),\"\",IF(ISNUMBER(SEARCH(\"cut\",D9,10)),'Manual Inputs'!$C$5,\"0\"))","v":""},{"$f":"IF(ISBLANK(B9),\"\",IF(ISNUMBER(SEARCH(\"cut\",E9,10)),'Manual Inputs'!$C$5,\"0\"))","v":""},{"$f":"IF(ISBLANK(A9),\"\",IF(ISNUMBER(SEARCH(\"cut\",D9,10)),'Manual Inputs'!$C$7,IF(ISNUMBER(SEARCH(\"fill\",D9,10)),'Manual Inputs'!$C$9,\"0\")))","v":""},{"$f":"IF(ISBLANK(A9),\"\",IF(ISNUMBER(SEARCH(\"cut\",E9,10)),'Manual Inputs'!$C$7,IF(ISNUMBER(SEARCH(\"fill\",E9,10)),'Manual Inputs'!$C$9,\"0\")))","v":""},{"$f":"IF(ISBLANK(A9),\"\",IF((B9+F9+H9)>'Manual Inputs'!$C$11,(B9+F9+H9),'Manual Inputs'!$C$11))","v":""},{"$f":"IF(ISBLANK(A9),\"\",IF((C9+G9+I9)>'Manual Inputs'!$C$11,(C9+G9+I9),'Manual Inputs'!$C$11))","v":""}]
[null,null,null,null,null,{"$f":"IF(ISBLANK(A10),\"\",IF(ISNUMBER(SEARCH(\"cut\",D10,10)),'Manual Inputs'!$C$5,\"0\"))","v":""},{"$f":"IF(ISBLANK(B10),\"\",IF(ISNUMBER(SEARCH(\"cut\",E10,10)),'Manual Inputs'!$C$5,\"0\"))","v":""},{"$f":"IF(ISBLANK(A10),\"\",IF(ISNUMBER(SEARCH(\"cut\",D10,10)),'Manual Inputs'!$C$7,IF(ISNUMBER(SEARCH(\"fill\",D10,10)),'Manual Inputs'!$C$9,\"0\")))","v":""},{"$f":"IF(ISBLANK(A10),\"\",IF(ISNUMBER(SEARCH(\"cut\",E10,10)),'Manual Inputs'!$C$7,IF(ISNUMBER(SEARCH(\"fill\",E10,10)),'Manual Inputs'!$C$9,\"0\")))","v":""},{"$f":"IF(ISBLANK(A10),\"\",IF((B10+F10+H10)>'Manual Inputs'!$C$11,(B10+F10+H10),'Manual Inputs'!$C$11))","v":""},{"$f":"IF(ISBLANK(A10),\"\",IF((C10+G10+I10)>'Manual Inputs'!$C$11,(C10+G10+I10),'Manual Inputs'!$C$11))","v":""}]
{"$rows_left_out":15}