{"text_format":"1","workbook":"xlsx","n_sheets":9,"sheets":["Instructions","Clearing Cross Section Report","Seeding_quantities report","Manual Inputs","Clearing","Seeding","Summary","Data","Clearing Calculations"],"not_rendered":{"charts":0,"images":7,"macros":1,"external_links":1,"defined_names":6,"comments":0,"pivot_tables":0},"unopened":[],"bounds":{"document_bytes":16777216,"sheet_cells":100000,"rows_first":2000,"rows_last":500,"rows_between":2000,"halvings":0,"cell_chars":16384,"cell_head_chars":4096},"cells_cut":0,"cells_raw":0,"read":"whole","date_system":"1900"}

{"sheet":"Instructions","index":0,"n_rows":51,"n_cols":3,"rows_kept":51,"cut":false,"hidden":false,"merged":[[13,2,17,2]]}
[]
[null,"Instructions - Clearing"]
[null,1,"Draw cross section named boundaries for area that needs reported."]
[null,2,"Run the cross section report from:  OpenRoads Modeling>Home>Model Analysis and Reporting>Civil Analysis>Cross Section Report"]
[null,null,"Select the cross section named boundary"]
[null,null,"Change Which Features to Selection"]
[null,null,"Select the 3D cut/fill lines; make sure to get all of them"]
[null,3,"In the report window select Evaluation>CrossSectionGradebookfromCL.xsl"]
[null,null,"Right click on the report and select export to excel"]
[]
[null,4,"Select entire sheet in the cross section excel spreadsheet.  (CTRL-A or select the select all button)"]
[null,5,"Paste data in the Clearing Cross Section Report tab in the clearing summary spreadsheet."]
[null,6,"Go to the \"Manual Inputs\" page and click on the \"Click Here to Format Worksheet\" button.  Add any additional clearing here"]
[]
[]
[]
[]
[]
[]
[null,"Instructions - Seeding"]
[null,1,"Run Quantities by Named boundary report"]
[null,2,"Right click on the report in ORD and select Export to Excel"]
[null,3,"Select entire sheet in the named boundary excel spreadsheet.  (CTRL-A or select the select all button)"]
[null,4,"Go to the \"Manual Inputs\" page and click on the \"Click Here to Format Worksheet\" button."]
[null,5,"Use the rows to create the table at the right.  Cut and paste or reference these to the Summary tab"]
[]
[]
[]
[null,"ADDING PAY ITEMS"]
[null,1,"On the Summary Tab, click the \"Browse for Pay Item\" button, hit the \"Browse for Pay Item File\" in the dialog box and browse to N:\\CFL-DPIT\\Excel\\PayItems14.csv and select \"Open\" or if you downloaded the file off the network browse to the location to where it was saved."]
[null,null,"Click the \"Return to Excel\" button."]
[]
[null,2,"On the Summary Tab, click the \"Add/Remove Pay Items\" button."]
[null,null,"Pay items are broken out by pay item categories.  Choose the desired pay item category."]
[null,null,"Select the desired pay item and select \"Add Item\".  Repeat for all required pay items."]
[null,null,"To remove pay items click the \"Delete a pay item already placed in sheet\" button and select the desired pay item and click the \"delete item\" button.  Click the \"Close\" button to close the dialog box."]
[null,null,"When all desired pay items have been added click the \"Close\" button."]
[]
[null,3,"Add station ranges and quantities.  Add and remove schedules to tables using the buttons at the top of the Summary tab.  Hide and unhide rows to tables using the buttons at the top of the Summary tab.  Merge and center title over the entire table width."]
[]
[null,4,"Using the Engineer's Estimate Manual (http://www.cflhd.gov/resources/design/eeprog/documents/EE_Guidance_Manual.pdf    ), determine the correct rounding % and round up values for each item."]
[]
[]
[]
[]
[]
[]
[]
[]
[null,null,"The Bid schedule and allowance quantities will be automatically calculated at the bottom but should not be included in tabulation sheets."]
[null,5,"DO NOT MANUALLY ADD ANY COLUMNS TO THE SPREADSHEET."]

{"sheet":"Clearing Cross Section Report","index":1,"n_rows":0,"n_cols":0,"rows_kept":0,"cut":false,"hidden":false,"merged":[]}

{"sheet":"Seeding_quantities report","index":2,"n_rows":0,"n_cols":0,"rows_kept":0,"cut":false,"hidden":false,"merged":[]}

{"sheet":"Manual Inputs","index":3,"n_rows":11,"n_cols":13,"rows_kept":11,"cut":false,"hidden":false,"merged":[[1,1,1,3],[1,8,1,12]]}
[]
[null,"Clearing Report Values",null,null,null,null,null,null,"Seeding Report Values"]
[null,null,null,null,null,null,null,null,"Number of Rows",null,null,null,"Station Range"]
[null,null,null,null,null,null,null,null,{"$f":"LOOKUP(2,1/('Seeding_quantities report'!A:A<>\"\"),ROW('Seeding_quantities report'!A:A))","v":{"$error":"#N/A"}},null,null,"Add Starting Station",0]
[null,"Cut Slope Rounding",5,"ft",null,null,null,null,null,null,null,null,725]
[null,null,null,null,null,null,null,null,null,null,null,null,1450]
[null,"Additional Clearing in Cut",5,"ft"]
[]
[null,"Additonal Clearing in Fill",5,"ft"]
[]
[null,"Minimum Clearing Width",0,"ft"]

{"sheet":"Clearing","index":4,"n_rows":2000,"n_cols":17,"rows_kept":2000,"cut":false,"hidden":false,"merged":[[7,9,7,10],[6,9,6,10],[5,4,6,4],[5,6,6,6],[5,5,6,5],[0,9,5,9],[0,10,5,10],[2,1,2,4],[5,1,6,2],[5,3,6,3]]}
[null,null,null,null,null,null,null,null,null,"<---Type Beginning Row Number","<---Automatic calculates except for last row"]
["NOTE TO DESIGNER:  Input data into yellow-shaded columns only."]
[null,null,null,null,null,null,43560]
["TOTALS",{"$f":"SUM(B9:B2000)","v":{"$error":"#VALUE!"}},{"$f":"SUM(C9:C2000)","v":{"$error":"#VALUE!"}},{"$error":"#VALUE!"},0,0,0]
[]
[null,null,null,"Total","Total Area (SQFT)","Total Area (SQYD)","Total Area (acre)"]
[null,null,null,null,null,null,null,null,null,"Rows from"]
["Station to Station","Clearing Distance LT","Clearing Distance RT","Total Clearing (FT)","Area","Area","Area",null,null,"Clearing",null,null,null,null,"ACRE","SQFT","SQYD"]
[{"$f":"IF('Clearing Calculations'!A3=\"\",\"\",'Clearing Calculations'!A3)","v":{"$error":"#VALUE!"}},{"$f":"IF('Clearing Calculations'!A3,'Clearing Calculations'!J3,\"\")","v":{"$error":"#VALUE!"}},{"$f":"IF('Clearing Calculations'!A3,'Clearing Calculations'!K3,\"\")","v":{"$error":"#VALUE!"}},{"$f":"IF(A9=\"\",\"\",$B9+$C9)","v":{"$error":"#VALUE!"}},null,null,"",null,null,null,null,"Station","to","Station","Clearing","Clearing","Clearing"]
[{"$f":"IF('Clearing Calculations'!A4=\"\",\"\",'Clearing Calculations'!A4)","v":""},{"$f":"IF('Clearing Calculations'!A4,'Clearing Calculations'!J4,\"\")","v":""},{"$f":"IF('Clearing Calculations'!A4,'Clearing Calculations'!K4,\"\")","v":""},{"$f":"IF(A10=\"\",\"\",$B10+$C10)","v":""},{"$f":"IF(A10=\"\",\"\",(D10+D9)/2*(A10-A9))","v":""},{"$f":"IF(A10=\"\",\"\",(E10/9))","v":""},{"$f":"IF(A10=\"\",\"\",E10/$G$3)","v":""},null,null,null,{"$f":"IF(J11=\"\",\"\",+J11-1)","v":""},{"$f":"IF(J10=\"\",\"\",INDIRECT(CONCATENATE($J$8,\"!\",\"A\",J10)))","v":""},{"$f":"IF(J10=\"\",\"\",\"-\")","v":""},{"$f":"IF(J10=\"\",\"\",INDIRECT(CONCATENATE($J$8,\"!\",\"A\",K10)))","v":""},{"$f":"IF(J10=\"\",\"\",ROUND(SUM(INDIRECT(CONCATENATE($J$8,\"!\",\"G\",$J10,\":\",\"G\",$K10))),4))","v":""},{"$f":"IF(K10=\"\",\"\",ROUND(SUM(INDIRECT(CONCATENATE($J$8,\"!\",\"E\",$J10,\":\",\"E\",$K10))),0))","v":""},{"$f":"IF(L10=\"\",\"\",ROUND(SUM(INDIRECT(CONCATENATE($J$8,\"!\",\"f\",$J10,\":\",\"f\",$K10))),0))","v":""}]
[{"$f":"IF('Clearing Calculations'!A5=\"\",\"\",'Clearing Calculations'!A5)","v":""},{"$f":"IF('Clearing Calculations'!A5,'Clearing Calculations'!J5,\"\")","v":""},{"$f":"IF('Clearing Calculations'!A5,'Clearing Calculations'!K5,\"\")","v":""},"","","","",null,null,null,{"$f":"IF(J12=\"\",\"\",+J12-1)","v":""},{"$f":"IF(J11=\"\",\"\",INDIRECT(CONCATENATE($J$8,\"!\",\"A\",J11-1)))","v":""},{"$f":"IF(J11=\"\",\"\",\"-\")","v":""},{"$f":"IF(J11=\"\",\"\",INDIRECT(CONCATENATE($J$8,\"!\",\"A\",K11)))","v":""},{"$f":"IF(J11=\"\",\"\",ROUND(SUM(INDIRECT(CONCATENATE($J$8,\"!\",\"G\",$J11,\":\",\"G\",$K11))),4))","v":""},{"$f":"IF(K11=\"\",\"\",ROUND(SUM(INDIRECT(CONCATENATE($J$8,\"!\",\"E\",$J11,\":\",\"E\",$K11))),0))","v":""},{"$f":"IF(L11=\"\",\"\",ROUND(SUM(INDIRECT(CONCATENATE($J$8,\"!\",\"f\",$J11,\":\",\"f\",$K11))),0))","v":""}]
[{"$f":"IF('Clearing Calculations'!A6=\"\",\"\",'Clearing Calculations'!A6)","v":""},{"$f":"IF('Clearing Calculations'!A6,'Clearing Calculations'!J6,\"\")","v":""},{"$f":"IF('Clearing Calculations'!A6,'Clearing Calculations'!K6,\"\")","v":""},"","","","",null,null,null,{"$f":"IF(J13=\"\",\"\",+J13-1)","v":""},{"$f":"IF(J12=\"\",\"\",INDIRECT(CONCATENATE($J$8,\"!\",\"A\",J12-1)))","v":""},"","","","",""]
[{"$f":"IF('Clearing Calculations'!A7=\"\",\"\",'Clearing Calculations'!A7)","v":""},{"$f":"IF('Clearing Calculations'!A7,'Clearing Calculations'!J7,\"\")","v":""},{"$f":"IF('Clearing Calculations'!A7,'Clearing Calculations'!K7,\"\")","v":""},"","","","",null,null,null,"","","","","","",""]
[{"$f":"IF('Clearing Calculations'!A8=\"\",\"\",'Clearing Calculations'!A8)","v":""},{"$f":"IF('Clearing Calculations'!A8,'Clearing Calculations'!J8,\"\")","v":""},{"$f":"IF('Clearing Calculations'!A8,'Clearing Calculations'!K8,\"\")","v":""},"","","","",null,null,null,"","","","","","",""]
[{"$f":"IF('Clearing Calculations'!A9=\"\",\"\",'Clearing Calculations'!A9)","v":""},{"$f":"IF('Clearing Calculations'!A9,'Clearing Calculations'!J9,\"\")","v":""},{"$f":"IF('Clearing Calculations'!A9,'Clearing Calculations'!K9,\"\")","v":""},"","","","",null,null,null,"","","","","","",""]
[{"$f":"IF('Clearing Calculations'!A10=\"\",\"\",'Clearing Calculations'!A10)","v":""},{"$f":"IF('Clearing Calculations'!A10,'Clearing Calculations'!J10,\"\")","v":""},{"$f":"IF('Clearing Calculations'!A10,'Clearing Calculations'!K10,\"\")","v":""},"","","","",null,null,null,"","","","","","",""]
[{"$f":"IF('Clearing Calculations'!A11=\"\",\"\",'Clearing Calculations'!A11)","v":""},{"$f":"IF('Clearing Calculations'!A11,'Clearing Calculations'!J11,\"\")","v":""},{"$f":"IF('Clearing Calculations'!A11,'Clearing Calculations'!K11,\"\")","v":""},"","","","",null,null,null,"","","","","","",""]
[{"$f":"IF('Clearing Calculations'!A12=\"\",\"\",'Clearing Calculations'!A12)","v":""},{"$f":"IF('Clearing Calculations'!A12,'Clearing Calculations'!J12,\"\")","v":""},{"$f":"IF('Clearing Calculations'!A12,'Clearing Calculations'!K12,\"\")","v":""},"","","","",null,null,null,"","","","","","",""]
[{"$f":"IF('Clearing Calculations'!A13=\"\",\"\",'Clearing Calculations'!A13)","v":""},{"$f":"IF('Clearing Calculations'!A13,'Clearing Calculations'!J13,\"\")","v":""},{"$f":"IF('Clearing Calculations'!A13,'Clearing Calculations'!K13,\"\")","v":""},"","","","",null,null,null,"","","","","","",""]
[{"$f":"IF('Clearing Calculations'!A14=\"\",\"\",'Clearing Calculations'!A14)","v":""},{"$f":"IF('Clearing Calculations'!A14,'Clearing Calculations'!J14,\"\")","v":""},{"$f":"IF('Clearing Calculations'!A14,'Clearing Calculations'!K14,\"\")","v":""},"","","","",null,null,null,"","","","","","",""]
[{"$f":"IF('Clearing Calculations'!A15=\"\",\"\",'Clearing Calculations'!A15)","v":""},{"$f":"IF('Clearing Calculations'!A15,'Clearing Calculations'!J15,\"\")","v":""},{"$f":"IF('Clearing Calculations'!A15,'Clearing Calculations'!K15,\"\")","v":""},"","","","",null,null,null,"","","","","","",""]
[{"$f":"IF('Clearing Calculations'!A16=\"\",\"\",'Clearing Calculations'!A16)","v":""},{"$f":"IF('Clearing Calculations'!A16,'Clearing Calculations'!J16,\"\")","v":""},{"$f":"IF('Clearing Calculations'!A16,'Clearing Calculations'!K16,\"\")","v":""},"","","","",null,null,null,"","","","","","",""]
[{"$f":"IF('Clearing Calculations'!A17=\"\",\"\",'Clearing Calculations'!A17)","v":""},{"$f":"IF('Clearing Calculations'!A17,'Clearing Calculations'!J17,\"\")","v":""},{"$f":"IF('Clearing Calculations'!A17,'Clearing Calculations'!K17,\"\")","v":""},{"$f":"IF(A23=\"\",\"\",$B23+$C23)","v":""},{"$f":"IF(A23=\"\",\"\",(D23+D22)/2*(A23-A22))","v":""},{"$f":"IF(A23=\"\",\"\",(E23/9))","v":""},{"$f":"IF(A23=\"\",\"\",E23/$G$3)","v":""},null,null,null,"","","","","","",""]
[{"$f":"IF('Clearing Calculations'!A18=\"\",\"\",'Clearing Calculations'!A18)","v":""},{"$f":"IF('Clearing Calculations'!A18,'Clearing Calculations'!J18,\"\")","v":""},{"$f":"IF('Clearing Calculations'!A18,'Clearing Calculations'!K18,\"\")","v":""},"","","","",null,null,null,"","","","","","",""]
[{"$f":"IF('Clearing Calculations'!A19=\"\",\"\",'Clearing Calculations'!A19)","v":""},{"$f":"IF('Clearing Calculations'!A19,'Clearing Calculations'!J19,\"\")","v":""},{"$f":"IF('Clearing Calculations'!A19,'Clearing Calculations'!K19,\"\")","v":""},"","","","",null,null,null,"","","","","","",""]
[{"$f":"IF('Clearing Calculations'!A20=\"\",\"\",'Clearing Calculations'!A20)","v":""},{"$f":"IF('Clearing Calculations'!A20,'Clearing Calculations'!J20,\"\")","v":""},{"$f":"IF('Clearing Calculations'!A20,'Clearing Calculations'!K20,\"\")","v":""},"","","","",null,null,null,"","","","","","",""]
[{"$f":"IF('Clearing Calculations'!A21=\"\",\"\",'Clearing Calculations'!A21)","v":""},{"$f":"IF('Clearing Calculations'!A21,'Clearing Calculations'!J21,\"\")","v":""},{"$f":"IF('Clearing Calculations'!A21,'Clearing Calculations'!K21,\"\")","v":""},"","","","",null,null,null,"","","","","","",""]
[{"$f":"IF('Clearing Calculations'!A22=\"\",\"\",'Clearing Calculations'!A22)","v":""},{"$f":"IF('Clearing Calculations'!A22,'Clearing Calculations'!J22,\"\")","v":""},{"$f":"IF('Clearing Calculations'!A22,'Clearing Calculations'!K22,\"\")","v":""},"","","","",null,null,null,"","","","","","",""]
[{"$f":"IF('Clearing Calculations'!A23=\"\",\"\",'Clearing Calculations'!A23)","v":""},{"$f":"IF('Clearing Calculations'!A23,'Clearing Calculations'!J23,\"\")","v":""},{"$f":"IF('Clearing Calculations'!A23,'Clearing Calculations'!K23,\"\")","v":""},"","","","",null,null,null,"","","","","","",""]
[{"$f":"IF('Clearing Calculations'!A24=\"\",\"\",'Clearing Calculations'!A24)","v":""},{"$f":"IF('Clearing Calculations'!A24,'Clearing Calculations'!J24,\"\")","v":""},{"$f":"IF('Clearing Calculations'!A24,'Clearing Calculations'!K24,\"\")","v":""},"","","","",null,null,null,"","","","","","",""]
[{"$f":"IF('Clearing Calculations'!A25=\"\",\"\",'Clearing Calculations'!A25)","v":""},{"$f":"IF('Clearing Calculations'!A25,'Clearing Calculations'!J25,\"\")","v":""},{"$f":"IF('Clearing Calculations'!A25,'Clearing Calculations'!K25,\"\")","v":""},"","","","",null,null,null,"","","","","","",""]
[{"$f":"IF('Clearing Calculations'!A26=\"\",\"\",'Clearing Calculations'!A26)","v":""},{"$f":"IF('Clearing Calculations'!A26,'Clearing Calculations'!J26,\"\")","v":""},{"$f":"IF('Clearing Calculations'!A26,'Clearing Calculations'!K26,\"\")","v":""},"","","","",null,null,null,"","","","","","",""]
[{"$f":"IF('Clearing Calculations'!A27=\"\",\"\",'Clearing Calculations'!A27)","v":""},{"$f":"IF('Clearing Calculations'!A27,'Clearing Calculations'!J27,\"\")","v":""},{"$f":"IF('Clearing Calculations'!A27,'Clearing Calculations'!K27,\"\")","v":""},"","","","",null,null,null,"","","","","","",""]
[{"$f":"IF('Clearing Calculations'!A28=\"\",\"\",'Clearing Calculations'!A28)","v":""},{"$f":"IF('Clearing Calculations'!A28,'Clearing Calculations'!J28,\"\")","v":""},{"$f":"IF('Clearing Calculations'!A28,'Clearing Calculations'!K28,\"\")","v":""},"","","","",null,null,null,"",{"$f":"IF(J34=\"\",\"\",INDIRECT(CONCATENATE($J$8,\"!\",\"A\",J34-1)))","v":""},"","","","",""]
[{"$f":"IF('Clearing Calculations'!A29=\"\",\"\",'Clearing Calculations'!A29)","v":""},{"$f":"IF('Clearing Calculations'!A29,'Clearing Calculations'!J29,\"\")","v":""},{"$f":"IF('Clearing Calculations'!A29,'Clearing Calculations'!K29,\"\")","v":""},"","","","",null,null,null,"","","","","","",""]
[{"$f":"IF('Clearing Calculations'!A30=\"\",\"\",'Clearing Calculations'!A30)","v":""},{"$f":"IF('Clearing Calculations'!A30,'Clearing Calculations'!J30,\"\")","v":""},{"$f":"IF('Clearing Calculations'!A30,'Clearing Calculations'!K30,\"\")","v":""},"","","","",null,null,null,"","","","","","",""]
[{"$f":"IF('Clearing Calculations'!A31=\"\",\"\",'Clearing Calculations'!A31)","v":""},{"$f":"IF('Clearing Calculations'!A31,'Clearing Calculations'!J31,\"\")","v":""},{"$f":"IF('Clearing Calculations'!A31,'Clearing Calculations'!K31,\"\")","v":""},"","","","",null,null,null,"","","","","","",""]
[{"$f":"IF('Clearing Calculations'!A32=\"\",\"\",'Clearing Calculations'!A32)","v":""},{"$f":"IF('Clearing Calculations'!A32,'Clearing Calculations'!J32,\"\")","v":""},{"$f":"IF('Clearing Calculations'!A32,'Clearing Calculations'!K32,\"\")","v":""},"","","","",null,null,null,"","","","","","",""]
[{"$f":"IF('Clearing Calculations'!A33=\"\",\"\",'Clearing Calculations'!A33)","v":""},{"$f":"IF('Clearing Calculations'!A33,'Clearing Calculations'!J33,\"\")","v":""},{"$f":"IF('Clearing Calculations'!A33,'Clearing Calculations'!K33,\"\")","v":""},"","","","",null,null,null,"","","","","","",""]
[{"$f":"IF('Clearing Calculations'!A34=\"\",\"\",'Clearing Calculations'!A34)","v":""},{"$f":"IF('Clearing Calculations'!A34,'Clearing Calculations'!J34,\"\")","v":""},{"$f":"IF('Clearing Calculations'!A34,'Clearing Calculations'!K34,\"\")","v":""},"","","","",null,null,null,"","","","","","",""]
[{"$f":"IF('Clearing Calculations'!A35=\"\",\"\",'Clearing Calculations'!A35)","v":""},{"$f":"IF('Clearing Calculations'!A35,'Clearing Calculations'!J35,\"\")","v":""},{"$f":"IF('Clearing Calculations'!A35,'Clearing Calculations'!K35,\"\")","v":""},"","","","",null,null,null,"","","","","","",""]
[{"$f":"IF('Clearing Calculations'!A36=\"\",\"\",'Clearing Calculations'!A36)","v":""},{"$f":"IF('Clearing Calculations'!A36,'Clearing Calculations'!J36,\"\")","v":""},{"$f":"IF('Clearing Calculations'!A36,'Clearing Calculations'!K36,\"\")","v":""},"","","","",null,null,null,"","","","","","",""]
[{"$f":"IF('Clearing Calculations'!A37=\"\",\"\",'Clearing Calculations'!A37)","v":""},{"$f":"IF('Clearing Calculations'!A37,'Clearing Calculations'!J37,\"\")","v":""},{"$f":"IF('Clearing Calculations'!A37,'Clearing Calculations'!K37,\"\")","v":""},"","","","",null,null,null,"","","","","","",""]
[{"$f":"IF('Clearing Calculations'!A38=\"\",\"\",'Clearing Calculations'!A38)","v":""},{"$f":"IF('Clearing Calculations'!A38,'Clearing Calculations'!J38,\"\")","v":""},{"$f":"IF('Clearing Calculations'!A38,'Clearing Calculations'!K38,\"\")","v":""},"","","","",null,null,null,"","","","","","",""]
[{"$f":"IF('Clearing Calculations'!A39=\"\",\"\",'Clearing Calculations'!A39)","v":""},{"$f":"IF('Clearing Calculations'!A39,'Clearing Calculations'!J39,\"\")","v":""},{"$f":"IF('Clearing Calculations'!A39,'Clearing Calculations'!K39,\"\")","v":""},"","","","",null,null,null,"","","","","","",""]
[{"$f":"IF('Clearing Calculations'!A40=\"\",\"\",'Clearing Calculations'!A40)","v":""},{"$f":"IF('Clearing Calculations'!A40,'Clearing Calculations'!J40,\"\")","v":""},{"$f":"IF('Clearing Calculations'!A40,'Clearing Calculations'!K40,\"\")","v":""},"","","","",null,null,null,"","","","","","",""]
[{"$f":"IF('Clearing Calculations'!A41=\"\",\"\",'Clearing Calculations'!A41)","v":""},{"$f":"IF('Clearing Calculations'!A41,'Clearing Calculations'!J41,\"\")","v":""},{"$f":"IF('Clearing Calculations'!A41,'Clearing Calculations'!K41,\"\")","v":""},"","","","",null,null,null,"","","","","","",""]
[{"$f":"IF('Clearing Calculations'!A42=\"\",\"\",'Clearing Calculations'!A42)","v":""},{"$f":"IF('Clearing Calculations'!A42,'Clearing Calculations'!J42,\"\")","v":""},{"$f":"IF('Clearing Calculations'!A42,'Clearing Calculations'!K42,\"\")","v":""},"","","","",null,null,null,"","","","","","",""]
[{"$f":"IF('Clearing Calculations'!A43=\"\",\"\",'Clearing Calculations'!A43)","v":""},{"$f":"IF('Clearing Calculations'!A43,'Clearing Calculations'!J43,\"\")","v":""},{"$f":"IF('Clearing Calculations'!A43,'Clearing Calculations'!K43,\"\")","v":""},"","","","",null,null,null,"","","","","","",""]
[{"$f":"IF('Clearing Calculations'!A44=\"\",\"\",'Clearing Calculations'!A44)","v":""},{"$f":"IF('Clearing Calculations'!A44,'Clearing Calculations'!B44,\"\")","v":""},{"$f":"IF('Clearing Calculations'!A44,'Clearing Calculations'!C44,\"\")","v":""},{"$f":"IF(A50=\"\",\"\",$B50+$C50)","v":""},{"$f":"IF(A50=\"\",\"\",(D50+D49)/2*(A50-A49))","v":""},{"$f":"IF(A50=\"\",\"\",(E50/9))","v":""},{"$f":"IF(A50=\"\",\"\",E50/$G$3)","v":""}]
[{"$f":"IF('Clearing Calculations'!A45=\"\",\"\",'Clearing Calculations'!A45)","v":""},{"$f":"IF('Clearing Calculations'!A45,'Clearing Calculations'!B45,\"\")","v":""},{"$f":"IF('Clearing Calculations'!A45,'Clearing Calculations'!C45,\"\")","v":""},"","","",""]
[{"$f":"IF('Clearing Calculations'!A46=\"\",\"\",'Clearing Calculations'!A46)","v":""},{"$f":"IF('Clearing Calculations'!A46,'Clearing Calculations'!B46,\"\")","v":""},{"$f":"IF('Clearing Calculations'!A46,'Clearing Calculations'!C46,\"\")","v":""},"","","",""]
[{"$f":"IF('Clearing Calculations'!A47=\"\",\"\",'Clearing Calculations'!A47)","v":""},{"$f":"IF('Clearing Calculations'!A47,'Clearing Calculations'!B47,\"\")","v":""},{"$f":"IF('Clearing Calculations'!A47,'Clearing Calculations'!C47,\"\")","v":""},"","","",""]
[{"$f":"IF('Clearing Calculations'!A48=\"\",\"\",'Clearing Calculations'!A48)","v":""},{"$f":"IF('Clearing Calculations'!A48,'Clearing Calculations'!B48,\"\")","v":""},{"$f":"IF('Clearing Calculations'!A48,'Clearing Calculations'!C48,\"\")","v":""},"","","",""]
[{"$f":"IF('Clearing Calculations'!A49=\"\",\"\",'Clearing Calculations'!A49)","v":""},{"$f":"IF('Clearing Calculations'!A49,'Clearing Calculations'!B49,\"\")","v":""},{"$f":"IF('Clearing Calculations'!A49,'Clearing Calculations'!C49,\"\")","v":""},"","","",""]
[{"$f":"IF('Clearing Calculations'!A50=\"\",\"\",'Clearing Calculations'!A50)","v":""},{"$f":"IF('Clearing Calculations'!A50,'Clearing Calculations'!B50,\"\")","v":""},{"$f":"IF('Clearing Calculations'!A50,'Clearing Calculations'!C50,\"\")","v":""},"","","",""]
[{"$f":"IF('Clearing Calculations'!A51=\"\",\"\",'Clearing Calculations'!A51)","v":""},{"$f":"IF('Clearing Calculations'!A51,'Clearing Calculations'!B51,\"\")","v":""},{"$f":"IF('Clearing Calculations'!A51,'Clearing Calculations'!C51,\"\")","v":""},"","","",""]
[{"$f":"IF('Clearing Calculations'!A52=\"\",\"\",'Clearing Calculations'!A52)","v":""},{"$f":"IF('Clearing Calculations'!A52,'Clearing Calculations'!B52,\"\")","v":""},{"$f":"IF('Clearing Calculations'!A52,'Clearing Calculations'!C52,\"\")","v":""},"","","",""]
[{"$f":"IF('Clearing Calculations'!A53=\"\",\"\",'Clearing Calculations'!A53)","v":""},{"$f":"IF('Clearing Calculations'!A53,'Clearing Calculations'!B53,\"\")","v":""},{"$f":"IF('Clearing Calculations'!A53,'Clearing Calculations'!C53,\"\")","v":""},"","","",""]
[{"$f":"IF('Clearing Calculations'!A54=\"\",\"\",'Clearing Calculations'!A54)","v":""},{"$f":"IF('Clearing Calculations'!A54,'Clearing Calculations'!B54,\"\")","v":""},{"$f":"IF('Clearing Calculations'!A54,'Clearing Calculations'!C54,\"\")","v":""},"","","",""]
[{"$f":"IF('Clearing Calculations'!A55=\"\",\"\",'Clearing Calculations'!A55)","v":""},{"$f":"IF('Clearing Calculations'!A55,'Clearing Calculations'!B55,\"\")","v":""},{"$f":"IF('Clearing Calculations'!A55,'Clearing Calculations'!C55,\"\")","v":""},"","","",""]
[{"$f":"IF('Clearing Calculations'!A56=\"\",\"\",'Clearing Calculations'!A56)","v":""},{"$f":"IF('Clearing Calculations'!A56,'Clearing Calculations'!B56,\"\")","v":""},{"$f":"IF('Clearing Calculations'!B56,'Clearing Calculations'!C56,\"\")","v":""},"","","",""]
[{"$f":"IF('Clearing Calculations'!A57=\"\",\"\",'Clearing Calculations'!A57)","v":""},{"$f":"IF('Clearing Calculations'!A57,'Clearing Calculations'!B57,\"\")","v":""},{"$f":"IF('Clearing Calculations'!B57,'Clearing Calculations'!C57,\"\")","v":""},"","","",""]
[{"$f":"IF('Clearing Calculations'!A58=\"\",\"\",'Clearing Calculations'!A58)","v":""},{"$f":"IF('Clearing Calculations'!A58,'Clearing Calculations'!B58,\"\")","v":""},{"$f":"IF('Clearing Calculations'!B58,'Clearing Calculations'!C58,\"\")","v":""},"","","",""]
[{"$f":"IF('Clearing Calculations'!A59=\"\",\"\",'Clearing Calculations'!A59)","v":""},{"$f":"IF('Clearing Calculations'!A59,'Clearing Calculations'!B59,\"\")","v":""},{"$f":"IF('Clearing Calculations'!B59,'Clearing Calculations'!C59,\"\")","v":""},"","","",""]
[{"$f":"IF('Clearing Calculations'!A60=\"\",\"\",'Clearing Calculations'!A60)","v":""},{"$f":"IF('Clearing Calculations'!A60,'Clearing Calculations'!B60,\"\")","v":""},{"$f":"IF('Clearing Calculations'!B60,'Clearing Calculations'!C60,\"\")","v":""},"","","",""]
[{"$f":"IF('Clearing Calculations'!A61=\"\",\"\",'Clearing Calculations'!A61)","v":""},{"$f":"IF('Clearing Calculations'!A61,'Clearing Calculations'!B61,\"\")","v":""},{"$f":"IF('Clearing Calculations'!B61,'Clearing Calculations'!C61,\"\")","v":""},"","","",""]
[{"$f":"IF('Clearing Calculations'!A62=\"\",\"\",'Clearing Calculations'!A62)","v":""},{"$f":"IF('Clearing Calculations'!A62,'Clearing Calculations'!B62,\"\")","v":""},{"$f":"IF('Clearing Calculations'!B62,'Clearing Calculations'!C62,\"\")","v":""},"","","",""]
[{"$f":"IF('Clearing Calculations'!A63=\"\",\"\",'Clearing Calculations'!A63)","v":""},{"$f":"IF('Clearing Calculations'!A63,'Clearing Calculations'!B63,\"\")","v":""},{"$f":"IF('Clearing Calculations'!B63,'Clearing Calculations'!C63,\"\")","v":""},"","","",""]
[{"$f":"IF('Clearing Calculations'!A64=\"\",\"\",'Clearing Calculations'!A64)","v":""},{"$f":"IF('Clearing Calculations'!A64,'Clearing Calculations'!B64,\"\")","v":""},{"$f":"IF('Clearing Calculations'!B64,'Clearing Calculations'!C64,\"\")","v":""},"","","",""]
[{"$f":"IF('Clearing Calculations'!A65=\"\",\"\",'Clearing Calculations'!A65)","v":""},{"$f":"IF('Clearing Calculations'!A65,'Clearing Calculations'!B65,\"\")","v":""},{"$f":"IF('Clearing Calculations'!B65,'Clearing Calculations'!C65,\"\")","v":""},"","","",""]
[{"$f":"IF('Clearing Calculations'!A66=\"\",\"\",'Clearing Calculations'!A66)","v":""},{"$f":"IF('Clearing Calculations'!A66,'Clearing Calculations'!B66,\"\")","v":""},{"$f":"IF('Clearing Calculations'!B66,'Clearing Calculations'!C66,\"\")","v":""},"","","",""]
[{"$f":"IF('Clearing Calculations'!A67=\"\",\"\",'Clearing Calculations'!A67)","v":""},{"$f":"IF('Clearing Calculations'!A67,'Clearing Calculations'!B67,\"\")","v":""},{"$f":"IF('Clearing Calculations'!B67,'Clearing Calculations'!C67,\"\")","v":""},"","","",""]
[{"$f":"IF('Clearing Calculations'!A68=\"\",\"\",'Clearing Calculations'!A68)","v":""},{"$f":"IF('Clearing Calculations'!A68,'Clearing Calculations'!B68,\"\")","v":""},{"$f":"IF('Clearing Calculations'!B68,'Clearing Calculations'!C68,\"\")","v":""},"","","",""]
[{"$f":"IF('Clearing Calculations'!A69=\"\",\"\",'Clearing Calculations'!A69)","v":""},{"$f":"IF('Clearing Calculations'!A69,'Clearing Calculations'!B69,\"\")","v":""},{"$f":"IF('Clearing Calculations'!B69,'Clearing Calculations'!C69,\"\")","v":""},"","","",""]
[{"$f":"IF('Clearing Calculations'!A70=\"\",\"\",'Clearing Calculations'!A70)","v":""},{"$f":"IF('Clearing Calculations'!A70,'Clearing Calculations'!B70,\"\")","v":""},{"$f":"IF('Clearing Calculations'!B70,'Clearing Calculations'!C70,\"\")","v":""},"","","",""]
[{"$f":"IF('Clearing Calculations'!A71=\"\",\"\",'Clearing Calculations'!A71)","v":""},{"$f":"IF('Clearing Calculations'!A71,'Clearing Calculations'!B71,\"\")","v":""},{"$f":"IF('Clearing Calculations'!B71,'Clearing Calculations'!C71,\"\")","v":""},"","","",""]
[{"$f":"IF('Clearing Calculations'!A72=\"\",\"\",'Clearing Calculations'!A72)","v":""},{"$f":"IF('Clearing Calculations'!A72,'Clearing Calculations'!B72,\"\")","v":""},{"$f":"IF('Clearing Calculations'!B72,'Clearing Calculations'!C72,\"\")","v":""},"","","",""]
[{"$f":"IF('Clearing Calculations'!A73=\"\",\"\",'Clearing Calculations'!A73)","v":""},{"$f":"IF('Clearing Calculations'!A73,'Clearing Calculations'!B73,\"\")","v":""},{"$f":"IF('Clearing Calculations'!B73,'Clearing Calculations'!C73,\"\")","v":""},"","","",""]
[{"$f":"IF('Clearing Calculations'!A74=\"\",\"\",'Clearing Calculations'!A74)","v":""},{"$f":"IF('Clearing Calculations'!A74,'Clearing Calculations'!B74,\"\")","v":""},{"$f":"IF('Clearing Calculations'!B74,'Clearing Calculations'!C74,\"\")","v":""},"","","",""]
[{"$f":"IF('Clearing Calculations'!A75=\"\",\"\",'Clearing Calculations'!A75)","v":""},{"$f":"IF('Clearing Calculations'!A75,'Clearing Calculations'!B75,\"\")","v":""},{"$f":"IF('Clearing Calculations'!B75,'Clearing Calculations'!C75,\"\")","v":""},"","","",""]
[{"$f":"IF('Clearing Calculations'!A76=\"\",\"\",'Clearing Calculations'!A76)","v":""},{"$f":"IF('Clearing Calculations'!A76,'Clearing Calculations'!B76,\"\")","v":""},{"$f":"IF('Clearing Calculations'!B76,'Clearing Calculations'!C76,\"\")","v":""},"","","",""]
[{"$f":"IF('Clearing Calculations'!A77=\"\",\"\",'Clearing Calculations'!A77)","v":""},{"$f":"IF('Clearing Calculations'!A77,'Clearing Calculations'!B77,\"\")","v":""},{"$f":"IF('Clearing Calculations'!B77,'Clearing Calculations'!C77,\"\")","v":""},"","","",""]
[{"$f":"IF('Clearing Calculations'!A78=\"\",\"\",'Clearing Calculations'!A78)","v":""},{"$f":"IF('Clearing Calculations'!A78,'Clearing Calculations'!B78,\"\")","v":""},{"$f":"IF('Clearing Calculations'!B78,'Clearing Calculations'!C78,\"\")","v":""},"","","",""]
[{"$f":"IF('Clearing Calculations'!A79=\"\",\"\",'Clearing Calculations'!A79)","v":""},{"$f":"IF('Clearing Calculations'!A79,'Clearing Calculations'!B79,\"\")","v":""},{"$f":"IF('Clearing Calculations'!B79,'Clearing Calculations'!C79,\"\")","v":""},"","","",""]
[{"$f":"IF('Clearing Calculations'!A80=\"\",\"\",'Clearing Calculations'!A80)","v":""},{"$f":"IF('Clearing Calculations'!A80,'Clearing Calculations'!B80,\"\")","v":""},{"$f":"IF('Clearing Calculations'!B80,'Clearing Calculations'!C80,\"\")","v":""},"","","",""]
[{"$f":"IF('Clearing Calculations'!A81=\"\",\"\",'Clearing Calculations'!A81)","v":""},{"$f":"IF('Clearing Calculations'!A81,'Clearing Calculations'!B81,\"\")","v":""},{"$f":"IF('Clearing Calculations'!B81,'Clearing Calculations'!C81,\"\")","v":""},"","","",""]
[{"$f":"IF('Clearing Calculations'!A82=\"\",\"\",'Clearing Calculations'!A82)","v":""},{"$f":"IF('Clearing Calculations'!A82,'Clearing Calculations'!B82,\"\")","v":""},{"$f":"IF('Clearing Calculations'!B82,'Clearing Calculations'!C82,\"\")","v":""},"","","",""]
[{"$f":"IF('Clearing Calculations'!A83=\"\",\"\",'Clearing Calculations'!A83)","v":""},{"$f":"IF('Clearing Calculations'!A83,'Clearing Calculations'!B83,\"\")","v":""},{"$f":"IF('Clearing Calculations'!B83,'Clearing Calculations'!C83,\"\")","v":""},"","","",""]
[{"$f":"IF('Clearing Calculations'!A84=\"\",\"\",'Clearing Calculations'!A84)","v":""},{"$f":"IF('Clearing Calculations'!A84,'Clearing Calculations'!B84,\"\")","v":""},{"$f":"IF('Clearing Calculations'!B84,'Clearing Calculations'!C84,\"\")","v":""},"","","",""]
[{"$f":"IF('Clearing Calculations'!A85=\"\",\"\",'Clearing Calculations'!A85)","v":""},{"$f":"IF('Clearing Calculations'!A85,'Clearing Calculations'!B85,\"\")","v":""},{"$f":"IF('Clearing Calculations'!B85,'Clearing Calculations'!C85,\"\")","v":""},"","","",""]
[{"$f":"IF('Clearing Calculations'!A86=\"\",\"\",'Clearing Calculations'!A86)","v":""},{"$f":"IF('Clearing Calculations'!A86,'Clearing Calculations'!B86,\"\")","v":""},{"$f":"IF('Clearing Calculations'!B86,'Clearing Calculations'!C86,\"\")","v":""},"","","",""]
[{"$f":"IF('Clearing Calculations'!A87=\"\",\"\",'Clearing Calculations'!A87)","v":""},{"$f":"IF('Clearing Calculations'!A87,'Clearing Calculations'!B87,\"\")","v":""},{"$f":"IF('Clearing Calculations'!B87,'Clearing Calculations'!C87,\"\")","v":""},"","","",""]
[{"$f":"IF('Clearing Calculations'!A88=\"\",\"\",'Clearing Calculations'!A88)","v":""},{"$f":"IF('Clearing Calculations'!A88,'Clearing Calculations'!B88,\"\")","v":""},{"$f":"IF('Clearing Calculations'!B88,'Clearing Calculations'!C88,\"\")","v":""},"","","",""]
[{"$f":"IF('Clearing Calculations'!A89=\"\",\"\",'Clearing Calculations'!A89)","v":""},{"$f":"IF('Clearing Calculations'!A89,'Clearing Calculations'!B89,\"\")","v":""},{"$f":"IF('Clearing Calculations'!B89,'Clearing Calculations'!C89,\"\")","v":""},"","","",""]
[{"$f":"IF('Clearing Calculations'!A90=\"\",\"\",'Clearing Calculations'!A90)","v":""},{"$f":"IF('Clearing Calculations'!A90,'Clearing Calculations'!B90,\"\")","v":""},{"$f":"IF('Clearing Calculations'!B90,'Clearing Calculations'!C90,\"\")","v":""},"","","",""]
[{"$f":"IF('Clearing Calculations'!A91=\"\",\"\",'Clearing Calculations'!A91)","v":""},{"$f":"IF('Clearing Calculations'!A91,'Clearing Calculations'!B91,\"\")","v":""},{"$f":"IF('Clearing Calculations'!B91,'Clearing Calculations'!C91,\"\")","v":""},"","","",""]
[{"$f":"IF('Clearing Calculations'!A92=\"\",\"\",'Clearing Calculations'!A92)","v":""},{"$f":"IF('Clearing Calculations'!A92,'Clearing Calculations'!B92,\"\")","v":""},{"$f":"IF('Clearing Calculations'!B92,'Clearing Calculations'!C92,\"\")","v":""},"","","",""]
[{"$f":"IF('Clearing Calculations'!A93=\"\",\"\",'Clearing Calculations'!A93)","v":""},{"$f":"IF('Clearing Calculations'!A93,'Clearing Calculations'!B93,\"\")","v":""},{"$f":"IF('Clearing Calculations'!B93,'Clearing Calculations'!C93,\"\")","v":""},"","","",""]
[{"$f":"IF('Clearing Calculations'!A94=\"\",\"\",'Clearing Calculations'!A94)","v":""},{"$f":"IF('Clearing Calculations'!A94,'Clearing Calculations'!B94,\"\")","v":""},{"$f":"IF('Clearing Calculations'!B94,'Clearing Calculations'!C94,\"\")","v":""},"","","",""]
[{"$f":"IF('Clearing Calculations'!A95=\"\",\"\",'Clearing Calculations'!A95)","v":""},{"$f":"IF('Clearing Calculations'!A95,'Clearing Calculations'!B95,\"\")","v":""},{"$f":"IF('Clearing Calculations'!B95,'Clearing Calculations'!C95,\"\")","v":""},"","","",""]
[{"$f":"IF('Clearing Calculations'!A96=\"\",\"\",'Clearing Calculations'!A96)","v":""},{"$f":"IF('Clearing Calculations'!A96,'Clearing Calculations'!B96,\"\")","v":""},{"$f":"IF('Clearing Calculations'!B96,'Clearing Calculations'!C96,\"\")","v":""},"","","",""]
[{"$f":"IF('Clearing Calculations'!A97=\"\",\"\",'Clearing Calculations'!A97)","v":""},{"$f":"IF('Clearing Calculations'!A97,'Clearing Calculations'!B97,\"\")","v":""},{"$f":"IF('Clearing Calculations'!B97,'Clearing Calculations'!C97,\"\")","v":""},"","","",""]
[{"$f":"IF('Clearing Calculations'!A98=\"\",\"\",'Clearing Calculations'!A98)","v":""},{"$f":"IF('Clearing Calculations'!A98,'Clearing Calculations'!B98,\"\")","v":""},{"$f":"IF('Clearing Calculations'!B98,'Clearing Calculations'!C98,\"\")","v":""},"","","",""]
[{"$f":"IF('Clearing Calculations'!A99=\"\",\"\",'Clearing Calculations'!A99)","v":""},{"$f":"IF('Clearing Calculations'!A99,'Clearing Calculations'!B99,\"\")","v":""},{"$f":"IF('Clearing Calculations'!B99,'Clearing Calculations'!C99,\"\")","v":""},"","","",""]
[{"$f":"IF('Clearing Calculations'!A100=\"\",\"\",'Clearing Calculations'!A100)","v":""},{"$f":"IF('Clearing Calculations'!A100,'Clearing Calculations'!B100,\"\")","v":""},{"$f":"IF('Clearing Calculations'!B100,'Clearing Calculations'!C100,\"\")","v":""},"","","",""]
[{"$f":"IF('Clearing Calculations'!A101=\"\",\"\",'Clearing Calculations'!A101)","v":""},{"$f":"IF('Clearing Calculations'!A101,'Clearing Calculations'!B101,\"\")","v":""},{"$f":"IF('Clearing Calculations'!B101,'Clearing Calculations'!C101,\"\")","v":""},"","","",""]
[{"$f":"IF('Clearing Calculations'!A102=\"\",\"\",'Clearing Calculations'!A102)","v":""},{"$f":"IF('Clearing Calculations'!A102,'Clearing Calculations'!B102,\"\")","v":""},{"$f":"IF('Clearing Calculations'!B102,'Clearing Calculations'!C102,\"\")","v":""},"","","",""]
[{"$f":"IF('Clearing Calculations'!A103=\"\",\"\",'Clearing Calculations'!A103)","v":""},{"$f":"IF('Clearing Calculations'!A103,'Clearing Calculations'!B103,\"\")","v":""},{"$f":"IF('Clearing Calculations'!B103,'Clearing Calculations'!C103,\"\")","v":""},"","","",""]
[{"$f":"IF('Clearing Calculations'!A104=\"\",\"\",'Clearing Calculations'!A104)","v":""},{"$f":"IF('Clearing Calculations'!A104,'Clearing Calculations'!B104,\"\")","v":""},{"$f":"IF('Clearing Calculations'!B104,'Clearing Calculations'!C104,\"\")","v":""},"","","",""]
[{"$f":"IF('Clearing Calculations'!A105=\"\",\"\",'Clearing Calculations'!A105)","v":""},{"$f":"IF('Clearing Calculations'!A105,'Clearing Calculations'!B105,\"\")","v":""},{"$f":"IF('Clearing Calculations'!B105,'Clearing Calculations'!C105,\"\")","v":""},"","","",""]
[{"$f":"IF('Clearing Calculations'!A106=\"\",\"\",'Clearing Calculations'!A106)","v":""},{"$f":"IF('Clearing Calculations'!A106,'Clearing Calculations'!B106,\"\")","v":""},{"$f":"IF('Clearing Calculations'!B106,'Clearing Calculations'!C106,\"\")","v":""},"","","",""]
[{"$f":"IF('Clearing Calculations'!A107=\"\",\"\",'Clearing Calculations'!A107)","v":""},{"$f":"IF('Clearing Calculations'!A107,'Clearing Calculations'!B107,\"\")","v":""},{"$f":"IF('Clearing Calculations'!B107,'Clearing Calculations'!C107,\"\")","v":""},"","","",""]
[{"$f":"IF('Clearing Calculations'!A108=\"\",\"\",'Clearing Calculations'!A108)","v":""},{"$f":"IF('Clearing Calculations'!A108,'Clearing Calculations'!B108,\"\")","v":""},{"$f":"IF('Clearing Calculations'!B108,'Clearing Calculations'!C108,\"\")","v":""},{"$f":"IF(A114=\"\",\"\",$B114+$C114)","v":""},{"$f":"IF(A114=\"\",\"\",(D114+D113)/2*(A114-A113))","v":""},{"$f":"IF(A114=\"\",\"\",(E114/9))","v":""},{"$f":"IF(A114=\"\",\"\",E114/$G$3)","v":""}]
[{"$f":"IF('Clearing Calculations'!A109=\"\",\"\",'Clearing Calculations'!A109)","v":""},{"$f":"IF('Clearing Calculations'!A109,'Clearing Calculations'!B109,\"\")","v":""},{"$f":"IF('Clearing Calculations'!B109,'Clearing Calculations'!C109,\"\")","v":""},"","","",""]
[{"$f":"IF('Clearing Calculations'!A110=\"\",\"\",'Clearing Calculations'!A110)","v":""},{"$f":"IF('Clearing Calculations'!A110,'Clearing Calculations'!B110,\"\")","v":""},{"$f":"IF('Clearing Calculations'!B110,'Clearing Calculations'!C110,\"\")","v":""},"","","",""]
[{"$f":"IF('Clearing Calculations'!A111=\"\",\"\",'Clearing Calculations'!A111)","v":""},{"$f":"IF('Clearing Calculations'!A111,'Clearing Calculations'!B111,\"\")","v":""},{"$f":"IF('Clearing Calculations'!B111,'Clearing Calculations'!C111,\"\")","v":""},"","","",""]
[{"$f":"IF('Clearing Calculations'!A112=\"\",\"\",'Clearing Calculations'!A112)","v":""},{"$f":"IF('Clearing Calculations'!A112,'Clearing Calculations'!B112,\"\")","v":""},{"$f":"IF('Clearing Calculations'!B112,'Clearing Calculations'!C112,\"\")","v":""},"","","",""]
[{"$f":"IF('Clearing Calculations'!A113=\"\",\"\",'Clearing Calculations'!A113)","v":""},{"$f":"IF('Clearing Calculations'!A113,'Clearing Calculations'!B113,\"\")","v":""},{"$f":"IF('Clearing Calculations'!B113,'Clearing Calculations'!C113,\"\")","v":""},"","","",""]
[{"$f":"IF('Clearing Calculations'!A114=\"\",\"\",'Clearing Calculations'!A114)","v":""},{"$f":"IF('Clearing Calculations'!A114,'Clearing Calculations'!B114,\"\")","v":""},{"$f":"IF('Clearing Calculations'!B114,'Clearing Calculations'!C114,\"\")","v":""},"","","",""]
[{"$f":"IF('Clearing Calculations'!A115=\"\",\"\",'Clearing Calculations'!A115)","v":""},{"$f":"IF('Clearing Calculations'!A115,'Clearing Calculations'!B115,\"\")","v":""},{"$f":"IF('Clearing Calculations'!B115,'Clearing Calculations'!C115,\"\")","v":""},"","","",""]
[{"$f":"IF('Clearing Calculations'!A116=\"\",\"\",'Clearing Calculations'!A116)","v":""},{"$f":"IF('Clearing Calculations'!A116,'Clearing Calculations'!B116,\"\")","v":""},{"$f":"IF('Clearing Calculations'!B116,'Clearing Calculations'!C116,\"\")","v":""},"","","",""]
[{"$f":"IF('Clearing Calculations'!A117=\"\",\"\",'Clearing Calculations'!A117)","v":""},{"$f":"IF('Clearing Calculations'!A117,'Clearing Calculations'!B117,\"\")","v":""},{"$f":"IF('Clearing Calculations'!B117,'Clearing Calculations'!C117,\"\")","v":""},"","","",""]
[{"$f":"IF('Clearing Calculations'!A118=\"\",\"\",'Clearing Calculations'!A118)","v":""},{"$f":"IF('Clearing Calculations'!A118,'Clearing Calculations'!B118,\"\")","v":""},{"$f":"IF('Clearing Calculations'!B118,'Clearing Calculations'!C118,\"\")","v":""},"","","",""]
[{"$f":"IF('Clearing Calculations'!A119=\"\",\"\",'Clearing Calculations'!A119)","v":""},{"$f":"IF('Clearing Calculations'!A119,'Clearing Calculations'!B119,\"\")","v":""},{"$f":"IF('Clearing Calculations'!B119,'Clearing Calculations'!C119,\"\")","v":""},"","","",""]
[{"$f":"IF('Clearing Calculations'!A120=\"\",\"\",'Clearing Calculations'!A120)","v":""},{"$f":"IF('Clearing Calculations'!A120,'Clearing Calculations'!B120,\"\")","v":""},{"$f":"IF('Clearing Calculations'!B120,'Clearing Calculations'!C120,\"\")","v":""},"","","",""]
[{"$f":"IF('Clearing Calculations'!A121=\"\",\"\",'Clearing Calculations'!A121)","v":""},{"$f":"IF('Clearing Calculations'!A121,'Clearing Calculations'!B121,\"\")","v":""},{"$f":"IF('Clearing Calculations'!B121,'Clearing Calculations'!C121,\"\")","v":""},"","","",""]
[{"$f":"IF('Clearing Calculations'!A122=\"\",\"\",'Clearing Calculations'!A122)","v":""},{"$f":"IF('Clearing Calculations'!A122,'Clearing Calculations'!B122,\"\")","v":""},{"$f":"IF('Clearing Calculations'!B122,'Clearing Calculations'!C122,\"\")","v":""},"","","",""]
[{"$f":"IF('Clearing Calculations'!A123=\"\",\"\",'Clearing Calculations'!A123)","v":""},{"$f":"IF('Clearing Calculations'!A123,'Clearing Calculations'!B123,\"\")","v":""},{"$f":"IF('Clearing Calculations'!B123,'Clearing Calculations'!C123,\"\")","v":""},"","","",""]
[{"$f":"IF('Clearing Calculations'!A124=\"\",\"\",'Clearing Calculations'!A124)","v":""},{"$f":"IF('Clearing Calculations'!A124,'Clearing Calculations'!B124,\"\")","v":""},{"$f":"IF('Clearing Calculations'!B124,'Clearing Calculations'!C124,\"\")","v":""},"","","",""]
[{"$f":"IF('Clearing Calculations'!A125=\"\",\"\",'Clearing Calculations'!A125)","v":""},{"$f":"IF('Clearing Calculations'!A125,'Clearing Calculations'!B125,\"\")","v":""},{"$f":"IF('Clearing Calculations'!B125,'Clearing Calculations'!C125,\"\")","v":""},"","","",""]
[{"$f":"IF('Clearing Calculations'!A126=\"\",\"\",'Clearing Calculations'!A126)","v":""},{"$f":"IF('Clearing Calculations'!A126,'Clearing Calculations'!B126,\"\")","v":""},{"$f":"IF('Clearing Calculations'!B126,'Clearing Calculations'!C126,\"\")","v":""},"","","",""]
[{"$f":"IF('Clearing Calculations'!A127=\"\",\"\",'Clearing Calculations'!A127)","v":""},{"$f":"IF('Clearing Calculations'!A127,'Clearing Calculations'!B127,\"\")","v":""},{"$f":"IF('Clearing Calculations'!B127,'Clearing Calculations'!C127,\"\")","v":""},"","","",""]
[{"$f":"IF('Clearing Calculations'!A128=\"\",\"\",'Clearing Calculations'!A128)","v":""},{"$f":"IF('Clearing Calculations'!A128,'Clearing Calculations'!B128,\"\")","v":""},{"$f":"IF('Clearing Calculations'!B128,'Clearing Calculations'!C128,\"\")","v":""},"","","",""]
[{"$f":"IF('Clearing Calculations'!A129=\"\",\"\",'Clearing Calculations'!A129)","v":""},{"$f":"IF('Clearing Calculations'!A129,'Clearing Calculations'!B129,\"\")","v":""},{"$f":"IF('Clearing Calculations'!B129,'Clearing Calculations'!C129,\"\")","v":""},"","","",""]
[{"$f":"IF('Clearing Calculations'!A130=\"\",\"\",'Clearing Calculations'!A130)","v":""},{"$f":"IF('Clearing Calculations'!A130,'Clearing Calculations'!B130,\"\")","v":""},{"$f":"IF('Clearing Calculations'!B130,'Clearing Calculations'!C130,\"\")","v":""},"","","",""]
[{"$f":"IF('Clearing Calculations'!A131=\"\",\"\",'Clearing Calculations'!A131)","v":""},{"$f":"IF('Clearing Calculations'!A131,'Clearing Calculations'!B131,\"\")","v":""},{"$f":"IF('Clearing Calculations'!B131,'Clearing Calculations'!C131,\"\")","v":""},"","","",""]
[{"$f":"IF('Clearing Calculations'!A132=\"\",\"\",'Clearing Calculations'!A132)","v":""},{"$f":"IF('Clearing Calculations'!A132,'Clearing Calculations'!B132,\"\")","v":""},{"$f":"IF('Clearing Calculations'!B132,'Clearing Calculations'!C132,\"\")","v":""},"","","",""]
[{"$f":"IF('Clearing Calculations'!A133=\"\",\"\",'Clearing Calculations'!A133)","v":""},{"$f":"IF('Clearing Calculations'!A133,'Clearing Calculations'!B133,\"\")","v":""},{"$f":"IF('Clearing Calculations'!B133,'Clearing Calculations'!C133,\"\")","v":""},"","","",""]
[{"$f":"IF('Clearing Calculations'!A134=\"\",\"\",'Clearing Calculations'!A134)","v":""},{"$f":"IF('Clearing Calculations'!A134,'Clearing Calculations'!B134,\"\")","v":""},{"$f":"IF('Clearing Calculations'!B134,'Clearing Calculations'!C134,\"\")","v":""},"","","",""]
[{"$f":"IF('Clearing Calculations'!A135=\"\",\"\",'Clearing Calculations'!A135)","v":""},{"$f":"IF('Clearing Calculations'!A135,'Clearing Calculations'!B135,\"\")","v":""},{"$f":"IF('Clearing Calculations'!B135,'Clearing Calculations'!C135,\"\")","v":""},"","","",""]
[{"$f":"IF('Clearing Calculations'!A136=\"\",\"\",'Clearing Calculations'!A136)","v":""},{"$f":"IF('Clearing Calculations'!A136,'Clearing Calculations'!B136,\"\")","v":""},{"$f":"IF('Clearing Calculations'!B136,'Clearing Calculations'!C136,\"\")","v":""},"","","",""]
[{"$f":"IF('Clearing Calculations'!A137=\"\",\"\",'Clearing Calculations'!A137)","v":""},{"$f":"IF('Clearing Calculations'!A137,'Clearing Calculations'!B137,\"\")","v":""},{"$f":"IF('Clearing Calculations'!B137,'Clearing Calculations'!C137,\"\")","v":""},"","","",""]
[{"$f":"IF('Clearing Calculations'!A138=\"\",\"\",'Clearing Calculations'!A138)","v":""},{"$f":"IF('Clearing Calculations'!A138,'Clearing Calculations'!B138,\"\")","v":""},{"$f":"IF('Clearing Calculations'!B138,'Clearing Calculations'!C138,\"\")","v":""},"","","",""]
[{"$f":"IF('Clearing Calculations'!A139=\"\",\"\",'Clearing Calculations'!A139)","v":""},{"$f":"IF('Clearing Calculations'!A139,'Clearing Calculations'!B139,\"\")","v":""},{"$f":"IF('Clearing Calculations'!B139,'Clearing Calculations'!C139,\"\")","v":""},"","","",""]
[{"$f":"IF('Clearing Calculations'!A140=\"\",\"\",'Clearing Calculations'!A140)","v":""},{"$f":"IF('Clearing Calculations'!A140,'Clearing Calculations'!B140,\"\")","v":""},{"$f":"IF('Clearing Calculations'!B140,'Clearing Calculations'!C140,\"\")","v":""},"","","",""]
[{"$f":"IF('Clearing Calculations'!A141=\"\",\"\",'Clearing Calculations'!A141)","v":""},{"$f":"IF('Clearing Calculations'!A141,'Clearing Calculations'!B141,\"\")","v":""},{"$f":"IF('Clearing Calculations'!B141,'Clearing Calculations'!C141,\"\")","v":""},"","","",""]
[{"$f":"IF('Clearing Calculations'!A142=\"\",\"\",'Clearing Calculations'!A142)","v":""},{"$f":"IF('Clearing Calculations'!A142,'Clearing Calculations'!B142,\"\")","v":""},{"$f":"IF('Clearing Calculations'!B142,'Clearing Calculations'!C142,\"\")","v":""},"","","",""]
[{"$f":"IF('Clearing Calculations'!A143=\"\",\"\",'Clearing Calculations'!A143)","v":""},{"$f":"IF('Clearing Calculations'!A143,'Clearing Calculations'!B143,\"\")","v":""},{"$f":"IF('Clearing Calculations'!B143,'Clearing Calculations'!C143,\"\")","v":""},"","","",""]
[{"$f":"IF('Clearing Calculations'!A144=\"\",\"\",'Clearing Calculations'!A144)","v":""},{"$f":"IF('Clearing Calculations'!A144,'Clearing Calculations'!B144,\"\")","v":""},{"$f":"IF('Clearing Calculations'!B144,'Clearing Calculations'!C144,\"\")","v":""},"","","",""]
[{"$f":"IF('Clearing Calculations'!A145=\"\",\"\",'Clearing Calculations'!A145)","v":""},{"$f":"IF('Clearing Calculations'!A145,'Clearing Calculations'!B145,\"\")","v":""},{"$f":"IF('Clearing Calculations'!B145,'Clearing Calculations'!C145,\"\")","v":""},"","","",""]
[{"$f":"IF('Clearing Calculations'!A146=\"\",\"\",'Clearing Calculations'!A146)","v":""},{"$f":"IF('Clearing Calculations'!A146,'Clearing Calculations'!B146,\"\")","v":""},{"$f":"IF('Clearing Calculations'!B146,'Clearing Calculations'!C146,\"\")","v":""},"","","",""]
[{"$f":"IF('Clearing Calculations'!A147=\"\",\"\",'Clearing Calculations'!A147)","v":""},{"$f":"IF('Clearing Calculations'!A147,'Clearing Calculations'!B147,\"\")","v":""},{"$f":"IF('Clearing Calculations'!B147,'Clearing Calculations'!C147,\"\")","v":""},"","","",""]
[{"$f":"IF('Clearing Calculations'!A148=\"\",\"\",'Clearing Calculations'!A148)","v":""},{"$f":"IF('Clearing Calculations'!A148,'Clearing Calculations'!B148,\"\")","v":""},{"$f":"IF('Clearing Calculations'!B148,'Clearing Calculations'!C148,\"\")","v":""},"","","",""]
[{"$f":"IF('Clearing Calculations'!A149=\"\",\"\",'Clearing Calculations'!A149)","v":""},{"$f":"IF('Clearing Calculations'!A149,'Clearing Calculations'!B149,\"\")","v":""},{"$f":"IF('Clearing Calculations'!B149,'Clearing Calculations'!C149,\"\")","v":""},"","","",""]
[{"$f":"IF('Clearing Calculations'!A150=\"\",\"\",'Clearing Calculations'!A150)","v":""},{"$f":"IF('Clearing Calculations'!A150,'Clearing Calculations'!B150,\"\")","v":""},{"$f":"IF('Clearing Calculations'!B150,'Clearing Calculations'!C150,\"\")","v":""},"","","",""]
[{"$f":"IF('Clearing Calculations'!A151=\"\",\"\",'Clearing Calculations'!A151)","v":""},{"$f":"IF('Clearing Calculations'!A151,'Clearing Calculations'!B151,\"\")","v":""},{"$f":"IF('Clearing Calculations'!B151,'Clearing Calculations'!C151,\"\")","v":""},"","","",""]
[{"$f":"IF('Clearing Calculations'!A152=\"\",\"\",'Clearing Calculations'!A152)","v":""},{"$f":"IF('Clearing Calculations'!A152,'Clearing Calculations'!B152,\"\")","v":""},{"$f":"IF('Clearing Calculations'!B152,'Clearing Calculations'!C152,\"\")","v":""},"","","",""]
[{"$f":"IF('Clearing Calculations'!A153=\"\",\"\",'Clearing Calculations'!A153)","v":""},{"$f":"IF('Clearing Calculations'!A153,'Clearing Calculations'!B153,\"\")","v":""},{"$f":"IF('Clearing Calculations'!B153,'Clearing Calculations'!C153,\"\")","v":""},"","","",""]
[{"$f":"IF('Clearing Calculations'!A154=\"\",\"\",'Clearing Calculations'!A154)","v":""},{"$f":"IF('Clearing Calculations'!A154,'Clearing Calculations'!B154,\"\")","v":""},{"$f":"IF('Clearing Calculations'!B154,'Clearing Calculations'!C154,\"\")","v":""},"","","",""]
[{"$f":"IF('Clearing Calculations'!A155=\"\",\"\",'Clearing Calculations'!A155)","v":""},{"$f":"IF('Clearing Calculations'!A155,'Clearing Calculations'!B155,\"\")","v":""},{"$f":"IF('Clearing Calculations'!B155,'Clearing Calculations'!C155,\"\")","v":""},"","","",""]
[{"$f":"IF('Clearing Calculations'!A156=\"\",\"\",'Clearing Calculations'!A156)","v":""},{"$f":"IF('Clearing Calculations'!A156,'Clearing Calculations'!B156,\"\")","v":""},{"$f":"IF('Clearing Calculations'!B156,'Clearing Calculations'!C156,\"\")","v":""},"","","",""]
[{"$f":"IF('Clearing Calculations'!A157=\"\",\"\",'Clearing Calculations'!A157)","v":""},{"$f":"IF('Clearing Calculations'!A157,'Clearing Calculations'!B157,\"\")","v":""},{"$f":"IF('Clearing Calculations'!B157,'Clearing Calculations'!C157,\"\")","v":""},"","","",""]
[{"$f":"IF('Clearing Calculations'!A158=\"\",\"\",'Clearing Calculations'!A158)","v":""},{"$f":"IF('Clearing Calculations'!A158,'Clearing Calculations'!B158,\"\")","v":""},{"$f":"IF('Clearing Calculations'!B158,'Clearing Calculations'!C158,\"\")","v":""},"","","",""]
[{"$f":"IF('Clearing Calculations'!A159=\"\",\"\",'Clearing Calculations'!A159)","v":""},{"$f":"IF('Clearing Calculations'!A159,'Clearing Calculations'!B159,\"\")","v":""},{"$f":"IF('Clearing Calculations'!B159,'Clearing Calculations'!C159,\"\")","v":""},"","","",""]
[{"$f":"IF('Clearing Calculations'!A160=\"\",\"\",'Clearing Calculations'!A160)","v":""},{"$f":"IF('Clearing Calculations'!A160,'Clearing Calculations'!B160,\"\")","v":""},{"$f":"IF('Clearing Calculations'!B160,'Clearing Calculations'!C160,\"\")","v":""},"","","",""]
[{"$f":"IF('Clearing Calculations'!A161=\"\",\"\",'Clearing Calculations'!A161)","v":""},{"$f":"IF('Clearing Calculations'!A161,'Clearing Calculations'!B161,\"\")","v":""},{"$f":"IF('Clearing Calculations'!B161,'Clearing Calculations'!C161,\"\")","v":""},"","","",""]
[{"$f":"IF('Clearing Calculations'!A162=\"\",\"\",'Clearing Calculations'!A162)","v":""},{"$f":"IF('Clearing Calculations'!A162,'Clearing Calculations'!B162,\"\")","v":""},{"$f":"IF('Clearing Calculations'!B162,'Clearing Calculations'!C162,\"\")","v":""},"","","",""]
[{"$f":"IF('Clearing Calculations'!A163=\"\",\"\",'Clearing Calculations'!A163)","v":""},{"$f":"IF('Clearing Calculations'!A163,'Clearing Calculations'!B163,\"\")","v":""},{"$f":"IF('Clearing Calculations'!B163,'Clearing Calculations'!C163,\"\")","v":""},"","","",""]
[{"$f":"IF('Clearing Calculations'!A164=\"\",\"\",'Clearing Calculations'!A164)","v":""},{"$f":"IF('Clearing Calculations'!A164,'Clearing Calculations'!B164,\"\")","v":""},{"$f":"IF('Clearing Calculations'!B164,'Clearing Calculations'!C164,\"\")","v":""},"","","",""]
[{"$f":"IF('Clearing Calculations'!A165=\"\",\"\",'Clearing Calculations'!A165)","v":""},{"$f":"IF('Clearing Calculations'!A165,'Clearing Calculations'!B165,\"\")","v":""},{"$f":"IF('Clearing Calculations'!B165,'Clearing Calculations'!C165,\"\")","v":""},"","","",""]
[{"$f":"IF('Clearing Calculations'!A166=\"\",\"\",'Clearing Calculations'!A166)","v":""},{"$f":"IF('Clearing Calculations'!A166,'Clearing Calculations'!B166,\"\")","v":""},{"$f":"IF('Clearing Calculations'!B166,'Clearing Calculations'!C166,\"\")","v":""},"","","",""]
[{"$f":"IF('Clearing Calculations'!A167=\"\",\"\",'Clearing Calculations'!A167)","v":""},{"$f":"IF('Clearing Calculations'!A167,'Clearing Calculations'!B167,\"\")","v":""},{"$f":"IF('Clearing Calculations'!B167,'Clearing Calculations'!C167,\"\")","v":""},"","","",""]
[{"$f":"IF('Clearing Calculations'!A168=\"\",\"\",'Clearing Calculations'!A168)","v":""},{"$f":"IF('Clearing Calculations'!A168,'Clearing Calculations'!B168,\"\")","v":""},{"$f":"IF('Clearing Calculations'!B168,'Clearing Calculations'!C168,\"\")","v":""},"","","",""]
[{"$f":"IF('Clearing Calculations'!A169=\"\",\"\",'Clearing Calculations'!A169)","v":""},{"$f":"IF('Clearing Calculations'!A169,'Clearing Calculations'!B169,\"\")","v":""},{"$f":"IF('Clearing Calculations'!B169,'Clearing Calculations'!C169,\"\")","v":""},"","","",""]
[{"$f":"IF('Clearing Calculations'!A170=\"\",\"\",'Clearing Calculations'!A170)","v":""},{"$f":"IF('Clearing Calculations'!A170,'Clearing Calculations'!B170,\"\")","v":""},{"$f":"IF('Clearing Calculations'!B170,'Clearing Calculations'!C170,\"\")","v":""},"","","",""]
[{"$f":"IF('Clearing Calculations'!A171=\"\",\"\",'Clearing Calculations'!A171)","v":""},{"$f":"IF('Clearing Calculations'!A171,'Clearing Calculations'!B171,\"\")","v":""},{"$f":"IF('Clearing Calculations'!B171,'Clearing Calculations'!C171,\"\")","v":""},"","","",""]
[{"$f":"IF('Clearing Calculations'!A172=\"\",\"\",'Clearing Calculations'!A172)","v":""},{"$f":"IF('Clearing Calculations'!A172,'Clearing Calculations'!B172,\"\")","v":""},{"$f":"IF('Clearing Calculations'!B172,'Clearing Calculations'!C172,\"\")","v":""},{"$f":"IF(A178=\"\",\"\",$B178+$C178)","v":""},{"$f":"IF(A178=\"\",\"\",(D178+D177)/2*(A178-A177))","v":""},{"$f":"IF(A178=\"\",\"\",(E178/9))","v":""},{"$f":"IF(A178=\"\",\"\",E178/$G$3)","v":""}]
[{"$f":"IF('Clearing Calculations'!A173=\"\",\"\",'Clearing Calculations'!A173)","v":""},{"$f":"IF('Clearing Calculations'!A173,'Clearing Calculations'!B173,\"\")","v":""},{"$f":"IF('Clearing Calculations'!B173,'Clearing Calculations'!C173,\"\")","v":""},"","","",""]
[{"$f":"IF('Clearing Calculations'!A174=\"\",\"\",'Clearing Calculations'!A174)","v":""},{"$f":"IF('Clearing Calculations'!A174,'Clearing Calculations'!B174,\"\")","v":""},{"$f":"IF('Clearing Calculations'!B174,'Clearing Calculations'!C174,\"\")","v":""},"","","",""]
[{"$f":"IF('Clearing Calculations'!A175=\"\",\"\",'Clearing Calculations'!A175)","v":""},{"$f":"IF('Clearing Calculations'!A175,'Clearing Calculations'!B175,\"\")","v":""},{"$f":"IF('Clearing Calculations'!B175,'Clearing Calculations'!C175,\"\")","v":""},"","","",""]
[{"$f":"IF('Clearing Calculations'!A176=\"\",\"\",'Clearing Calculations'!A176)","v":""},{"$f":"IF('Clearing Calculations'!A176,'Clearing Calculations'!B176,\"\")","v":""},{"$f":"IF('Clearing Calculations'!B176,'Clearing Calculations'!C176,\"\")","v":""},"","","",""]
[{"$f":"IF('Clearing Calculations'!A177=\"\",\"\",'Clearing Calculations'!A177)","v":""},{"$f":"IF('Clearing Calculations'!A177,'Clearing Calculations'!B177,\"\")","v":""},{"$f":"IF('Clearing Calculations'!B177,'Clearing Calculations'!C177,\"\")","v":""},"","","",""]
[{"$f":"IF('Clearing Calculations'!A178=\"\",\"\",'Clearing Calculations'!A178)","v":""},{"$f":"IF('Clearing Calculations'!A178,'Clearing Calculations'!B178,\"\")","v":""},{"$f":"IF('Clearing Calculations'!B178,'Clearing Calculations'!C178,\"\")","v":""},"","","",""]
[{"$f":"IF('Clearing Calculations'!A179=\"\",\"\",'Clearing Calculations'!A179)","v":""},{"$f":"IF('Clearing Calculations'!A179,'Clearing Calculations'!B179,\"\")","v":""},{"$f":"IF('Clearing Calculations'!B179,'Clearing Calculations'!C179,\"\")","v":""},"","","",""]
[{"$f":"IF('Clearing Calculations'!A180=\"\",\"\",'Clearing Calculations'!A180)","v":""},{"$f":"IF('Clearing Calculations'!A180,'Clearing Calculations'!B180,\"\")","v":""},{"$f":"IF('Clearing Calculations'!B180,'Clearing Calculations'!C180,\"\")","v":""},"","","",""]
[{"$f":"IF('Clearing Calculations'!A181=\"\",\"\",'Clearing Calculations'!A181)","v":""},{"$f":"IF('Clearing Calculations'!A181,'Clearing Calculations'!B181,\"\")","v":""},{"$f":"IF('Clearing Calculations'!B181,'Clearing Calculations'!C181,\"\")","v":""},"","","",""]
[{"$f":"IF('Clearing Calculations'!A182=\"\",\"\",'Clearing Calculations'!A182)","v":""},{"$f":"IF('Clearing Calculations'!A182,'Clearing Calculations'!B182,\"\")","v":""},{"$f":"IF('Clearing Calculations'!B182,'Clearing Calculations'!C182,\"\")","v":""},"","","",""]
[{"$f":"IF('Clearing Calculations'!A183=\"\",\"\",'Clearing Calculations'!A183)","v":""},{"$f":"IF('Clearing Calculations'!A183,'Clearing Calculations'!B183,\"\")","v":""},{"$f":"IF('Clearing Calculations'!B183,'Clearing Calculations'!C183,\"\")","v":""},"","","",""]
[{"$f":"IF('Clearing Calculations'!A184=\"\",\"\",'Clearing Calculations'!A184)","v":""},{"$f":"IF('Clearing Calculations'!A184,'Clearing Calculations'!B184,\"\")","v":""},{"$f":"IF('Clearing Calculations'!B184,'Clearing Calculations'!C184,\"\")","v":""},"","","",""]
[{"$f":"IF('Clearing Calculations'!A185=\"\",\"\",'Clearing Calculations'!A185)","v":""},{"$f":"IF('Clearing Calculations'!A185,'Clearing Calculations'!B185,\"\")","v":""},{"$f":"IF('Clearing Calculations'!B185,'Clearing Calculations'!C185,\"\")","v":""},"","","",""]
[{"$f":"IF('Clearing Calculations'!A186=\"\",\"\",'Clearing Calculations'!A186)","v":""},{"$f":"IF('Clearing Calculations'!A186,'Clearing Calculations'!B186,\"\")","v":""},{"$f":"IF('Clearing Calculations'!B186,'Clearing Calculations'!C186,\"\")","v":""},"","","",""]
[{"$f":"IF('Clearing Calculations'!A187=\"\",\"\",'Clearing Calculations'!A187)","v":""},{"$f":"IF('Clearing Calculations'!A187,'Clearing Calculations'!B187,\"\")","v":""},{"$f":"IF('Clearing Calculations'!B187,'Clearing Calculations'!C187,\"\")","v":""},"","","",""]
[{"$f":"IF('Clearing Calculations'!A188=\"\",\"\",'Clearing Calculations'!A188)","v":""},{"$f":"IF('Clearing Calculations'!A188,'Clearing Calculations'!B188,\"\")","v":""},{"$f":"IF('Clearing Calculations'!B188,'Clearing Calculations'!C188,\"\")","v":""},"","","",""]
[{"$f":"IF('Clearing Calculations'!A189=\"\",\"\",'Clearing Calculations'!A189)","v":""},{"$f":"IF('Clearing Calculations'!A189,'Clearing Calculations'!B189,\"\")","v":""},{"$f":"IF('Clearing Calculations'!B189,'Clearing Calculations'!C189,\"\")","v":""},"","","",""]
[{"$f":"IF('Clearing Calculations'!A190=\"\",\"\",'Clearing Calculations'!A190)","v":""},{"$f":"IF('Clearing Calculations'!A190,'Clearing Calculations'!B190,\"\")","v":""},{"$f":"IF('Clearing Calculations'!B190,'Clearing Calculations'!C190,\"\")","v":""},"","","",""]
[{"$f":"IF('Clearing Calculations'!A191=\"\",\"\",'Clearing Calculations'!A191)","v":""},{"$f":"IF('Clearing Calculations'!A191,'Clearing Calculations'!B191,\"\")","v":""},{"$f":"IF('Clearing Calculations'!B191,'Clearing Calculations'!C191,\"\")","v":""},"","","",""]
[{"$f":"IF('Clearing Calculations'!A192=\"\",\"\",'Clearing Calculations'!A192)","v":""},{"$f":"IF('Clearing Calculations'!A192,'Clearing Calculations'!B192,\"\")","v":""},{"$f":"IF('Clearing Calculations'!B192,'Clearing Calculations'!C192,\"\")","v":""},"","","",""]
[{"$f":"IF('Clearing Calculations'!A193=\"\",\"\",'Clearing Calculations'!A193)","v":""},{"$f":"IF('Clearing Calculations'!A193,'Clearing Calculations'!B193,\"\")","v":""},{"$f":"IF('Clearing Calculations'!B193,'Clearing Calculations'!C193,\"\")","v":""},"","","",""]
[{"$f":"IF('Clearing Calculations'!A194=\"\",\"\",'Clearing Calculations'!A194)","v":""},{"$f":"IF('Clearing Calculations'!A194,'Clearing Calculations'!B194,\"\")","v":""},{"$f":"IF('Clearing Calculations'!B194,'Clearing Calculations'!C194,\"\")","v":""},"","","",""]
[{"$f":"IF('Clearing Calculations'!A195=\"\",\"\",'Clearing Calculations'!A195)","v":""},{"$f":"IF('Clearing Calculations'!A195,'Clearing Calculations'!B195,\"\")","v":""},{"$f":"IF('Clearing Calculations'!B195,'Clearing Calculations'!C195,\"\")","v":""},"","","",""]
[{"$f":"IF('Clearing Calculations'!A196=\"\",\"\",'Clearing Calculations'!A196)","v":""},{"$f":"IF('Clearing Calculations'!A196,'Clearing Calculations'!B196,\"\")","v":""},{"$f":"IF('Clearing Calculations'!B196,'Clearing Calculations'!C196,\"\")","v":""},"","","",""]
[{"$f":"IF('Clearing Calculations'!A197=\"\",\"\",'Clearing Calculations'!A197)","v":""},{"$f":"IF('Clearing Calculations'!A197,'Clearing Calculations'!B197,\"\")","v":""},{"$f":"IF('Clearing Calculations'!B197,'Clearing Calculations'!C197,\"\")","v":""},"","","",""]
[{"$f":"IF('Clearing Calculations'!A198=\"\",\"\",'Clearing Calculations'!A198)","v":""},{"$f":"IF('Clearing Calculations'!A198,'Clearing Calculations'!B198,\"\")","v":""},{"$f":"IF('Clearing Calculations'!B198,'Clearing Calculations'!C198,\"\")","v":""},"","","",""]
[{"$f":"IF('Clearing Calculations'!A199=\"\",\"\",'Clearing Calculations'!A199)","v":""},{"$f":"IF('Clearing Calculations'!A199,'Clearing Calculations'!B199,\"\")","v":""},{"$f":"IF('Clearing Calculations'!B199,'Clearing Calculations'!C199,\"\")","v":""},"","","",""]
[{"$f":"IF('Clearing Calculations'!A200=\"\",\"\",'Clearing Calculations'!A200)","v":""},{"$f":"IF('Clearing Calculations'!A200,'Clearing Calculations'!B200,\"\")","v":""},{"$f":"IF('Clearing Calculations'!B200,'Clearing Calculations'!C200,\"\")","v":""},"","","",""]
[{"$f":"IF('Clearing Calculations'!A201=\"\",\"\",'Clearing Calculations'!A201)","v":""},{"$f":"IF('Clearing Calculations'!A201,'Clearing Calculations'!B201,\"\")","v":""},{"$f":"IF('Clearing Calculations'!B201,'Clearing Calculations'!C201,\"\")","v":""},"","","",""]
[{"$f":"IF('Clearing Calculations'!A202=\"\",\"\",'Clearing Calculations'!A202)","v":""},{"$f":"IF('Clearing Calculations'!A202,'Clearing Calculations'!B202,\"\")","v":""},{"$f":"IF('Clearing Calculations'!B202,'Clearing Calculations'!C202,\"\")","v":""},"","","",""]
[{"$f":"IF('Clearing Calculations'!A203=\"\",\"\",'Clearing Calculations'!A203)","v":""},{"$f":"IF('Clearing Calculations'!A203,'Clearing Calculations'!B203,\"\")","v":""},{"$f":"IF('Clearing Calculations'!B203,'Clearing Calculations'!C203,\"\")","v":""},"","","",""]
[{"$f":"IF('Clearing Calculations'!A204=\"\",\"\",'Clearing Calculations'!A204)","v":""},{"$f":"IF('Clearing Calculations'!A204,'Clearing Calculations'!B204,\"\")","v":""},{"$f":"IF('Clearing Calculations'!B204,'Clearing Calculations'!C204,\"\")","v":""},"","","",""]
[{"$f":"IF('Clearing Calculations'!A205=\"\",\"\",'Clearing Calculations'!A205)","v":""},{"$f":"IF('Clearing Calculations'!A205,'Clearing Calculations'!B205,\"\")","v":""},{"$f":"IF('Clearing Calculations'!B205,'Clearing Calculations'!C205,\"\")","v":""},"","","",""]
[{"$f":"IF('Clearing Calculations'!A206=\"\",\"\",'Clearing Calculations'!A206)","v":""},{"$f":"IF('Clearing Calculations'!A206,'Clearing Calculations'!B206,\"\")","v":""},{"$f":"IF('Clearing Calculations'!B206,'Clearing Calculations'!C206,\"\")","v":""},"","","",""]
[{"$f":"IF('Clearing Calculations'!A207=\"\",\"\",'Clearing Calculations'!A207)","v":""},{"$f":"IF('Clearing Calculations'!A207,'Clearing Calculations'!B207,\"\")","v":""},{"$f":"IF('Clearing Calculations'!B207,'Clearing Calculations'!C207,\"\")","v":""},"","","",""]
[{"$f":"IF('Clearing Calculations'!A208=\"\",\"\",'Clearing Calculations'!A208)","v":""},{"$f":"IF('Clearing Calculations'!A208,'Clearing Calculations'!B208,\"\")","v":""},{"$f":"IF('Clearing Calculations'!B208,'Clearing Calculations'!C208,\"\")","v":""},"","","",""]
[{"$f":"IF('Clearing Calculations'!A209=\"\",\"\",'Clearing Calculations'!A209)","v":""},{"$f":"IF('Clearing Calculations'!A209,'Clearing Calculations'!B209,\"\")","v":""},{"$f":"IF('Clearing Calculations'!B209,'Clearing Calculations'!C209,\"\")","v":""},"","","",""]
[{"$f":"IF('Clearing Calculations'!A210=\"\",\"\",'Clearing Calculations'!A210)","v":""},{"$f":"IF('Clearing Calculations'!A210,'Clearing Calculations'!B210,\"\")","v":""},{"$f":"IF('Clearing Calculations'!B210,'Clearing Calculations'!C210,\"\")","v":""},"","","",""]
[{"$f":"IF('Clearing Calculations'!A211=\"\",\"\",'Clearing Calculations'!A211)","v":""},{"$f":"IF('Clearing Calculations'!A211,'Clearing Calculations'!B211,\"\")","v":""},{"$f":"IF('Clearing Calculations'!B211,'Clearing Calculations'!C211,\"\")","v":""},"","","",""]
[{"$f":"IF('Clearing Calculations'!A212=\"\",\"\",'Clearing Calculations'!A212)","v":""},{"$f":"IF('Clearing Calculations'!A212,'Clearing Calculations'!B212,\"\")","v":""},{"$f":"IF('Clearing Calculations'!B212,'Clearing Calculations'!C212,\"\")","v":""},"","","",""]
[{"$f":"IF('Clearing Calculations'!A213=\"\",\"\",'Clearing Calculations'!A213)","v":""},{"$f":"IF('Clearing Calculations'!A213,'Clearing Calculations'!B213,\"\")","v":""},{"$f":"IF('Clearing Calculations'!B213,'Clearing Calculations'!C213,\"\")","v":""},"","","",""]
[{"$f":"IF('Clearing Calculations'!A214=\"\",\"\",'Clearing Calculations'!A214)","v":""},{"$f":"IF('Clearing Calculations'!A214,'Clearing Calculations'!B214,\"\")","v":""},{"$f":"IF('Clearing Calculations'!B214,'Clearing Calculations'!C214,\"\")","v":""},"","","",""]
[{"$f":"IF('Clearing Calculations'!A215=\"\",\"\",'Clearing Calculations'!A215)","v":""},{"$f":"IF('Clearing Calculations'!A215,'Clearing Calculations'!B215,\"\")","v":""},{"$f":"IF('Clearing Calculations'!B215,'Clearing Calculations'!C215,\"\")","v":""},"","","",""]
[{"$f":"IF('Clearing Calculations'!A216=\"\",\"\",'Clearing Calculations'!A216)","v":""},{"$f":"IF('Clearing Calculations'!A216,'Clearing Calculations'!B216,\"\")","v":""},{"$f":"IF('Clearing Calculations'!B216,'Clearing Calculations'!C216,\"\")","v":""},"","","",""]
[{"$f":"IF('Clearing Calculations'!A217=\"\",\"\",'Clearing Calculations'!A217)","v":""},{"$f":"IF('Clearing Calculations'!A217,'Clearing Calculations'!B217,\"\")","v":""},{"$f":"IF('Clearing Calculations'!B217,'Clearing Calculations'!C217,\"\")","v":""},"","","",""]
[{"$f":"IF('Clearing Calculations'!A218=\"\",\"\",'Clearing Calculations'!A218)","v":""},{"$f":"IF('Clearing Calculations'!A218,'Clearing Calculations'!B218,\"\")","v":""},{"$f":"IF('Clearing Calculations'!B218,'Clearing Calculations'!C218,\"\")","v":""},"","","",""]
[{"$f":"IF('Clearing Calculations'!A219=\"\",\"\",'Clearing Calculations'!A219)","v":""},{"$f":"IF('Clearing Calculations'!A219,'Clearing Calculations'!B219,\"\")","v":""},{"$f":"IF('Clearing Calculations'!B219,'Clearing Calculations'!C219,\"\")","v":""},"","","",""]
[{"$f":"IF('Clearing Calculations'!A220=\"\",\"\",'Clearing Calculations'!A220)","v":""},{"$f":"IF('Clearing Calculations'!A220,'Clearing Calculations'!B220,\"\")","v":""},{"$f":"IF('Clearing Calculations'!B220,'Clearing Calculations'!C220,\"\")","v":""},"","","",""]
[{"$f":"IF('Clearing Calculations'!A221=\"\",\"\",'Clearing Calculations'!A221)","v":""},{"$f":"IF('Clearing Calculations'!A221,'Clearing Calculations'!B221,\"\")","v":""},{"$f":"IF('Clearing Calculations'!B221,'Clearing Calculations'!C221,\"\")","v":""},"","","",""]
[{"$f":"IF('Clearing Calculations'!A222=\"\",\"\",'Clearing Calculations'!A222)","v":""},{"$f":"IF('Clearing Calculations'!A222,'Clearing Calculations'!B222,\"\")","v":""},{"$f":"IF('Clearing Calculations'!B222,'Clearing Calculations'!C222,\"\")","v":""},"","","",""]
[{"$f":"IF('Clearing Calculations'!A223=\"\",\"\",'Clearing Calculations'!A223)","v":""},{"$f":"IF('Clearing Calculations'!A223,'Clearing Calculations'!B223,\"\")","v":""},{"$f":"IF('Clearing Calculations'!B223,'Clearing Calculations'!C223,\"\")","v":""},"","","",""]
[{"$f":"IF('Clearing Calculations'!A224=\"\",\"\",'Clearing Calculations'!A224)","v":""},{"$f":"IF('Clearing Calculations'!A224,'Clearing Calculations'!B224,\"\")","v":""},{"$f":"IF('Clearing Calculations'!B224,'Clearing Calculations'!C224,\"\")","v":""},"","","",""]
[{"$f":"IF('Clearing Calculations'!A225=\"\",\"\",'Clearing Calculations'!A225)","v":""},{"$f":"IF('Clearing Calculations'!A225,'Clearing Calculations'!B225,\"\")","v":""},{"$f":"IF('Clearing Calculations'!B225,'Clearing Calculations'!C225,\"\")","v":""},"","","",""]
[{"$f":"IF('Clearing Calculations'!A226=\"\",\"\",'Clearing Calculations'!A226)","v":""},{"$f":"IF('Clearing Calculations'!A226,'Clearing Calculations'!B226,\"\")","v":""},{"$f":"IF('Clearing Calculations'!B226,'Clearing Calculations'!C226,\"\")","v":""},"","","",""]
[{"$f":"IF('Clearing Calculations'!A227=\"\",\"\",'Clearing Calculations'!A227)","v":""},{"$f":"IF('Clearing Calculations'!A227,'Clearing Calculations'!B227,\"\")","v":""},{"$f":"IF('Clearing Calculations'!B227,'Clearing Calculations'!C227,\"\")","v":""},"","","",""]
[{"$f":"IF('Clearing Calculations'!A228=\"\",\"\",'Clearing Calculations'!A228)","v":""},{"$f":"IF('Clearing Calculations'!A228,'Clearing Calculations'!B228,\"\")","v":""},{"$f":"IF('Clearing Calculations'!B228,'Clearing Calculations'!C228,\"\")","v":""},"","","",""]
[{"$f":"IF('Clearing Calculations'!A229=\"\",\"\",'Clearing Calculations'!A229)","v":""},{"$f":"IF('Clearing Calculations'!A229,'Clearing Calculations'!B229,\"\")","v":""},{"$f":"IF('Clearing Calculations'!B229,'Clearing Calculations'!C229,\"\")","v":""},"","","",""]
[{"$f":"IF('Clearing Calculations'!A230=\"\",\"\",'Clearing Calculations'!A230)","v":""},{"$f":"IF('Clearing Calculations'!A230,'Clearing Calculations'!B230,\"\")","v":""},{"$f":"IF('Clearing Calculations'!B230,'Clearing Calculations'!C230,\"\")","v":""},"","","",""]
[{"$f":"IF('Clearing Calculations'!A231=\"\",\"\",'Clearing Calculations'!A231)","v":""},{"$f":"IF('Clearing Calculations'!A231,'Clearing Calculations'!B231,\"\")","v":""},{"$f":"IF('Clearing Calculations'!B231,'Clearing Calculations'!C231,\"\")","v":""},"","","",""]
[{"$f":"IF('Clearing Calculations'!A232=\"\",\"\",'Clearing Calculations'!A232)","v":""},{"$f":"IF('Clearing Calculations'!A232,'Clearing Calculations'!B232,\"\")","v":""},{"$f":"IF('Clearing Calculations'!B232,'Clearing Calculations'!C232,\"\")","v":""},"","","",""]
[{"$f":"IF('Clearing Calculations'!A233=\"\",\"\",'Clearing Calculations'!A233)","v":""},{"$f":"IF('Clearing Calculations'!A233,'Clearing Calculations'!B233,\"\")","v":""},{"$f":"IF('Clearing Calculations'!B233,'Clearing Calculations'!C233,\"\")","v":""},"","","",""]
[{"$f":"IF('Clearing Calculations'!A234=\"\",\"\",'Clearing Calculations'!A234)","v":""},{"$f":"IF('Clearing Calculations'!A234,'Clearing Calculations'!B234,\"\")","v":""},{"$f":"IF('Clearing Calculations'!B234,'Clearing Calculations'!C234,\"\")","v":""},"","","",""]
[{"$f":"IF('Clearing Calculations'!A235=\"\",\"\",'Clearing Calculations'!A235)","v":""},{"$f":"IF('Clearing Calculations'!A235,'Clearing Calculations'!B235,\"\")","v":""},{"$f":"IF('Clearing Calculations'!B235,'Clearing Calculations'!C235,\"\")","v":""},"","","",""]
[{"$f":"IF('Clearing Calculations'!A236=\"\",\"\",'Clearing Calculations'!A236)","v":""},{"$f":"IF('Clearing Calculations'!A236,'Clearing Calculations'!B236,\"\")","v":""},{"$f":"IF('Clearing Calculations'!B236,'Clearing Calculations'!C236,\"\")","v":""},{"$f":"IF(A242=\"\",\"\",$B242+$C242)","v":""},{"$f":"IF(A242=\"\",\"\",(D242+D241)/2*(A242-A241))","v":""},{"$f":"IF(A242=\"\",\"\",(E242/9))","v":""},{"$f":"IF(A242=\"\",\"\",E242/$G$3)","v":""}]
[{"$f":"IF('Clearing Calculations'!A237=\"\",\"\",'Clearing Calculations'!A237)","v":""},{"$f":"IF('Clearing Calculations'!A237,'Clearing Calculations'!B237,\"\")","v":""},{"$f":"IF('Clearing Calculations'!B237,'Clearing Calculations'!C237,\"\")","v":""},"","","",""]
[{"$f":"IF('Clearing Calculations'!A238=\"\",\"\",'Clearing Calculations'!A238)","v":""},{"$f":"IF('Clearing Calculations'!A238,'Clearing Calculations'!B238,\"\")","v":""},{"$f":"IF('Clearing Calculations'!B238,'Clearing Calculations'!C238,\"\")","v":""},"","","",""]
[{"$f":"IF('Clearing Calculations'!A239=\"\",\"\",'Clearing Calculations'!A239)","v":""},{"$f":"IF('Clearing Calculations'!A239,'Clearing Calculations'!B239,\"\")","v":""},{"$f":"IF('Clearing Calculations'!B239,'Clearing Calculations'!C239,\"\")","v":""},"","","",""]
[{"$f":"IF('Clearing Calculations'!A240=\"\",\"\",'Clearing Calculations'!A240)","v":""},{"$f":"IF('Clearing Calculations'!A240,'Clearing Calculations'!B240,\"\")","v":""},{"$f":"IF('Clearing Calculations'!B240,'Clearing Calculations'!C240,\"\")","v":""},"","","",""]
[{"$f":"IF('Clearing Calculations'!A241=\"\",\"\",'Clearing Calculations'!A241)","v":""},{"$f":"IF('Clearing Calculations'!A241,'Clearing Calculations'!B241,\"\")","v":""},{"$f":"IF('Clearing Calculations'!B241,'Clearing Calculations'!C241,\"\")","v":""},"","","",""]
[{"$f":"IF('Clearing Calculations'!A242=\"\",\"\",'Clearing Calculations'!A242)","v":""},{"$f":"IF('Clearing Calculations'!A242,'Clearing Calculations'!B242,\"\")","v":""},{"$f":"IF('Clearing Calculations'!B242,'Clearing Calculations'!C242,\"\")","v":""},"","","",""]
[{"$f":"IF('Clearing Calculations'!A243=\"\",\"\",'Clearing Calculations'!A243)","v":""},{"$f":"IF('Clearing Calculations'!A243,'Clearing Calculations'!B243,\"\")","v":""},{"$f":"IF('Clearing Calculations'!B243,'Clearing Calculations'!C243,\"\")","v":""},"","","",""]
[{"$f":"IF('Clearing Calculations'!A244=\"\",\"\",'Clearing Calculations'!A244)","v":""},{"$f":"IF('Clearing Calculations'!A244,'Clearing Calculations'!B244,\"\")","v":""},{"$f":"IF('Clearing Calculations'!B244,'Clearing Calculations'!C244,\"\")","v":""},"","","",""]
[{"$f":"IF('Clearing Calculations'!A245=\"\",\"\",'Clearing Calculations'!A245)","v":""},{"$f":"IF('Clearing Calculations'!A245,'Clearing Calculations'!B245,\"\")","v":""},{"$f":"IF('Clearing Calculations'!B245,'Clearing Calculations'!C245,\"\")","v":""},"","","",""]
[{"$f":"IF('Clearing Calculations'!A246=\"\",\"\",'Clearing Calculations'!A246)","v":""},{"$f":"IF('Clearing Calculations'!A246,'Clearing Calculations'!B246,\"\")","v":""},{"$f":"IF('Clearing Calculations'!B246,'Clearing Calculations'!C246,\"\")","v":""},"","","",""]
[{"$f":"IF('Clearing Calculations'!A247=\"\",\"\",'Clearing Calculations'!A247)","v":""},{"$f":"IF('Clearing Calculations'!A247,'Clearing Calculations'!B247,\"\")","v":""},{"$f":"IF('Clearing Calculations'!B247,'Clearing Calculations'!C247,\"\")","v":""},"","","",""]
[{"$f":"IF('Clearing Calculations'!A248=\"\",\"\",'Clearing Calculations'!A248)","v":""},{"$f":"IF('Clearing Calculations'!A248,'Clearing Calculations'!B248,\"\")","v":""},{"$f":"IF('Clearing Calculations'!B248,'Clearing Calculations'!C248,\"\")","v":""},"","","",""]
[{"$f":"IF('Clearing Calculations'!A249=\"\",\"\",'Clearing Calculations'!A249)","v":""},{"$f":"IF('Clearing Calculations'!A249,'Clearing Calculations'!B249,\"\")","v":""},{"$f":"IF('Clearing Calculations'!B249,'Clearing Calculations'!C249,\"\")","v":""},"","","",""]
[{"$f":"IF('Clearing Calculations'!A250=\"\",\"\",'Clearing Calculations'!A250)","v":""},{"$f":"IF('Clearing Calculations'!A250,'Clearing Calculations'!B250,\"\")","v":""},{"$f":"IF('Clearing Calculations'!B250,'Clearing Calculations'!C250,\"\")","v":""},"","","",""]
[{"$f":"IF('Clearing Calculations'!A251=\"\",\"\",'Clearing Calculations'!A251)","v":""},{"$f":"IF('Clearing Calculations'!A251,'Clearing Calculations'!B251,\"\")","v":""},{"$f":"IF('Clearing Calculations'!B251,'Clearing Calculations'!C251,\"\")","v":""},"","","",""]
[{"$f":"IF('Clearing Calculations'!A252=\"\",\"\",'Clearing Calculations'!A252)","v":""},{"$f":"IF('Clearing Calculations'!A252,'Clearing Calculations'!B252,\"\")","v":""},{"$f":"IF('Clearing Calculations'!B252,'Clearing Calculations'!C252,\"\")","v":""},"","","",""]
[{"$f":"IF('Clearing Calculations'!A253=\"\",\"\",'Clearing Calculations'!A253)","v":""},{"$f":"IF('Clearing Calculations'!A253,'Clearing Calculations'!B253,\"\")","v":""},{"$f":"IF('Clearing Calculations'!B253,'Clearing Calculations'!C253,\"\")","v":""},"","","",""]
[{"$f":"IF('Clearing Calculations'!A254=\"\",\"\",'Clearing Calculations'!A254)","v":""},{"$f":"IF('Clearing Calculations'!A254,'Clearing Calculations'!B254,\"\")","v":""},{"$f":"IF('Clearing Calculations'!B254,'Clearing Calculations'!C254,\"\")","v":""},"","","",""]
[{"$f":"IF('Clearing Calculations'!A255=\"\",\"\",'Clearing Calculations'!A255)","v":""},{"$f":"IF('Clearing Calculations'!A255,'Clearing Calculations'!B255,\"\")","v":""},{"$f":"IF('Clearing Calculations'!B255,'Clearing Calculations'!C255,\"\")","v":""},"","","",""]
[{"$f":"IF('Clearing Calculations'!A256=\"\",\"\",'Clearing Calculations'!A256)","v":""},{"$f":"IF('Clearing Calculations'!A256,'Clearing Calculations'!B256,\"\")","v":""},{"$f":"IF('Clearing Calculations'!B256,'Clearing Calculations'!C256,\"\")","v":""},"","","",""]
[{"$f":"IF('Clearing Calculations'!A257=\"\",\"\",'Clearing Calculations'!A257)","v":""},{"$f":"IF('Clearing Calculations'!A257,'Clearing Calculations'!B257,\"\")","v":""},{"$f":"IF('Clearing Calculations'!B257,'Clearing Calculations'!C257,\"\")","v":""},"","","",""]
[{"$f":"IF('Clearing Calculations'!A258=\"\",\"\",'Clearing Calculations'!A258)","v":""},{"$f":"IF('Clearing Calculations'!A258,'Clearing Calculations'!B258,\"\")","v":""},{"$f":"IF('Clearing Calculations'!B258,'Clearing Calculations'!C258,\"\")","v":""},"","","",""]
[{"$f":"IF('Clearing Calculations'!A259=\"\",\"\",'Clearing Calculations'!A259)","v":""},{"$f":"IF('Clearing Calculations'!A259,'Clearing Calculations'!B259,\"\")","v":""},{"$f":"IF('Clearing Calculations'!B259,'Clearing Calculations'!C259,\"\")","v":""},"","","",""]
[{"$f":"IF('Clearing Calculations'!A260=\"\",\"\",'Clearing Calculations'!A260)","v":""},{"$f":"IF('Clearing Calculations'!A260,'Clearing Calculations'!B260,\"\")","v":""},{"$f":"IF('Clearing Calculations'!B260,'Clearing Calculations'!C260,\"\")","v":""},"","","",""]
[{"$f":"IF('Clearing Calculations'!A261=\"\",\"\",'Clearing Calculations'!A261)","v":""},{"$f":"IF('Clearing Calculations'!A261,'Clearing Calculations'!B261,\"\")","v":""},{"$f":"IF('Clearing Calculations'!B261,'Clearing Calculations'!C261,\"\")","v":""},"","","",""]
[{"$f":"IF('Clearing Calculations'!A262=\"\",\"\",'Clearing Calculations'!A262)","v":""},{"$f":"IF('Clearing Calculations'!A262,'Clearing Calculations'!B262,\"\")","v":""},{"$f":"IF('Clearing Calculations'!B262,'Clearing Calculations'!C262,\"\")","v":""},"","","",""]
[{"$f":"IF('Clearing Calculations'!A263=\"\",\"\",'Clearing Calculations'!A263)","v":""},{"$f":"IF('Clearing Calculations'!A263,'Clearing Calculations'!B263,\"\")","v":""},{"$f":"IF('Clearing Calculations'!B263,'Clearing Calculations'!C263,\"\")","v":""},"","","",""]
[{"$f":"IF('Clearing Calculations'!A264=\"\",\"\",'Clearing Calculations'!A264)","v":""},{"$f":"IF('Clearing Calculations'!A264,'Clearing Calculations'!B264,\"\")","v":""},{"$f":"IF('Clearing Calculations'!B264,'Clearing Calculations'!C264,\"\")","v":""},"","","",""]
[{"$f":"IF('Clearing Calculations'!A265=\"\",\"\",'Clearing Calculations'!A265)","v":""},{"$f":"IF('Clearing Calculations'!A265,'Clearing Calculations'!B265,\"\")","v":""},{"$f":"IF('Clearing Calculations'!B265,'Clearing Calculations'!C265,\"\")","v":""},"","","",""]
[{"$f":"IF('Clearing Calculations'!A266=\"\",\"\",'Clearing Calculations'!A266)","v":""},{"$f":"IF('Clearing Calculations'!A266,'Clearing Calculations'!B266,\"\")","v":""},{"$f":"IF('Clearing Calculations'!B266,'Clearing Calculations'!C266,\"\")","v":""},"","","",""]
[{"$f":"IF('Clearing Calculations'!A267=\"\",\"\",'Clearing Calculations'!A267)","v":""},{"$f":"IF('Clearing Calculations'!A267,'Clearing Calculations'!B267,\"\")","v":""},{"$f":"IF('Clearing Calculations'!B267,'Clearing Calculations'!C267,\"\")","v":""},"","","",""]
[{"$f":"IF('Clearing Calculations'!A268=\"\",\"\",'Clearing Calculations'!A268)","v":""},{"$f":"IF('Clearing Calculations'!A268,'Clearing Calculations'!B268,\"\")","v":""},{"$f":"IF('Clearing Calculations'!B268,'Clearing Calculations'!C268,\"\")","v":""},"","","",""]
[{"$f":"IF('Clearing Calculations'!A269=\"\",\"\",'Clearing Calculations'!A269)","v":""},{"$f":"IF('Clearing Calculations'!A269,'Clearing Calculations'!B269,\"\")","v":""},{"$f":"IF('Clearing Calculations'!B269,'Clearing Calculations'!C269,\"\")","v":""},"","","",""]
[{"$f":"IF('Clearing Calculations'!A270=\"\",\"\",'Clearing Calculations'!A270)","v":""},{"$f":"IF('Clearing Calculations'!A270,'Clearing Calculations'!B270,\"\")","v":""},{"$f":"IF('Clearing Calculations'!B270,'Clearing Calculations'!C270,\"\")","v":""},"","","",""]
[{"$f":"IF('Clearing Calculations'!A271=\"\",\"\",'Clearing Calculations'!A271)","v":""},{"$f":"IF('Clearing Calculations'!A271,'Clearing Calculations'!B271,\"\")","v":""},{"$f":"IF('Clearing Calculations'!B271,'Clearing Calculations'!C271,\"\")","v":""},"","","",""]
[{"$f":"IF('Clearing Calculations'!A272=\"\",\"\",'Clearing Calculations'!A272)","v":""},{"$f":"IF('Clearing Calculations'!A272,'Clearing Calculations'!B272,\"\")","v":""},{"$f":"IF('Clearing Calculations'!B272,'Clearing Calculations'!C272,\"\")","v":""},"","","",""]
[{"$f":"IF('Clearing Calculations'!A273=\"\",\"\",'Clearing Calculations'!A273)","v":""},{"$f":"IF('Clearing Calculations'!A273,'Clearing Calculations'!B273,\"\")","v":""},{"$f":"IF('Clearing Calculations'!B273,'Clearing Calculations'!C273,\"\")","v":""},"","","",""]
[{"$f":"IF('Clearing Calculations'!A274=\"\",\"\",'Clearing Calculations'!A274)","v":""},{"$f":"IF('Clearing Calculations'!A274,'Clearing Calculations'!B274,\"\")","v":""},{"$f":"IF('Clearing Calculations'!B274,'Clearing Calculations'!C274,\"\")","v":""},"","","",""]
[{"$f":"IF('Clearing Calculations'!A275=\"\",\"\",'Clearing Calculations'!A275)","v":""},{"$f":"IF('Clearing Calculations'!A275,'Clearing Calculations'!B275,\"\")","v":""},{"$f":"IF('Clearing Calculations'!B275,'Clearing Calculations'!C275,\"\")","v":""},"","","",""]
[{"$f":"IF('Clearing Calculations'!A276=\"\",\"\",'Clearing Calculations'!A276)","v":""},{"$f":"IF('Clearing Calculations'!A276,'Clearing Calculations'!B276,\"\")","v":""},{"$f":"IF('Clearing Calculations'!B276,'Clearing Calculations'!C276,\"\")","v":""},"","","",""]
[{"$f":"IF('Clearing Calculations'!A277=\"\",\"\",'Clearing Calculations'!A277)","v":""},{"$f":"IF('Clearing Calculations'!A277,'Clearing Calculations'!B277,\"\")","v":""},{"$f":"IF('Clearing Calculations'!B277,'Clearing Calculations'!C277,\"\")","v":""},"","","",""]
[{"$f":"IF('Clearing Calculations'!A278=\"\",\"\",'Clearing Calculations'!A278)","v":""},{"$f":"IF('Clearing Calculations'!A278,'Clearing Calculations'!B278,\"\")","v":""},{"$f":"IF('Clearing Calculations'!B278,'Clearing Calculations'!C278,\"\")","v":""},"","","",""]
[{"$f":"IF('Clearing Calculations'!A279=\"\",\"\",'Clearing Calculations'!A279)","v":""},{"$f":"IF('Clearing Calculations'!A279,'Clearing Calculations'!B279,\"\")","v":""},{"$f":"IF('Clearing Calculations'!B279,'Clearing Calculations'!C279,\"\")","v":""},"","","",""]
[{"$f":"IF('Clearing Calculations'!A280=\"\",\"\",'Clearing Calculations'!A280)","v":""},{"$f":"IF('Clearing Calculations'!A280,'Clearing Calculations'!B280,\"\")","v":""},{"$f":"IF('Clearing Calculations'!B280,'Clearing Calculations'!C280,\"\")","v":""},"","","",""]
[{"$f":"IF('Clearing Calculations'!A281=\"\",\"\",'Clearing Calculations'!A281)","v":""},{"$f":"IF('Clearing Calculations'!A281,'Clearing Calculations'!B281,\"\")","v":""},{"$f":"IF('Clearing Calculations'!B281,'Clearing Calculations'!C281,\"\")","v":""},"","","",""]
[{"$f":"IF('Clearing Calculations'!A282=\"\",\"\",'Clearing Calculations'!A282)","v":""},{"$f":"IF('Clearing Calculations'!A282,'Clearing Calculations'!B282,\"\")","v":""},{"$f":"IF('Clearing Calculations'!B282,'Clearing Calculations'!C282,\"\")","v":""},"","","",""]
[{"$f":"IF('Clearing Calculations'!A283=\"\",\"\",'Clearing Calculations'!A283)","v":""},{"$f":"IF('Clearing Calculations'!A283,'Clearing Calculations'!B283,\"\")","v":""},{"$f":"IF('Clearing Calculations'!B283,'Clearing Calculations'!C283,\"\")","v":""},"","","",""]
[{"$f":"IF('Clearing Calculations'!A284=\"\",\"\",'Clearing Calculations'!A284)","v":""},{"$f":"IF('Clearing Calculations'!A284,'Clearing Calculations'!B284,\"\")","v":""},{"$f":"IF('Clearing Calculations'!B284,'Clearing Calculations'!C284,\"\")","v":""},"","","",""]
[{"$f":"IF('Clearing Calculations'!A285=\"\",\"\",'Clearing Calculations'!A285)","v":""},{"$f":"IF('Clearing Calculations'!A285,'Clearing Calculations'!B285,\"\")","v":""},{"$f":"IF('Clearing Calculations'!B285,'Clearing Calculations'!C285,\"\")","v":""},"","","",""]
[{"$f":"IF('Clearing Calculations'!A286=\"\",\"\",'Clearing Calculations'!A286)","v":""},{"$f":"IF('Clearing Calculations'!A286,'Clearing Calculations'!B286,\"\")","v":""},{"$f":"IF('Clearing Calculations'!B286,'Clearing Calculations'!C286,\"\")","v":""},"","","",""]
[{"$f":"IF('Clearing Calculations'!A287=\"\",\"\",'Clearing Calculations'!A287)","v":""},{"$f":"IF('Clearing Calculations'!A287,'Clearing Calculations'!B287,\"\")","v":""},{"$f":"IF('Clearing Calculations'!B287,'Clearing Calculations'!C287,\"\")","v":""},"","","",""]
[{"$f":"IF('Clearing Calculations'!A288=\"\",\"\",'Clearing Calculations'!A288)","v":""},{"$f":"IF('Clearing Calculations'!A288,'Clearing Calculations'!B288,\"\")","v":""},{"$f":"IF('Clearing Calculations'!B288,'Clearing Calculations'!C288,\"\")","v":""},"","","",""]
[{"$f":"IF('Clearing Calculations'!A289=\"\",\"\",'Clearing Calculations'!A289)","v":""},{"$f":"IF('Clearing Calculations'!A289,'Clearing Calculations'!B289,\"\")","v":""},{"$f":"IF('Clearing Calculations'!B289,'Clearing Calculations'!C289,\"\")","v":""},"","","",""]
[{"$f":"IF('Clearing Calculations'!A290=\"\",\"\",'Clearing Calculations'!A290)","v":""},{"$f":"IF('Clearing Calculations'!A290,'Clearing Calculations'!B290,\"\")","v":""},{"$f":"IF('Clearing Calculations'!B290,'Clearing Calculations'!C290,\"\")","v":""},"","","",""]
[{"$f":"IF('Clearing Calculations'!A291=\"\",\"\",'Clearing Calculations'!A291)","v":""},{"$f":"IF('Clearing Calculations'!A291,'Clearing Calculations'!B291,\"\")","v":""},{"$f":"IF('Clearing Calculations'!B291,'Clearing Calculations'!C291,\"\")","v":""},"","","",""]
[{"$f":"IF('Clearing Calculations'!A292=\"\",\"\",'Clearing Calculations'!A292)","v":""},{"$f":"IF('Clearing Calculations'!A292,'Clearing Calculations'!B292,\"\")","v":""},{"$f":"IF('Clearing Calculations'!B292,'Clearing Calculations'!C292,\"\")","v":""},"","","",""]
[{"$f":"IF('Clearing Calculations'!A293=\"\",\"\",'Clearing Calculations'!A293)","v":""},{"$f":"IF('Clearing Calculations'!A293,'Clearing Calculations'!B293,\"\")","v":""},{"$f":"IF('Clearing Calculations'!B293,'Clearing Calculations'!C293,\"\")","v":""},"","","",""]
[{"$f":"IF('Clearing Calculations'!A294=\"\",\"\",'Clearing Calculations'!A294)","v":""},{"$f":"IF('Clearing Calculations'!A294,'Clearing Calculations'!B294,\"\")","v":""},{"$f":"IF('Clearing Calculations'!B294,'Clearing Calculations'!C294,\"\")","v":""},"","","",""]
[{"$f":"IF('Clearing Calculations'!A295=\"\",\"\",'Clearing Calculations'!A295)","v":""},{"$f":"IF('Clearing Calculations'!A295,'Clearing Calculations'!B295,\"\")","v":""},{"$f":"IF('Clearing Calculations'!B295,'Clearing Calculations'!C295,\"\")","v":""},"","","",""]
[{"$f":"IF('Clearing Calculations'!A296=\"\",\"\",'Clearing Calculations'!A296)","v":""},{"$f":"IF('Clearing Calculations'!A296,'Clearing Calculations'!B296,\"\")","v":""},{"$f":"IF('Clearing Calculations'!B296,'Clearing Calculations'!C296,\"\")","v":""},"","","",""]
[{"$f":"IF('Clearing Calculations'!A297=\"\",\"\",'Clearing Calculations'!A297)","v":""},{"$f":"IF('Clearing Calculations'!A297,'Clearing Calculations'!B297,\"\")","v":""},{"$f":"IF('Clearing Calculations'!B297,'Clearing Calculations'!C297,\"\")","v":""},"","","",""]
[{"$f":"IF('Clearing Calculations'!A298=\"\",\"\",'Clearing Calculations'!A298)","v":""},{"$f":"IF('Clearing Calculations'!A298,'Clearing Calculations'!B298,\"\")","v":""},{"$f":"IF('Clearing Calculations'!B298,'Clearing Calculations'!C298,\"\")","v":""},"","","",""]
[{"$f":"IF('Clearing Calculations'!A299=\"\",\"\",'Clearing Calculations'!A299)","v":""},{"$f":"IF('Clearing Calculations'!A299,'Clearing Calculations'!B299,\"\")","v":""},{"$f":"IF('Clearing Calculations'!B299,'Clearing Calculations'!C299,\"\")","v":""},"","","",""]
[{"$f":"IF('Clearing Calculations'!A300=\"\",\"\",'Clearing Calculations'!A300)","v":""},{"$f":"IF('Clearing Calculations'!A300,'Clearing Calculations'!B300,\"\")","v":""},{"$f":"IF('Clearing Calculations'!B300,'Clearing Calculations'!C300,\"\")","v":""},{"$f":"IF(A306=\"\",\"\",$B306+$C306)","v":""},{"$f":"IF(A306=\"\",\"\",(D306+D305)/2*(A306-A305))","v":""},{"$f":"IF(A306=\"\",\"\",(E306/9))","v":""},{"$f":"IF(A306=\"\",\"\",E306/$G$3)","v":""}]
[{"$f":"IF('Clearing Calculations'!A301=\"\",\"\",'Clearing Calculations'!A301)","v":""},{"$f":"IF('Clearing Calculations'!A301,'Clearing Calculations'!B301,\"\")","v":""},{"$f":"IF('Clearing Calculations'!B301,'Clearing Calculations'!C301,\"\")","v":""},"","","",""]
[{"$f":"IF('Clearing Calculations'!A302=\"\",\"\",'Clearing Calculations'!A302)","v":""},{"$f":"IF('Clearing Calculations'!A302,'Clearing Calculations'!B302,\"\")","v":""},{"$f":"IF('Clearing Calculations'!B302,'Clearing Calculations'!C302,\"\")","v":""},"","","",""]
[{"$f":"IF('Clearing Calculations'!A303=\"\",\"\",'Clearing Calculations'!A303)","v":""},{"$f":"IF('Clearing Calculations'!A303,'Clearing Calculations'!B303,\"\")","v":""},{"$f":"IF('Clearing Calculations'!B303,'Clearing Calculations'!C303,\"\")","v":""},"","","",""]
[{"$f":"IF('Clearing Calculations'!A304=\"\",\"\",'Clearing Calculations'!A304)","v":""},{"$f":"IF('Clearing Calculations'!A304,'Clearing Calculations'!B304,\"\")","v":""},{"$f":"IF('Clearing Calculations'!B304,'Clearing Calculations'!C304,\"\")","v":""},"","","",""]
[{"$f":"IF('Clearing Calculations'!A305=\"\",\"\",'Clearing Calculations'!A305)","v":""},{"$f":"IF('Clearing Calculations'!A305,'Clearing Calculations'!B305,\"\")","v":""},{"$f":"IF('Clearing Calculations'!B305,'Clearing Calculations'!C305,\"\")","v":""},"","","",""]
[{"$f":"IF('Clearing Calculations'!A306=\"\",\"\",'Clearing Calculations'!A306)","v":""},{"$f":"IF('Clearing Calculations'!A306,'Clearing Calculations'!B306,\"\")","v":""},{"$f":"IF('Clearing Calculations'!B306,'Clearing Calculations'!C306,\"\")","v":""},"","","",""]
[{"$f":"IF('Clearing Calculations'!A307=\"\",\"\",'Clearing Calculations'!A307)","v":""},{"$f":"IF('Clearing Calculations'!A307,'Clearing Calculations'!B307,\"\")","v":""},{"$f":"IF('Clearing Calculations'!B307,'Clearing Calculations'!C307,\"\")","v":""},"","","",""]
[{"$f":"IF('Clearing Calculations'!A308=\"\",\"\",'Clearing Calculations'!A308)","v":""},{"$f":"IF('Clearing Calculations'!A308,'Clearing Calculations'!B308,\"\")","v":""},{"$f":"IF('Clearing Calculations'!B308,'Clearing Calculations'!C308,\"\")","v":""},"","","",""]
[{"$f":"IF('Clearing Calculations'!A309=\"\",\"\",'Clearing Calculations'!A309)","v":""},{"$f":"IF('Clearing Calculations'!A309,'Clearing Calculations'!B309,\"\")","v":""},{"$f":"IF('Clearing Calculations'!B309,'Clearing Calculations'!C309,\"\")","v":""},"","","",""]
[{"$f":"IF('Clearing Calculations'!A310=\"\",\"\",'Clearing Calculations'!A310)","v":""},{"$f":"IF('Clearing Calculations'!A310,'Clearing Calculations'!B310,\"\")","v":""},{"$f":"IF('Clearing Calculations'!B310,'Clearing Calculations'!C310,\"\")","v":""},"","","",""]
[{"$f":"IF('Clearing Calculations'!A311=\"\",\"\",'Clearing Calculations'!A311)","v":""},{"$f":"IF('Clearing Calculations'!A311,'Clearing Calculations'!B311,\"\")","v":""},{"$f":"IF('Clearing Calculations'!B311,'Clearing Calculations'!C311,\"\")","v":""},"","","",""]
[{"$f":"IF('Clearing Calculations'!A312=\"\",\"\",'Clearing Calculations'!A312)","v":""},{"$f":"IF('Clearing Calculations'!A312,'Clearing Calculations'!B312,\"\")","v":""},{"$f":"IF('Clearing Calculations'!B312,'Clearing Calculations'!C312,\"\")","v":""},"","","",""]
[{"$f":"IF('Clearing Calculations'!A313=\"\",\"\",'Clearing Calculations'!A313)","v":""},{"$f":"IF('Clearing Calculations'!A313,'Clearing Calculations'!B313,\"\")","v":""},{"$f":"IF('Clearing Calculations'!B313,'Clearing Calculations'!C313,\"\")","v":""},"","","",""]
[{"$f":"IF('Clearing Calculations'!A314=\"\",\"\",'Clearing Calculations'!A314)","v":""},{"$f":"IF('Clearing Calculations'!A314,'Clearing Calculations'!B314,\"\")","v":""},{"$f":"IF('Clearing Calculations'!B314,'Clearing Calculations'!C314,\"\")","v":""},"","","",""]
[{"$f":"IF('Clearing Calculations'!A315=\"\",\"\",'Clearing Calculations'!A315)","v":""},{"$f":"IF('Clearing Calculations'!A315,'Clearing Calculations'!B315,\"\")","v":""},{"$f":"IF('Clearing Calculations'!B315,'Clearing Calculations'!C315,\"\")","v":""},"","","",""]
[{"$f":"IF('Clearing Calculations'!A316=\"\",\"\",'Clearing Calculations'!A316)","v":""},{"$f":"IF('Clearing Calculations'!A316,'Clearing Calculations'!B316,\"\")","v":""},{"$f":"IF('Clearing Calculations'!B316,'Clearing Calculations'!C316,\"\")","v":""},"","","",""]
[{"$f":"IF('Clearing Calculations'!A317=\"\",\"\",'Clearing Calculations'!A317)","v":""},{"$f":"IF('Clearing Calculations'!A317,'Clearing Calculations'!B317,\"\")","v":""},{"$f":"IF('Clearing Calculations'!B317,'Clearing Calculations'!C317,\"\")","v":""},"","","",""]
[{"$f":"IF('Clearing Calculations'!A318=\"\",\"\",'Clearing Calculations'!A318)","v":""},{"$f":"IF('Clearing Calculations'!A318,'Clearing Calculations'!B318,\"\")","v":""},{"$f":"IF('Clearing Calculations'!B318,'Clearing Calculations'!C318,\"\")","v":""},"","","",""]
[{"$f":"IF('Clearing Calculations'!A319=\"\",\"\",'Clearing Calculations'!A319)","v":""},{"$f":"IF('Clearing Calculations'!A319,'Clearing Calculations'!B319,\"\")","v":""},{"$f":"IF('Clearing Calculations'!B319,'Clearing Calculations'!C319,\"\")","v":""},"","","",""]
[{"$f":"IF('Clearing Calculations'!A320=\"\",\"\",'Clearing Calculations'!A320)","v":""},{"$f":"IF('Clearing Calculations'!A320,'Clearing Calculations'!B320,\"\")","v":""},{"$f":"IF('Clearing Calculations'!B320,'Clearing Calculations'!C320,\"\")","v":""},"","","",""]
[{"$f":"IF('Clearing Calculations'!A321=\"\",\"\",'Clearing Calculations'!A321)","v":""},{"$f":"IF('Clearing Calculations'!A321,'Clearing Calculations'!B321,\"\")","v":""},{"$f":"IF('Clearing Calculations'!B321,'Clearing Calculations'!C321,\"\")","v":""},"","","",""]
[{"$f":"IF('Clearing Calculations'!A322=\"\",\"\",'Clearing Calculations'!A322)","v":""},{"$f":"IF('Clearing Calculations'!A322,'Clearing Calculations'!B322,\"\")","v":""},{"$f":"IF('Clearing Calculations'!B322,'Clearing Calculations'!C322,\"\")","v":""},"","","",""]
[{"$f":"IF('Clearing Calculations'!A323=\"\",\"\",'Clearing Calculations'!A323)","v":""},{"$f":"IF('Clearing Calculations'!A323,'Clearing Calculations'!B323,\"\")","v":""},{"$f":"IF('Clearing Calculations'!B323,'Clearing Calculations'!C323,\"\")","v":""},"","","",""]
[{"$f":"IF('Clearing Calculations'!A324=\"\",\"\",'Clearing Calculations'!A324)","v":""},{"$f":"IF('Clearing Calculations'!A324,'Clearing Calculations'!B324,\"\")","v":""},{"$f":"IF('Clearing Calculations'!B324,'Clearing Calculations'!C324,\"\")","v":""},"","","",""]
[{"$f":"IF('Clearing Calculations'!A325=\"\",\"\",'Clearing Calculations'!A325)","v":""},{"$f":"IF('Clearing Calculations'!A325,'Clearing Calculations'!B325,\"\")","v":""},{"$f":"IF('Clearing Calculations'!B325,'Clearing Calculations'!C325,\"\")","v":""},"","","",""]
[{"$f":"IF('Clearing Calculations'!A326=\"\",\"\",'Clearing Calculations'!A326)","v":""},{"$f":"IF('Clearing Calculations'!A326,'Clearing Calculations'!B326,\"\")","v":""},{"$f":"IF('Clearing Calculations'!B326,'Clearing Calculations'!C326,\"\")","v":""},"","","",""]
[{"$f":"IF('Clearing Calculations'!A327=\"\",\"\",'Clearing Calculations'!A327)","v":""},{"$f":"IF('Clearing Calculations'!A327,'Clearing Calculations'!B327,\"\")","v":""},{"$f":"IF('Clearing Calculations'!B327,'Clearing Calculations'!C327,\"\")","v":""},"","","",""]
[{"$f":"IF('Clearing Calculations'!A328=\"\",\"\",'Clearing Calculations'!A328)","v":""},{"$f":"IF('Clearing Calculations'!A328,'Clearing Calculations'!B328,\"\")","v":""},{"$f":"IF('Clearing Calculations'!B328,'Clearing Calculations'!C328,\"\")","v":""},"","","",""]
[{"$f":"IF('Clearing Calculations'!A329=\"\",\"\",'Clearing Calculations'!A329)","v":""},{"$f":"IF('Clearing Calculations'!A329,'Clearing Calculations'!B329,\"\")","v":""},{"$f":"IF('Clearing Calculations'!B329,'Clearing Calculations'!C329,\"\")","v":""},"","","",""]
[{"$f":"IF('Clearing Calculations'!A330=\"\",\"\",'Clearing Calculations'!A330)","v":""},{"$f":"IF('Clearing Calculations'!A330,'Clearing Calculations'!B330,\"\")","v":""},{"$f":"IF('Clearing Calculations'!B330,'Clearing Calculations'!C330,\"\")","v":""},"","","",""]
[{"$f":"IF('Clearing Calculations'!A331=\"\",\"\",'Clearing Calculations'!A331)","v":""},{"$f":"IF('Clearing Calculations'!A331,'Clearing Calculations'!B331,\"\")","v":""},{"$f":"IF('Clearing Calculations'!B331,'Clearing Calculations'!C331,\"\")","v":""},"","","",""]
[{"$f":"IF('Clearing Calculations'!A332=\"\",\"\",'Clearing Calculations'!A332)","v":""},{"$f":"IF('Clearing Calculations'!A332,'Clearing Calculations'!B332,\"\")","v":""},{"$f":"IF('Clearing Calculations'!B332,'Clearing Calculations'!C332,\"\")","v":""},"","","",""]
[{"$f":"IF('Clearing Calculations'!A333=\"\",\"\",'Clearing Calculations'!A333)","v":""},{"$f":"IF('Clearing Calculations'!A333,'Clearing Calculations'!B333,\"\")","v":""},{"$f":"IF('Clearing Calculations'!B333,'Clearing Calculations'!C333,\"\")","v":""},"","","",""]
[{"$f":"IF('Clearing Calculations'!A334=\"\",\"\",'Clearing Calculations'!A334)","v":""},{"$f":"IF('Clearing Calculations'!A334,'Clearing Calculations'!B334,\"\")","v":""},{"$f":"IF('Clearing Calculations'!B334,'Clearing Calculations'!C334,\"\")","v":""},"","","",""]
[{"$f":"IF('Clearing Calculations'!A335=\"\",\"\",'Clearing Calculations'!A335)","v":""},{"$f":"IF('Clearing Calculations'!A335,'Clearing Calculations'!B335,\"\")","v":""},{"$f":"IF('Clearing Calculations'!B335,'Clearing Calculations'!C335,\"\")","v":""},"","","",""]
[{"$f":"IF('Clearing Calculations'!A336=\"\",\"\",'Clearing Calculations'!A336)","v":""},{"$f":"IF('Clearing Calculations'!A336,'Clearing Calculations'!B336,\"\")","v":""},{"$f":"IF('Clearing Calculations'!B336,'Clearing Calculations'!C336,\"\")","v":""},"","","",""]
[{"$f":"IF('Clearing Calculations'!A337=\"\",\"\",'Clearing Calculations'!A337)","v":""},{"$f":"IF('Clearing Calculations'!A337,'Clearing Calculations'!B337,\"\")","v":""},{"$f":"IF('Clearing Calculations'!B337,'Clearing Calculations'!C337,\"\")","v":""},"","","",""]
[{"$f":"IF('Clearing Calculations'!A338=\"\",\"\",'Clearing Calculations'!A338)","v":""},{"$f":"IF('Clearing Calculations'!A338,'Clearing Calculations'!B338,\"\")","v":""},{"$f":"IF('Clearing Calculations'!B338,'Clearing Calculations'!C338,\"\")","v":""},"","","",""]
[{"$f":"IF('Clearing Calculations'!A339=\"\",\"\",'Clearing Calculations'!A339)","v":""},{"$f":"IF('Clearing Calculations'!A339,'Clearing Calculations'!B339,\"\")","v":""},{"$f":"IF('Clearing Calculations'!B339,'Clearing Calculations'!C339,\"\")","v":""},"","","",""]
[{"$f":"IF('Clearing Calculations'!A340=\"\",\"\",'Clearing Calculations'!A340)","v":""},{"$f":"IF('Clearing Calculations'!A340,'Clearing Calculations'!B340,\"\")","v":""},{"$f":"IF('Clearing Calculations'!B340,'Clearing Calculations'!C340,\"\")","v":""},"","","",""]
[{"$f":"IF('Clearing Calculations'!A341=\"\",\"\",'Clearing Calculations'!A341)","v":""},{"$f":"IF('Clearing Calculations'!A341,'Clearing Calculations'!B341,\"\")","v":""},{"$f":"IF('Clearing Calculations'!B341,'Clearing Calculations'!C341,\"\")","v":""},"","","",""]
[{"$f":"IF('Clearing Calculations'!A342=\"\",\"\",'Clearing Calculations'!A342)","v":""},{"$f":"IF('Clearing Calculations'!A342,'Clearing Calculations'!B342,\"\")","v":""},{"$f":"IF('Clearing Calculations'!B342,'Clearing Calculations'!C342,\"\")","v":""},"","","",""]
[{"$f":"IF('Clearing Calculations'!A343=\"\",\"\",'Clearing Calculations'!A343)","v":""},{"$f":"IF('Clearing Calculations'!A343,'Clearing Calculations'!B343,\"\")","v":""},{"$f":"IF('Clearing Calculations'!B343,'Clearing Calculations'!C343,\"\")","v":""},"","","",""]
[{"$f":"IF('Clearing Calculations'!A344=\"\",\"\",'Clearing Calculations'!A344)","v":""},{"$f":"IF('Clearing Calculations'!A344,'Clearing Calculations'!B344,\"\")","v":""},{"$f":"IF('Clearing Calculations'!B344,'Clearing Calculations'!C344,\"\")","v":""},"","","",""]
[{"$f":"IF('Clearing Calculations'!A345=\"\",\"\",'Clearing Calculations'!A345)","v":""},{"$f":"IF('Clearing Calculations'!A345,'Clearing Calculations'!B345,\"\")","v":""},{"$f":"IF('Clearing Calculations'!B345,'Clearing Calculations'!C345,\"\")","v":""},"","","",""]
[{"$f":"IF('Clearing Calculations'!A346=\"\",\"\",'Clearing Calculations'!A346)","v":""},{"$f":"IF('Clearing Calculations'!A346,'Clearing Calculations'!B346,\"\")","v":""},{"$f":"IF('Clearing Calculations'!B346,'Clearing Calculations'!C346,\"\")","v":""},"","","",""]
[{"$f":"IF('Clearing Calculations'!A347=\"\",\"\",'Clearing Calculations'!A347)","v":""},{"$f":"IF('Clearing Calculations'!A347,'Clearing Calculations'!B347,\"\")","v":""},{"$f":"IF('Clearing Calculations'!B347,'Clearing Calculations'!C347,\"\")","v":""},"","","",""]
[{"$f":"IF('Clearing Calculations'!A348=\"\",\"\",'Clearing Calculations'!A348)","v":""},{"$f":"IF('Clearing Calculations'!A348,'Clearing Calculations'!B348,\"\")","v":""},{"$f":"IF('Clearing Calculations'!B348,'Clearing Calculations'!C348,\"\")","v":""},"","","",""]
[{"$f":"IF('Clearing Calculations'!A349=\"\",\"\",'Clearing Calculations'!A349)","v":""},{"$f":"IF('Clearing Calculations'!A349,'Clearing Calculations'!B349,\"\")","v":""},{"$f":"IF('Clearing Calculations'!B349,'Clearing Calculations'!C349,\"\")","v":""},"","","",""]
[{"$f":"IF('Clearing Calculations'!A350=\"\",\"\",'Clearing Calculations'!A350)","v":""},{"$f":"IF('Clearing Calculations'!A350,'Clearing Calculations'!B350,\"\")","v":""},{"$f":"IF('Clearing Calculations'!B350,'Clearing Calculations'!C350,\"\")","v":""},"","","",""]
[{"$f":"IF('Clearing Calculations'!A351=\"\",\"\",'Clearing Calculations'!A351)","v":""},{"$f":"IF('Clearing Calculations'!A351,'Clearing Calculations'!B351,\"\")","v":""},{"$f":"IF('Clearing Calculations'!B351,'Clearing Calculations'!C351,\"\")","v":""},"","","",""]
[{"$f":"IF('Clearing Calculations'!A352=\"\",\"\",'Clearing Calculations'!A352)","v":""},{"$f":"IF('Clearing Calculations'!A352,'Clearing Calculations'!B352,\"\")","v":""},{"$f":"IF('Clearing Calculations'!B352,'Clearing Calculations'!C352,\"\")","v":""},"","","",""]
[{"$f":"IF('Clearing Calculations'!A353=\"\",\"\",'Clearing Calculations'!A353)","v":""},{"$f":"IF('Clearing Calculations'!A353,'Clearing Calculations'!B353,\"\")","v":""},{"$f":"IF('Clearing Calculations'!B353,'Clearing Calculations'!C353,\"\")","v":""},"","","",""]
[{"$f":"IF('Clearing Calculations'!A354=\"\",\"\",'Clearing Calculations'!A354)","v":""},{"$f":"IF('Clearing Calculations'!A354,'Clearing Calculations'!B354,\"\")","v":""},{"$f":"IF('Clearing Calculations'!B354,'Clearing Calculations'!C354,\"\")","v":""},"","","",""]
[{"$f":"IF('Clearing Calculations'!A355=\"\",\"\",'Clearing Calculations'!A355)","v":""},{"$f":"IF('Clearing Calculations'!A355,'Clearing Calculations'!B355,\"\")","v":""},{"$f":"IF('Clearing Calculations'!B355,'Clearing Calculations'!C355,\"\")","v":""},"","","",""]
[{"$f":"IF('Clearing Calculations'!A356=\"\",\"\",'Clearing Calculations'!A356)","v":""},{"$f":"IF('Clearing Calculations'!A356,'Clearing Calculations'!B356,\"\")","v":""},{"$f":"IF('Clearing Calculations'!B356,'Clearing Calculations'!C356,\"\")","v":""},"","","",""]
[{"$f":"IF('Clearing Calculations'!A357=\"\",\"\",'Clearing Calculations'!A357)","v":""},{"$f":"IF('Clearing Calculations'!A357,'Clearing Calculations'!B357,\"\")","v":""},{"$f":"IF('Clearing Calculations'!B357,'Clearing Calculations'!C357,\"\")","v":""},"","","",""]
[{"$f":"IF('Clearing Calculations'!A358=\"\",\"\",'Clearing Calculations'!A358)","v":""},{"$f":"IF('Clearing Calculations'!A358,'Clearing Calculations'!B358,\"\")","v":""},{"$f":"IF('Clearing Calculations'!B358,'Clearing Calculations'!C358,\"\")","v":""},"","","",""]
[{"$f":"IF('Clearing Calculations'!A359=\"\",\"\",'Clearing Calculations'!A359)","v":""},{"$f":"IF('Clearing Calculations'!A359,'Clearing Calculations'!B359,\"\")","v":""},{"$f":"IF('Clearing Calculations'!B359,'Clearing Calculations'!C359,\"\")","v":""},"","","",""]
[{"$f":"IF('Clearing Calculations'!A360=\"\",\"\",'Clearing Calculations'!A360)","v":""},{"$f":"IF('Clearing Calculations'!A360,'Clearing Calculations'!B360,\"\")","v":""},{"$f":"IF('Clearing Calculations'!B360,'Clearing Calculations'!C360,\"\")","v":""},"","","",""]
[{"$f":"IF('Clearing Calculations'!A361=\"\",\"\",'Clearing Calculations'!A361)","v":""},{"$f":"IF('Clearing Calculations'!A361,'Clearing Calculations'!B361,\"\")","v":""},{"$f":"IF('Clearing Calculations'!B361,'Clearing Calculations'!C361,\"\")","v":""},"","","",""]
[{"$f":"IF('Clearing Calculations'!A362=\"\",\"\",'Clearing Calculations'!A362)","v":""},{"$f":"IF('Clearing Calculations'!A362,'Clearing Calculations'!B362,\"\")","v":""},{"$f":"IF('Clearing Calculations'!B362,'Clearing Calculations'!C362,\"\")","v":""},"","","",""]
[{"$f":"IF('Clearing Calculations'!A363=\"\",\"\",'Clearing Calculations'!A363)","v":""},{"$f":"IF('Clearing Calculations'!A363,'Clearing Calculations'!B363,\"\")","v":""},{"$f":"IF('Clearing Calculations'!B363,'Clearing Calculations'!C363,\"\")","v":""},"","","",""]
[{"$f":"IF('Clearing Calculations'!A364=\"\",\"\",'Clearing Calculations'!A364)","v":""},{"$f":"IF('Clearing Calculations'!A364,'Clearing Calculations'!B364,\"\")","v":""},{"$f":"IF('Clearing Calculations'!B364,'Clearing Calculations'!C364,\"\")","v":""},{"$f":"IF(A370=\"\",\"\",$B370+$C370)","v":""},{"$f":"IF(A370=\"\",\"\",(D370+D369)/2*(A370-A369))","v":""},{"$f":"IF(A370=\"\",\"\",(E370/9))","v":""},{"$f":"IF(A370=\"\",\"\",E370/$G$3)","v":""}]
[{"$f":"IF('Clearing Calculations'!A365=\"\",\"\",'Clearing Calculations'!A365)","v":""},{"$f":"IF('Clearing Calculations'!A365,'Clearing Calculations'!B365,\"\")","v":""},{"$f":"IF('Clearing Calculations'!B365,'Clearing Calculations'!C365,\"\")","v":""},"","","",""]
[{"$f":"IF('Clearing Calculations'!A366=\"\",\"\",'Clearing Calculations'!A366)","v":""},{"$f":"IF('Clearing Calculations'!A366,'Clearing Calculations'!B366,\"\")","v":""},{"$f":"IF('Clearing Calculations'!B366,'Clearing Calculations'!C366,\"\")","v":""},"","","",""]
[{"$f":"IF('Clearing Calculations'!A367=\"\",\"\",'Clearing Calculations'!A367)","v":""},{"$f":"IF('Clearing Calculations'!A367,'Clearing Calculations'!B367,\"\")","v":""},{"$f":"IF('Clearing Calculations'!B367,'Clearing Calculations'!C367,\"\")","v":""},"","","",""]
[{"$f":"IF('Clearing Calculations'!A368=\"\",\"\",'Clearing Calculations'!A368)","v":""},{"$f":"IF('Clearing Calculations'!A368,'Clearing Calculations'!B368,\"\")","v":""},{"$f":"IF('Clearing Calculations'!B368,'Clearing Calculations'!C368,\"\")","v":""},"","","",""]
[{"$f":"IF('Clearing Calculations'!A369=\"\",\"\",'Clearing Calculations'!A369)","v":""},{"$f":"IF('Clearing Calculations'!A369,'Clearing Calculations'!B369,\"\")","v":""},{"$f":"IF('Clearing Calculations'!B369,'Clearing Calculations'!C369,\"\")","v":""},"","","",""]
[{"$f":"IF('Clearing Calculations'!A370=\"\",\"\",'Clearing Calculations'!A370)","v":""},{"$f":"IF('Clearing Calculations'!A370,'Clearing Calculations'!B370,\"\")","v":""},{"$f":"IF('Clearing Calculations'!B370,'Clearing Calculations'!C370,\"\")","v":""},"","","",""]
[{"$f":"IF('Clearing Calculations'!A371=\"\",\"\",'Clearing Calculations'!A371)","v":""},{"$f":"IF('Clearing Calculations'!A371,'Clearing Calculations'!B371,\"\")","v":""},{"$f":"IF('Clearing Calculations'!B371,'Clearing Calculations'!C371,\"\")","v":""},"","","",""]
[{"$f":"IF('Clearing Calculations'!A372=\"\",\"\",'Clearing Calculations'!A372)","v":""},{"$f":"IF('Clearing Calculations'!A372,'Clearing Calculations'!B372,\"\")","v":""},{"$f":"IF('Clearing Calculations'!B372,'Clearing Calculations'!C372,\"\")","v":""},"","","",""]
[{"$f":"IF('Clearing Calculations'!A373=\"\",\"\",'Clearing Calculations'!A373)","v":""},{"$f":"IF('Clearing Calculations'!A373,'Clearing Calculations'!B373,\"\")","v":""},{"$f":"IF('Clearing Calculations'!B373,'Clearing Calculations'!C373,\"\")","v":""},"","","",""]
[{"$f":"IF('Clearing Calculations'!A374=\"\",\"\",'Clearing Calculations'!A374)","v":""},{"$f":"IF('Clearing Calculations'!A374,'Clearing Calculations'!B374,\"\")","v":""},{"$f":"IF('Clearing Calculations'!B374,'Clearing Calculations'!C374,\"\")","v":""},"","","",""]
[{"$f":"IF('Clearing Calculations'!A375=\"\",\"\",'Clearing Calculations'!A375)","v":""},{"$f":"IF('Clearing Calculations'!A375,'Clearing Calculations'!B375,\"\")","v":""},{"$f":"IF('Clearing Calculations'!B375,'Clearing Calculations'!C375,\"\")","v":""},"","","",""]
[{"$f":"IF('Clearing Calculations'!A376=\"\",\"\",'Clearing Calculations'!A376)","v":""},{"$f":"IF('Clearing Calculations'!A376,'Clearing Calculations'!B376,\"\")","v":""},{"$f":"IF('Clearing Calculations'!B376,'Clearing Calculations'!C376,\"\")","v":""},"","","",""]
[{"$f":"IF('Clearing Calculations'!A377=\"\",\"\",'Clearing Calculations'!A377)","v":""},{"$f":"IF('Clearing Calculations'!A377,'Clearing Calculations'!B377,\"\")","v":""},{"$f":"IF('Clearing Calculations'!B377,'Clearing Calculations'!C377,\"\")","v":""},"","","",""]
[{"$f":"IF('Clearing Calculations'!A378=\"\",\"\",'Clearing Calculations'!A378)","v":""},{"$f":"IF('Clearing Calculations'!A378,'Clearing Calculations'!B378,\"\")","v":""},{"$f":"IF('Clearing Calculations'!B378,'Clearing Calculations'!C378,\"\")","v":""},"","","",""]
[{"$f":"IF('Clearing Calculations'!A379=\"\",\"\",'Clearing Calculations'!A379)","v":""},{"$f":"IF('Clearing Calculations'!A379,'Clearing Calculations'!B379,\"\")","v":""},{"$f":"IF('Clearing Calculations'!B379,'Clearing Calculations'!C379,\"\")","v":""},"","","",""]
[{"$f":"IF('Clearing Calculations'!A380=\"\",\"\",'Clearing Calculations'!A380)","v":""},{"$f":"IF('Clearing Calculations'!A380,'Clearing Calculations'!B380,\"\")","v":""},{"$f":"IF('Clearing Calculations'!B380,'Clearing Calculations'!C380,\"\")","v":""},"","","",""]
[{"$f":"IF('Clearing Calculations'!A381=\"\",\"\",'Clearing Calculations'!A381)","v":""},{"$f":"IF('Clearing Calculations'!A381,'Clearing Calculations'!B381,\"\")","v":""},{"$f":"IF('Clearing Calculations'!B381,'Clearing Calculations'!C381,\"\")","v":""},"","","",""]
[{"$f":"IF('Clearing Calculations'!A382=\"\",\"\",'Clearing Calculations'!A382)","v":""},{"$f":"IF('Clearing Calculations'!A382,'Clearing Calculations'!B382,\"\")","v":""},{"$f":"IF('Clearing Calculations'!B382,'Clearing Calculations'!C382,\"\")","v":""},"","","",""]
[{"$f":"IF('Clearing Calculations'!A383=\"\",\"\",'Clearing Calculations'!A383)","v":""},{"$f":"IF('Clearing Calculations'!A383,'Clearing Calculations'!B383,\"\")","v":""},{"$f":"IF('Clearing Calculations'!B383,'Clearing Calculations'!C383,\"\")","v":""},"","","",""]
[{"$f":"IF('Clearing Calculations'!A384=\"\",\"\",'Clearing Calculations'!A384)","v":""},{"$f":"IF('Clearing Calculations'!A384,'Clearing Calculations'!B384,\"\")","v":""},{"$f":"IF('Clearing Calculations'!B384,'Clearing Calculations'!C384,\"\")","v":""},"","","",""]
[{"$f":"IF('Clearing Calculations'!A385=\"\",\"\",'Clearing Calculations'!A385)","v":""},{"$f":"IF('Clearing Calculations'!A385,'Clearing Calculations'!B385,\"\")","v":""},{"$f":"IF('Clearing Calculations'!B385,'Clearing Calculations'!C385,\"\")","v":""},"","","",""]
[{"$f":"IF('Clearing Calculations'!A386=\"\",\"\",'Clearing Calculations'!A386)","v":""},{"$f":"IF('Clearing Calculations'!A386,'Clearing Calculations'!B386,\"\")","v":""},{"$f":"IF('Clearing Calculations'!B386,'Clearing Calculations'!C386,\"\")","v":""},"","","",""]
[{"$f":"IF('Clearing Calculations'!A387=\"\",\"\",'Clearing Calculations'!A387)","v":""},{"$f":"IF('Clearing Calculations'!A387,'Clearing Calculations'!B387,\"\")","v":""},{"$f":"IF('Clearing Calculations'!B387,'Clearing Calculations'!C387,\"\")","v":""},"","","",""]
[{"$f":"IF('Clearing Calculations'!A388=\"\",\"\",'Clearing Calculations'!A388)","v":""},{"$f":"IF('Clearing Calculations'!A388,'Clearing Calculations'!B388,\"\")","v":""},{"$f":"IF('Clearing Calculations'!B388,'Clearing Calculations'!C388,\"\")","v":""},"","","",""]
[{"$f":"IF('Clearing Calculations'!A389=\"\",\"\",'Clearing Calculations'!A389)","v":""},{"$f":"IF('Clearing Calculations'!A389,'Clearing Calculations'!B389,\"\")","v":""},{"$f":"IF('Clearing Calculations'!B389,'Clearing Calculations'!C389,\"\")","v":""},"","","",""]
[{"$f":"IF('Clearing Calculations'!A390=\"\",\"\",'Clearing Calculations'!A390)","v":""},{"$f":"IF('Clearing Calculations'!A390,'Clearing Calculations'!B390,\"\")","v":""},{"$f":"IF('Clearing Calculations'!B390,'Clearing Calculations'!C390,\"\")","v":""},"","","",""]
[{"$f":"IF('Clearing Calculations'!A391=\"\",\"\",'Clearing Calculations'!A391)","v":""},{"$f":"IF('Clearing Calculations'!A391,'Clearing Calculations'!B391,\"\")","v":""},{"$f":"IF('Clearing Calculations'!B391,'Clearing Calculations'!C391,\"\")","v":""},"","","",""]
[{"$f":"IF('Clearing Calculations'!A392=\"\",\"\",'Clearing Calculations'!A392)","v":""},{"$f":"IF('Clearing Calculations'!A392,'Clearing Calculations'!B392,\"\")","v":""},{"$f":"IF('Clearing Calculations'!B392,'Clearing Calculations'!C392,\"\")","v":""},"","","",""]
[{"$f":"IF('Clearing Calculations'!A393=\"\",\"\",'Clearing Calculations'!A393)","v":""},{"$f":"IF('Clearing Calculations'!A393,'Clearing Calculations'!B393,\"\")","v":""},{"$f":"IF('Clearing Calculations'!B393,'Clearing Calculations'!C393,\"\")","v":""},"","","",""]
[{"$f":"IF('Clearing Calculations'!A394=\"\",\"\",'Clearing Calculations'!A394)","v":""},{"$f":"IF('Clearing Calculations'!A394,'Clearing Calculations'!B394,\"\")","v":""},{"$f":"IF('Clearing Calculations'!B394,'Clearing Calculations'!C394,\"\")","v":""},"","","",""]
[{"$f":"IF('Clearing Calculations'!A395=\"\",\"\",'Clearing Calculations'!A395)","v":""},{"$f":"IF('Clearing Calculations'!A395,'Clearing Calculations'!B395,\"\")","v":""},{"$f":"IF('Clearing Calculations'!B395,'Clearing Calculations'!C395,\"\")","v":""},"","","",""]
[{"$f":"IF('Clearing Calculations'!A396=\"\",\"\",'Clearing Calculations'!A396)","v":""},{"$f":"IF('Clearing Calculations'!A396,'Clearing Calculations'!B396,\"\")","v":""},{"$f":"IF('Clearing Calculations'!B396,'Clearing Calculations'!C396,\"\")","v":""},"","","",""]
[{"$f":"IF('Clearing Calculations'!A397=\"\",\"\",'Clearing Calculations'!A397)","v":""},{"$f":"IF('Clearing Calculations'!A397,'Clearing Calculations'!B397,\"\")","v":""},{"$f":"IF('Clearing Calculations'!B397,'Clearing Calculations'!C397,\"\")","v":""},"","","",""]
[{"$f":"IF('Clearing Calculations'!A398=\"\",\"\",'Clearing Calculations'!A398)","v":""},{"$f":"IF('Clearing Calculations'!A398,'Clearing Calculations'!B398,\"\")","v":""},{"$f":"IF('Clearing Calculations'!B398,'Clearing Calculations'!C398,\"\")","v":""},"","","",""]
[{"$f":"IF('Clearing Calculations'!A399=\"\",\"\",'Clearing Calculations'!A399)","v":""},{"$f":"IF('Clearing Calculations'!A399,'Clearing Calculations'!B399,\"\")","v":""},{"$f":"IF('Clearing Calculations'!B399,'Clearing Calculations'!C399,\"\")","v":""},"","","",""]
[{"$f":"IF('Clearing Calculations'!A400=\"\",\"\",'Clearing Calculations'!A400)","v":""},{"$f":"IF('Clearing Calculations'!A400,'Clearing Calculations'!B400,\"\")","v":""},{"$f":"IF('Clearing Calculations'!B400,'Clearing Calculations'!C400,\"\")","v":""},"","","",""]
[{"$f":"IF('Clearing Calculations'!A401=\"\",\"\",'Clearing Calculations'!A401)","v":""},{"$f":"IF('Clearing Calculations'!A401,'Clearing Calculations'!B401,\"\")","v":""},{"$f":"IF('Clearing Calculations'!B401,'Clearing Calculations'!C401,\"\")","v":""},"","","",""]
[{"$f":"IF('Clearing Calculations'!A402=\"\",\"\",'Clearing Calculations'!A402)","v":""},{"$f":"IF('Clearing Calculations'!A402,'Clearing Calculations'!B402,\"\")","v":""},{"$f":"IF('Clearing Calculations'!B402,'Clearing Calculations'!C402,\"\")","v":""},"","","",""]
[{"$f":"IF('Clearing Calculations'!A403=\"\",\"\",'Clearing Calculations'!A403)","v":""},{"$f":"IF('Clearing Calculations'!A403,'Clearing Calculations'!B403,\"\")","v":""},{"$f":"IF('Clearing Calculations'!B403,'Clearing Calculations'!C403,\"\")","v":""},"","","",""]
[{"$f":"IF('Clearing Calculations'!A404=\"\",\"\",'Clearing Calculations'!A404)","v":""},{"$f":"IF('Clearing Calculations'!A404,'Clearing Calculations'!B404,\"\")","v":""},{"$f":"IF('Clearing Calculations'!B404,'Clearing Calculations'!C404,\"\")","v":""},"","","",""]
[{"$f":"IF('Clearing Calculations'!A405=\"\",\"\",'Clearing Calculations'!A405)","v":""},{"$f":"IF('Clearing Calculations'!A405,'Clearing Calculations'!B405,\"\")","v":""},{"$f":"IF('Clearing Calculations'!B405,'Clearing Calculations'!C405,\"\")","v":""},"","","",""]
[{"$f":"IF('Clearing Calculations'!A406=\"\",\"\",'Clearing Calculations'!A406)","v":""},{"$f":"IF('Clearing Calculations'!A406,'Clearing Calculations'!B406,\"\")","v":""},{"$f":"IF('Clearing Calculations'!B406,'Clearing Calculations'!C406,\"\")","v":""},"","","",""]
[{"$f":"IF('Clearing Calculations'!A407=\"\",\"\",'Clearing Calculations'!A407)","v":""},{"$f":"IF('Clearing Calculations'!A407,'Clearing Calculations'!B407,\"\")","v":""},{"$f":"IF('Clearing Calculations'!B407,'Clearing Calculations'!C407,\"\")","v":""},"","","",""]
[{"$f":"IF('Clearing Calculations'!A408=\"\",\"\",'Clearing Calculations'!A408)","v":""},{"$f":"IF('Clearing Calculations'!A408,'Clearing Calculations'!B408,\"\")","v":""},{"$f":"IF('Clearing Calculations'!B408,'Clearing Calculations'!C408,\"\")","v":""},"","","",""]
[{"$f":"IF('Clearing Calculations'!A409=\"\",\"\",'Clearing Calculations'!A409)","v":""},{"$f":"IF('Clearing Calculations'!A409,'Clearing Calculations'!B409,\"\")","v":""},{"$f":"IF('Clearing Calculations'!B409,'Clearing Calculations'!C409,\"\")","v":""},"","","",""]
[{"$f":"IF('Clearing Calculations'!A410=\"\",\"\",'Clearing Calculations'!A410)","v":""},{"$f":"IF('Clearing Calculations'!A410,'Clearing Calculations'!B410,\"\")","v":""},{"$f":"IF('Clearing Calculations'!B410,'Clearing Calculations'!C410,\"\")","v":""},"","","",""]
[{"$f":"IF('Clearing Calculations'!A411=\"\",\"\",'Clearing Calculations'!A411)","v":""},{"$f":"IF('Clearing Calculations'!A411,'Clearing Calculations'!B411,\"\")","v":""},{"$f":"IF('Clearing Calculations'!B411,'Clearing Calculations'!C411,\"\")","v":""},"","","",""]
[{"$f":"IF('Clearing Calculations'!A412=\"\",\"\",'Clearing Calculations'!A412)","v":""},{"$f":"IF('Clearing Calculations'!A412,'Clearing Calculations'!B412,\"\")","v":""},{"$f":"IF('Clearing Calculations'!B412,'Clearing Calculations'!C412,\"\")","v":""},"","","",""]
[{"$f":"IF('Clearing Calculations'!A413=\"\",\"\",'Clearing Calculations'!A413)","v":""},{"$f":"IF('Clearing Calculations'!A413,'Clearing Calculations'!B413,\"\")","v":""},{"$f":"IF('Clearing Calculations'!B413,'Clearing Calculations'!C413,\"\")","v":""},"","","",""]
[{"$f":"IF('Clearing Calculations'!A414=\"\",\"\",'Clearing Calculations'!A414)","v":""},{"$f":"IF('Clearing Calculations'!A414,'Clearing Calculations'!B414,\"\")","v":""},{"$f":"IF('Clearing Calculations'!B414,'Clearing Calculations'!C414,\"\")","v":""},"","","",""]
[{"$f":"IF('Clearing Calculations'!A415=\"\",\"\",'Clearing Calculations'!A415)","v":""},{"$f":"IF('Clearing Calculations'!A415,'Clearing Calculations'!B415,\"\")","v":""},{"$f":"IF('Clearing Calculations'!B415,'Clearing Calculations'!C415,\"\")","v":""},"","","",""]
[{"$f":"IF('Clearing Calculations'!A416=\"\",\"\",'Clearing Calculations'!A416)","v":""},{"$f":"IF('Clearing Calculations'!A416,'Clearing Calculations'!B416,\"\")","v":""},{"$f":"IF('Clearing Calculations'!B416,'Clearing Calculations'!C416,\"\")","v":""},"","","",""]
[{"$f":"IF('Clearing Calculations'!A417=\"\",\"\",'Clearing Calculations'!A417)","v":""},{"$f":"IF('Clearing Calculations'!A417,'Clearing Calculations'!B417,\"\")","v":""},{"$f":"IF('Clearing Calculations'!B417,'Clearing Calculations'!C417,\"\")","v":""},"","","",""]
[{"$f":"IF('Clearing Calculations'!A418=\"\",\"\",'Clearing Calculations'!A418)","v":""},{"$f":"IF('Clearing Calculations'!A418,'Clearing Calculations'!B418,\"\")","v":""},{"$f":"IF('Clearing Calculations'!B418,'Clearing Calculations'!C418,\"\")","v":""},"","","",""]
[{"$f":"IF('Clearing Calculations'!A419=\"\",\"\",'Clearing Calculations'!A419)","v":""},{"$f":"IF('Clearing Calculations'!A419,'Clearing Calculations'!B419,\"\")","v":""},{"$f":"IF('Clearing Calculations'!B419,'Clearing Calculations'!C419,\"\")","v":""},"","","",""]
[{"$f":"IF('Clearing Calculations'!A420=\"\",\"\",'Clearing Calculations'!A420)","v":""},{"$f":"IF('Clearing Calculations'!A420,'Clearing Calculations'!B420,\"\")","v":""},{"$f":"IF('Clearing Calculations'!B420,'Clearing Calculations'!C420,\"\")","v":""},"","","",""]
[{"$f":"IF('Clearing Calculations'!A421=\"\",\"\",'Clearing Calculations'!A421)","v":""},{"$f":"IF('Clearing Calculations'!A421,'Clearing Calculations'!B421,\"\")","v":""},{"$f":"IF('Clearing Calculations'!B421,'Clearing Calculations'!C421,\"\")","v":""},"","","",""]
[{"$f":"IF('Clearing Calculations'!A422=\"\",\"\",'Clearing Calculations'!A422)","v":""},{"$f":"IF('Clearing Calculations'!A422,'Clearing Calculations'!B422,\"\")","v":""},{"$f":"IF('Clearing Calculations'!B422,'Clearing Calculations'!C422,\"\")","v":""},"","","",""]
[{"$f":"IF('Clearing Calculations'!A423=\"\",\"\",'Clearing Calculations'!A423)","v":""},{"$f":"IF('Clearing Calculations'!A423,'Clearing Calculations'!B423,\"\")","v":""},{"$f":"IF('Clearing Calculations'!B423,'Clearing Calculations'!C423,\"\")","v":""},"","","",""]
[{"$f":"IF('Clearing Calculations'!A424=\"\",\"\",'Clearing Calculations'!A424)","v":""},{"$f":"IF('Clearing Calculations'!A424,'Clearing Calculations'!B424,\"\")","v":""},{"$f":"IF('Clearing Calculations'!B424,'Clearing Calculations'!C424,\"\")","v":""},"","","",""]
[{"$f":"IF('Clearing Calculations'!A425=\"\",\"\",'Clearing Calculations'!A425)","v":""},{"$f":"IF('Clearing Calculations'!A425,'Clearing Calculations'!B425,\"\")","v":""},{"$f":"IF('Clearing Calculations'!B425,'Clearing Calculations'!C425,\"\")","v":""},"","","",""]
[{"$f":"IF('Clearing Calculations'!A426=\"\",\"\",'Clearing Calculations'!A426)","v":""},{"$f":"IF('Clearing Calculations'!A426,'Clearing Calculations'!B426,\"\")","v":""},{"$f":"IF('Clearing Calculations'!B426,'Clearing Calculations'!C426,\"\")","v":""},"","","",""]
[{"$f":"IF('Clearing Calculations'!A427=\"\",\"\",'Clearing Calculations'!A427)","v":""},{"$f":"IF('Clearing Calculations'!A427,'Clearing Calculations'!B427,\"\")","v":""},{"$f":"IF('Clearing Calculations'!B427,'Clearing Calculations'!C427,\"\")","v":""},"","","",""]
[{"$f":"IF('Clearing Calculations'!A428=\"\",\"\",'Clearing Calculations'!A428)","v":""},{"$f":"IF('Clearing Calculations'!A428,'Clearing Calculations'!B428,\"\")","v":""},{"$f":"IF('Clearing Calculations'!B428,'Clearing Calculations'!C428,\"\")","v":""},{"$f":"IF(A434=\"\",\"\",$B434+$C434)","v":""},{"$f":"IF(A434=\"\",\"\",(D434+D433)/2*(A434-A433))","v":""},{"$f":"IF(A434=\"\",\"\",(E434/9))","v":""},{"$f":"IF(A434=\"\",\"\",E434/$G$3)","v":""}]
[{"$f":"IF('Clearing Calculations'!A429=\"\",\"\",'Clearing Calculations'!A429)","v":""},{"$f":"IF('Clearing Calculations'!A429,'Clearing Calculations'!B429,\"\")","v":""},{"$f":"IF('Clearing Calculations'!B429,'Clearing Calculations'!C429,\"\")","v":""},"","","",""]
[{"$f":"IF('Clearing Calculations'!A430=\"\",\"\",'Clearing Calculations'!A430)","v":""},{"$f":"IF('Clearing Calculations'!A430,'Clearing Calculations'!B430,\"\")","v":""},{"$f":"IF('Clearing Calculations'!B430,'Clearing Calculations'!C430,\"\")","v":""},"","","",""]
[{"$f":"IF('Clearing Calculations'!A431=\"\",\"\",'Clearing Calculations'!A431)","v":""},{"$f":"IF('Clearing Calculations'!A431,'Clearing Calculations'!B431,\"\")","v":""},{"$f":"IF('Clearing Calculations'!B431,'Clearing Calculations'!C431,\"\")","v":""},"","","",""]
[{"$f":"IF('Clearing Calculations'!A432=\"\",\"\",'Clearing Calculations'!A432)","v":""},{"$f":"IF('Clearing Calculations'!A432,'Clearing Calculations'!B432,\"\")","v":""},{"$f":"IF('Clearing Calculations'!B432,'Clearing Calculations'!C432,\"\")","v":""},"","","",""]
[{"$f":"IF('Clearing Calculations'!A433=\"\",\"\",'Clearing Calculations'!A433)","v":""},{"$f":"IF('Clearing Calculations'!A433,'Clearing Calculations'!B433,\"\")","v":""},{"$f":"IF('Clearing Calculations'!B433,'Clearing Calculations'!C433,\"\")","v":""},"","","",""]
[{"$f":"IF('Clearing Calculations'!A434=\"\",\"\",'Clearing Calculations'!A434)","v":""},{"$f":"IF('Clearing Calculations'!A434,'Clearing Calculations'!B434,\"\")","v":""},{"$f":"IF('Clearing Calculations'!B434,'Clearing Calculations'!C434,\"\")","v":""},"","","",""]
[{"$f":"IF('Clearing Calculations'!A435=\"\",\"\",'Clearing Calculations'!A435)","v":""},{"$f":"IF('Clearing Calculations'!A435,'Clearing Calculations'!B435,\"\")","v":""},{"$f":"IF('Clearing Calculations'!B435,'Clearing Calculations'!C435,\"\")","v":""},"","","",""]
[{"$f":"IF('Clearing Calculations'!A436=\"\",\"\",'Clearing Calculations'!A436)","v":""},{"$f":"IF('Clearing Calculations'!A436,'Clearing Calculations'!B436,\"\")","v":""},{"$f":"IF('Clearing Calculations'!B436,'Clearing Calculations'!C436,\"\")","v":""},"","","",""]
[{"$f":"IF('Clearing Calculations'!A437=\"\",\"\",'Clearing Calculations'!A437)","v":""},{"$f":"IF('Clearing Calculations'!A437,'Clearing Calculations'!B437,\"\")","v":""},{"$f":"IF('Clearing Calculations'!B437,'Clearing Calculations'!C437,\"\")","v":""},"","","",""]
[{"$f":"IF('Clearing Calculations'!A438=\"\",\"\",'Clearing Calculations'!A438)","v":""},{"$f":"IF('Clearing Calculations'!A438,'Clearing Calculations'!B438,\"\")","v":""},{"$f":"IF('Clearing Calculations'!B438,'Clearing Calculations'!C438,\"\")","v":""},"","","",""]
[{"$f":"IF('Clearing Calculations'!A439=\"\",\"\",'Clearing Calculations'!A439)","v":""},{"$f":"IF('Clearing Calculations'!A439,'Clearing Calculations'!B439,\"\")","v":""},{"$f":"IF('Clearing Calculations'!B439,'Clearing Calculations'!C439,\"\")","v":""},"","","",""]
[{"$f":"IF('Clearing Calculations'!A440=\"\",\"\",'Clearing Calculations'!A440)","v":""},{"$f":"IF('Clearing Calculations'!A440,'Clearing Calculations'!B440,\"\")","v":""},{"$f":"IF('Clearing Calculations'!B440,'Clearing Calculations'!C440,\"\")","v":""},"","","",""]
[{"$f":"IF('Clearing Calculations'!A441=\"\",\"\",'Clearing Calculations'!A441)","v":""},{"$f":"IF('Clearing Calculations'!A441,'Clearing Calculations'!B441,\"\")","v":""},{"$f":"IF('Clearing Calculations'!B441,'Clearing Calculations'!C441,\"\")","v":""},"","","",""]
[{"$f":"IF('Clearing Calculations'!A442=\"\",\"\",'Clearing Calculations'!A442)","v":""},{"$f":"IF('Clearing Calculations'!A442,'Clearing Calculations'!B442,\"\")","v":""},{"$f":"IF('Clearing Calculations'!B442,'Clearing Calculations'!C442,\"\")","v":""},"","","",""]
[{"$f":"IF('Clearing Calculations'!A443=\"\",\"\",'Clearing Calculations'!A443)","v":""},{"$f":"IF('Clearing Calculations'!A443,'Clearing Calculations'!B443,\"\")","v":""},{"$f":"IF('Clearing Calculations'!B443,'Clearing Calculations'!C443,\"\")","v":""},"","","",""]
[{"$f":"IF('Clearing Calculations'!A444=\"\",\"\",'Clearing Calculations'!A444)","v":""},{"$f":"IF('Clearing Calculations'!A444,'Clearing Calculations'!B444,\"\")","v":""},{"$f":"IF('Clearing Calculations'!B444,'Clearing Calculations'!C444,\"\")","v":""},"","","",""]
[{"$f":"IF('Clearing Calculations'!A445=\"\",\"\",'Clearing Calculations'!A445)","v":""},{"$f":"IF('Clearing Calculations'!A445,'Clearing Calculations'!B445,\"\")","v":""},{"$f":"IF('Clearing Calculations'!B445,'Clearing Calculations'!C445,\"\")","v":""},"","","",""]
[{"$f":"IF('Clearing Calculations'!A446=\"\",\"\",'Clearing Calculations'!A446)","v":""},{"$f":"IF('Clearing Calculations'!A446,'Clearing Calculations'!B446,\"\")","v":""},{"$f":"IF('Clearing Calculations'!B446,'Clearing Calculations'!C446,\"\")","v":""},"","","",""]
[{"$f":"IF('Clearing Calculations'!A447=\"\",\"\",'Clearing Calculations'!A447)","v":""},{"$f":"IF('Clearing Calculations'!A447,'Clearing Calculations'!B447,\"\")","v":""},{"$f":"IF('Clearing Calculations'!B447,'Clearing Calculations'!C447,\"\")","v":""},"","","",""]
[{"$f":"IF('Clearing Calculations'!A448=\"\",\"\",'Clearing Calculations'!A448)","v":""},{"$f":"IF('Clearing Calculations'!A448,'Clearing Calculations'!B448,\"\")","v":""},{"$f":"IF('Clearing Calculations'!B448,'Clearing Calculations'!C448,\"\")","v":""},"","","",""]
[{"$f":"IF('Clearing Calculations'!A449=\"\",\"\",'Clearing Calculations'!A449)","v":""},{"$f":"IF('Clearing Calculations'!A449,'Clearing Calculations'!B449,\"\")","v":""},{"$f":"IF('Clearing Calculations'!B449,'Clearing Calculations'!C449,\"\")","v":""},"","","",""]
[{"$f":"IF('Clearing Calculations'!A450=\"\",\"\",'Clearing Calculations'!A450)","v":""},{"$f":"IF('Clearing Calculations'!A450,'Clearing Calculations'!B450,\"\")","v":""},{"$f":"IF('Clearing Calculations'!B450,'Clearing Calculations'!C450,\"\")","v":""},"","","",""]
[{"$f":"IF('Clearing Calculations'!A451=\"\",\"\",'Clearing Calculations'!A451)","v":""},{"$f":"IF('Clearing Calculations'!A451,'Clearing Calculations'!B451,\"\")","v":""},{"$f":"IF('Clearing Calculations'!B451,'Clearing Calculations'!C451,\"\")","v":""},"","","",""]
[{"$f":"IF('Clearing Calculations'!A452=\"\",\"\",'Clearing Calculations'!A452)","v":""},{"$f":"IF('Clearing Calculations'!A452,'Clearing Calculations'!B452,\"\")","v":""},{"$f":"IF('Clearing Calculations'!B452,'Clearing Calculations'!C452,\"\")","v":""},"","","",""]
[{"$f":"IF('Clearing Calculations'!A453=\"\",\"\",'Clearing Calculations'!A453)","v":""},{"$f":"IF('Clearing Calculations'!A453,'Clearing Calculations'!B453,\"\")","v":""},{"$f":"IF('Clearing Calculations'!B453,'Clearing Calculations'!C453,\"\")","v":""},"","","",""]
[{"$f":"IF('Clearing Calculations'!A454=\"\",\"\",'Clearing Calculations'!A454)","v":""},{"$f":"IF('Clearing Calculations'!A454,'Clearing Calculations'!B454,\"\")","v":""},{"$f":"IF('Clearing Calculations'!B454,'Clearing Calculations'!C454,\"\")","v":""},"","","",""]
[{"$f":"IF('Clearing Calculations'!A455=\"\",\"\",'Clearing Calculations'!A455)","v":""},{"$f":"IF('Clearing Calculations'!A455,'Clearing Calculations'!B455,\"\")","v":""},{"$f":"IF('Clearing Calculations'!B455,'Clearing Calculations'!C455,\"\")","v":""},"","","",""]
[{"$f":"IF('Clearing Calculations'!A456=\"\",\"\",'Clearing Calculations'!A456)","v":""},{"$f":"IF('Clearing Calculations'!A456,'Clearing Calculations'!B456,\"\")","v":""},{"$f":"IF('Clearing Calculations'!B456,'Clearing Calculations'!C456,\"\")","v":""},"","","",""]
[{"$f":"IF('Clearing Calculations'!A457=\"\",\"\",'Clearing Calculations'!A457)","v":""},{"$f":"IF('Clearing Calculations'!A457,'Clearing Calculations'!B457,\"\")","v":""},{"$f":"IF('Clearing Calculations'!B457,'Clearing Calculations'!C457,\"\")","v":""},"","","",""]
[{"$f":"IF('Clearing Calculations'!A458=\"\",\"\",'Clearing Calculations'!A458)","v":""},{"$f":"IF('Clearing Calculations'!A458,'Clearing Calculations'!B458,\"\")","v":""},{"$f":"IF('Clearing Calculations'!B458,'Clearing Calculations'!C458,\"\")","v":""},"","","",""]
[{"$f":"IF('Clearing Calculations'!A459=\"\",\"\",'Clearing Calculations'!A459)","v":""},{"$f":"IF('Clearing Calculations'!A459,'Clearing Calculations'!B459,\"\")","v":""},{"$f":"IF('Clearing Calculations'!B459,'Clearing Calculations'!C459,\"\")","v":""},"","","",""]
[{"$f":"IF('Clearing Calculations'!A460=\"\",\"\",'Clearing Calculations'!A460)","v":""},{"$f":"IF('Clearing Calculations'!A460,'Clearing Calculations'!B460,\"\")","v":""},{"$f":"IF('Clearing Calculations'!B460,'Clearing Calculations'!C460,\"\")","v":""},"","","",""]
[{"$f":"IF('Clearing Calculations'!A461=\"\",\"\",'Clearing Calculations'!A461)","v":""},{"$f":"IF('Clearing Calculations'!A461,'Clearing Calculations'!B461,\"\")","v":""},{"$f":"IF('Clearing Calculations'!B461,'Clearing Calculations'!C461,\"\")","v":""},"","","",""]
[{"$f":"IF('Clearing Calculations'!A462=\"\",\"\",'Clearing Calculations'!A462)","v":""},{"$f":"IF('Clearing Calculations'!A462,'Clearing Calculations'!B462,\"\")","v":""},{"$f":"IF('Clearing Calculations'!B462,'Clearing Calculations'!C462,\"\")","v":""},"","","",""]
[{"$f":"IF('Clearing Calculations'!A463=\"\",\"\",'Clearing Calculations'!A463)","v":""},{"$f":"IF('Clearing Calculations'!A463,'Clearing Calculations'!B463,\"\")","v":""},{"$f":"IF('Clearing Calculations'!B463,'Clearing Calculations'!C463,\"\")","v":""},"","","",""]
[{"$f":"IF('Clearing Calculations'!A464=\"\",\"\",'Clearing Calculations'!A464)","v":""},{"$f":"IF('Clearing Calculations'!A464,'Clearing Calculations'!B464,\"\")","v":""},{"$f":"IF('Clearing Calculations'!B464,'Clearing Calculations'!C464,\"\")","v":""},"","","",""]
[{"$f":"IF('Clearing Calculations'!A465=\"\",\"\",'Clearing Calculations'!A465)","v":""},{"$f":"IF('Clearing Calculations'!A465,'Clearing Calculations'!B465,\"\")","v":""},{"$f":"IF('Clearing Calculations'!B465,'Clearing Calculations'!C465,\"\")","v":""},"","","",""]
[{"$f":"IF('Clearing Calculations'!A466=\"\",\"\",'Clearing Calculations'!A466)","v":""},{"$f":"IF('Clearing Calculations'!A466,'Clearing Calculations'!B466,\"\")","v":""},{"$f":"IF('Clearing Calculations'!B466,'Clearing Calculations'!C466,\"\")","v":""},"","","",""]
[{"$f":"IF('Clearing Calculations'!A467=\"\",\"\",'Clearing Calculations'!A467)","v":""},{"$f":"IF('Clearing Calculations'!A467,'Clearing Calculations'!B467,\"\")","v":""},{"$f":"IF('Clearing Calculations'!B467,'Clearing Calculations'!C467,\"\")","v":""},"","","",""]
[{"$f":"IF('Clearing Calculations'!A468=\"\",\"\",'Clearing Calculations'!A468)","v":""},{"$f":"IF('Clearing Calculations'!A468,'Clearing Calculations'!B468,\"\")","v":""},{"$f":"IF('Clearing Calculations'!B468,'Clearing Calculations'!C468,\"\")","v":""},"","","",""]
[{"$f":"IF('Clearing Calculations'!A469=\"\",\"\",'Clearing Calculations'!A469)","v":""},{"$f":"IF('Clearing Calculations'!A469,'Clearing Calculations'!B469,\"\")","v":""},{"$f":"IF('Clearing Calculations'!B469,'Clearing Calculations'!C469,\"\")","v":""},"","","",""]
[{"$f":"IF('Clearing Calculations'!A470=\"\",\"\",'Clearing Calculations'!A470)","v":""},{"$f":"IF('Clearing Calculations'!A470,'Clearing Calculations'!B470,\"\")","v":""},{"$f":"IF('Clearing Calculations'!B470,'Clearing Calculations'!C470,\"\")","v":""},"","","",""]
[{"$f":"IF('Clearing Calculations'!A471=\"\",\"\",'Clearing Calculations'!A471)","v":""},{"$f":"IF('Clearing Calculations'!A471,'Clearing Calculations'!B471,\"\")","v":""},{"$f":"IF('Clearing Calculations'!B471,'Clearing Calculations'!C471,\"\")","v":""},"","","",""]
[{"$f":"IF('Clearing Calculations'!A472=\"\",\"\",'Clearing Calculations'!A472)","v":""},{"$f":"IF('Clearing Calculations'!A472,'Clearing Calculations'!B472,\"\")","v":""},{"$f":"IF('Clearing Calculations'!B472,'Clearing Calculations'!C472,\"\")","v":""},"","","",""]
[{"$f":"IF('Clearing Calculations'!A473=\"\",\"\",'Clearing Calculations'!A473)","v":""},{"$f":"IF('Clearing Calculations'!A473,'Clearing Calculations'!B473,\"\")","v":""},{"$f":"IF('Clearing Calculations'!B473,'Clearing Calculations'!C473,\"\")","v":""},"","","",""]
[{"$f":"IF('Clearing Calculations'!A474=\"\",\"\",'Clearing Calculations'!A474)","v":""},{"$f":"IF('Clearing Calculations'!A474,'Clearing Calculations'!B474,\"\")","v":""},{"$f":"IF('Clearing Calculations'!B474,'Clearing Calculations'!C474,\"\")","v":""},"","","",""]
[{"$f":"IF('Clearing Calculations'!A475=\"\",\"\",'Clearing Calculations'!A475)","v":""},{"$f":"IF('Clearing Calculations'!A475,'Clearing Calculations'!B475,\"\")","v":""},{"$f":"IF('Clearing Calculations'!B475,'Clearing Calculations'!C475,\"\")","v":""},"","","",""]
[{"$f":"IF('Clearing Calculations'!A476=\"\",\"\",'Clearing Calculations'!A476)","v":""},{"$f":"IF('Clearing Calculations'!A476,'Clearing Calculations'!B476,\"\")","v":""},{"$f":"IF('Clearing Calculations'!B476,'Clearing Calculations'!C476,\"\")","v":""},"","","",""]
[{"$f":"IF('Clearing Calculations'!A477=\"\",\"\",'Clearing Calculations'!A477)","v":""},{"$f":"IF('Clearing Calculations'!A477,'Clearing Calculations'!B477,\"\")","v":""},{"$f":"IF('Clearing Calculations'!B477,'Clearing Calculations'!C477,\"\")","v":""},"","","",""]
[{"$f":"IF('Clearing Calculations'!A478=\"\",\"\",'Clearing Calculations'!A478)","v":""},{"$f":"IF('Clearing Calculations'!A478,'Clearing Calculations'!B478,\"\")","v":""},{"$f":"IF('Clearing Calculations'!B478,'Clearing Calculations'!C478,\"\")","v":""},"","","",""]
[{"$f":"IF('Clearing Calculations'!A479=\"\",\"\",'Clearing Calculations'!A479)","v":""},{"$f":"IF('Clearing Calculations'!A479,'Clearing Calculations'!B479,\"\")","v":""},{"$f":"IF('Clearing Calculations'!B479,'Clearing Calculations'!C479,\"\")","v":""},"","","",""]
[{"$f":"IF('Clearing Calculations'!A480=\"\",\"\",'Clearing Calculations'!A480)","v":""},{"$f":"IF('Clearing Calculations'!A480,'Clearing Calculations'!B480,\"\")","v":""},{"$f":"IF('Clearing Calculations'!B480,'Clearing Calculations'!C480,\"\")","v":""},"","","",""]
[{"$f":"IF('Clearing Calculations'!A481=\"\",\"\",'Clearing Calculations'!A481)","v":""},{"$f":"IF('Clearing Calculations'!A481,'Clearing Calculations'!B481,\"\")","v":""},{"$f":"IF('Clearing Calculations'!B481,'Clearing Calculations'!C481,\"\")","v":""},"","","",""]
[{"$f":"IF('Clearing Calculations'!A482=\"\",\"\",'Clearing Calculations'!A482)","v":""},{"$f":"IF('Clearing Calculations'!A482,'Clearing Calculations'!B482,\"\")","v":""},{"$f":"IF('Clearing Calculations'!B482,'Clearing Calculations'!C482,\"\")","v":""},"","","",""]
[{"$f":"IF('Clearing Calculations'!A483=\"\",\"\",'Clearing Calculations'!A483)","v":""},{"$f":"IF('Clearing Calculations'!A483,'Clearing Calculations'!B483,\"\")","v":""},{"$f":"IF('Clearing Calculations'!B483,'Clearing Calculations'!C483,\"\")","v":""},"","","",""]
[{"$f":"IF('Clearing Calculations'!A484=\"\",\"\",'Clearing Calculations'!A484)","v":""},{"$f":"IF('Clearing Calculations'!A484,'Clearing Calculations'!B484,\"\")","v":""},{"$f":"IF('Clearing Calculations'!B484,'Clearing Calculations'!C484,\"\")","v":""},"","","",""]
[{"$f":"IF('Clearing Calculations'!A485=\"\",\"\",'Clearing Calculations'!A485)","v":""},{"$f":"IF('Clearing Calculations'!A485,'Clearing Calculations'!B485,\"\")","v":""},{"$f":"IF('Clearing Calculations'!B485,'Clearing Calculations'!C485,\"\")","v":""},"","","",""]
[{"$f":"IF('Clearing Calculations'!A486=\"\",\"\",'Clearing Calculations'!A486)","v":""},{"$f":"IF('Clearing Calculations'!A486,'Clearing Calculations'!B486,\"\")","v":""},{"$f":"IF('Clearing Calculations'!B486,'Clearing Calculations'!C486,\"\")","v":""},"","","",""]
[{"$f":"IF('Clearing Calculations'!A487=\"\",\"\",'Clearing Calculations'!A487)","v":""},{"$f":"IF('Clearing Calculations'!A487,'Clearing Calculations'!B487,\"\")","v":""},{"$f":"IF('Clearing Calculations'!B487,'Clearing Calculations'!C487,\"\")","v":""},"","","",""]
[{"$f":"IF('Clearing Calculations'!A488=\"\",\"\",'Clearing Calculations'!A488)","v":""},{"$f":"IF('Clearing Calculations'!A488,'Clearing Calculations'!B488,\"\")","v":""},{"$f":"IF('Clearing Calculations'!B488,'Clearing Calculations'!C488,\"\")","v":""},"","","",""]
[{"$f":"IF('Clearing Calculations'!A489=\"\",\"\",'Clearing Calculations'!A489)","v":""},{"$f":"IF('Clearing Calculations'!A489,'Clearing Calculations'!B489,\"\")","v":""},{"$f":"IF('Clearing Calculations'!B489,'Clearing Calculations'!C489,\"\")","v":""},"","","",""]
[{"$f":"IF('Clearing Calculations'!A490=\"\",\"\",'Clearing Calculations'!A490)","v":""},{"$f":"IF('Clearing Calculations'!A490,'Clearing Calculations'!B490,\"\")","v":""},{"$f":"IF('Clearing Calculations'!B490,'Clearing Calculations'!C490,\"\")","v":""},"","","",""]
[{"$f":"IF('Clearing Calculations'!A491=\"\",\"\",'Clearing Calculations'!A491)","v":""},{"$f":"IF('Clearing Calculations'!A491,'Clearing Calculations'!B491,\"\")","v":""},{"$f":"IF('Clearing Calculations'!B491,'Clearing Calculations'!C491,\"\")","v":""},"","","",""]
[{"$f":"IF('Clearing Calculations'!A492=\"\",\"\",'Clearing Calculations'!A492)","v":""},{"$f":"IF('Clearing Calculations'!A492,'Clearing Calculations'!B492,\"\")","v":""},{"$f":"IF('Clearing Calculations'!B492,'Clearing Calculations'!C492,\"\")","v":""},{"$f":"IF(A498=\"\",\"\",$B498+$C498)","v":""},{"$f":"IF(A498=\"\",\"\",(D498+D497)/2*(A498-A497))","v":""},{"$f":"IF(A498=\"\",\"\",(E498/9))","v":""},{"$f":"IF(A498=\"\",\"\",E498/$G$3)","v":""}]
[{"$f":"IF('Clearing Calculations'!A493=\"\",\"\",'Clearing Calculations'!A493)","v":""},{"$f":"IF('Clearing Calculations'!A493,'Clearing Calculations'!B493,\"\")","v":""},{"$f":"IF('Clearing Calculations'!B493,'Clearing Calculations'!C493,\"\")","v":""},"","","",""]
[{"$f":"IF('Clearing Calculations'!A494=\"\",\"\",'Clearing Calculations'!A494)","v":""},{"$f":"IF('Clearing Calculations'!A494,'Clearing Calculations'!B494,\"\")","v":""},{"$f":"IF('Clearing Calculations'!B494,'Clearing Calculations'!C494,\"\")","v":""},"","","",""]
[{"$f":"IF('Clearing Calculations'!A495=\"\",\"\",'Clearing Calculations'!A495)","v":""},{"$f":"IF('Clearing Calculations'!A495,'Clearing Calculations'!B495,\"\")","v":""},{"$f":"IF('Clearing Calculations'!B495,'Clearing Calculations'!C495,\"\")","v":""},"","","",""]
[{"$f":"IF('Clearing Calculations'!A496=\"\",\"\",'Clearing Calculations'!A496)","v":""},{"$f":"IF('Clearing Calculations'!A496,'Clearing Calculations'!B496,\"\")","v":""},{"$f":"IF('Clearing Calculations'!B496,'Clearing Calculations'!C496,\"\")","v":""},"","","",""]
[{"$f":"IF('Clearing Calculations'!A497=\"\",\"\",'Clearing Calculations'!A497)","v":""},{"$f":"IF('Clearing Calculations'!A497,'Clearing Calculations'!B497,\"\")","v":""},{"$f":"IF('Clearing Calculations'!B497,'Clearing Calculations'!C497,\"\")","v":""},"","","",""]
[{"$f":"IF('Clearing Calculations'!A498=\"\",\"\",'Clearing Calculations'!A498)","v":""},{"$f":"IF('Clearing Calculations'!A498,'Clearing Calculations'!B498,\"\")","v":""},{"$f":"IF('Clearing Calculations'!B498,'Clearing Calculations'!C498,\"\")","v":""},"","","",""]
[{"$f":"IF('Clearing Calculations'!A499=\"\",\"\",'Clearing Calculations'!A499)","v":""},{"$f":"IF('Clearing Calculations'!A499,'Clearing Calculations'!B499,\"\")","v":""},{"$f":"IF('Clearing Calculations'!B499,'Clearing Calculations'!C499,\"\")","v":""},"","","",""]
[{"$f":"IF('Clearing Calculations'!A500=\"\",\"\",'Clearing Calculations'!A500)","v":""},{"$f":"IF('Clearing Calculations'!A500,'Clearing Calculations'!B500,\"\")","v":""},{"$f":"IF('Clearing Calculations'!B500,'Clearing Calculations'!C500,\"\")","v":""},"","","",""]
[{"$f":"IF('Clearing Calculations'!A501=\"\",\"\",'Clearing Calculations'!A501)","v":""},{"$f":"IF('Clearing Calculations'!A501,'Clearing Calculations'!B501,\"\")","v":""},{"$f":"IF('Clearing Calculations'!B501,'Clearing Calculations'!C501,\"\")","v":""},"","","",""]
[{"$f":"IF('Clearing Calculations'!A502=\"\",\"\",'Clearing Calculations'!A502)","v":""},{"$f":"IF('Clearing Calculations'!A502,'Clearing Calculations'!B502,\"\")","v":""},{"$f":"IF('Clearing Calculations'!B502,'Clearing Calculations'!C502,\"\")","v":""},"","","",""]
[{"$f":"IF('Clearing Calculations'!A503=\"\",\"\",'Clearing Calculations'!A503)","v":""},{"$f":"IF('Clearing Calculations'!A503,'Clearing Calculations'!B503,\"\")","v":""},{"$f":"IF('Clearing Calculations'!B503,'Clearing Calculations'!C503,\"\")","v":""},"","","",""]
[{"$f":"IF('Clearing Calculations'!A504=\"\",\"\",'Clearing Calculations'!A504)","v":""},{"$f":"IF('Clearing Calculations'!A504,'Clearing Calculations'!B504,\"\")","v":""},{"$f":"IF('Clearing Calculations'!B504,'Clearing Calculations'!C504,\"\")","v":""},"","","",""]
[{"$f":"IF('Clearing Calculations'!A505=\"\",\"\",'Clearing Calculations'!A505)","v":""},{"$f":"IF('Clearing Calculations'!A505,'Clearing Calculations'!B505,\"\")","v":""},{"$f":"IF('Clearing Calculations'!B505,'Clearing Calculations'!C505,\"\")","v":""},"","","",""]
[{"$f":"IF('Clearing Calculations'!A506=\"\",\"\",'Clearing Calculations'!A506)","v":""},{"$f":"IF('Clearing Calculations'!A506,'Clearing Calculations'!B506,\"\")","v":""},{"$f":"IF('Clearing Calculations'!B506,'Clearing Calculations'!C506,\"\")","v":""},"","","",""]
[{"$f":"IF('Clearing Calculations'!A507=\"\",\"\",'Clearing Calculations'!A507)","v":""},{"$f":"IF('Clearing Calculations'!A507,'Clearing Calculations'!B507,\"\")","v":""},{"$f":"IF('Clearing Calculations'!B507,'Clearing Calculations'!C507,\"\")","v":""},"","","",""]
[{"$f":"IF('Clearing Calculations'!A508=\"\",\"\",'Clearing Calculations'!A508)","v":""},{"$f":"IF('Clearing Calculations'!A508,'Clearing Calculations'!B508,\"\")","v":""},{"$f":"IF('Clearing Calculations'!B508,'Clearing Calculations'!C508,\"\")","v":""},"","","",""]
[{"$f":"IF('Clearing Calculations'!A509=\"\",\"\",'Clearing Calculations'!A509)","v":""},{"$f":"IF('Clearing Calculations'!A509,'Clearing Calculations'!B509,\"\")","v":""},{"$f":"IF('Clearing Calculations'!B509,'Clearing Calculations'!C509,\"\")","v":""},"","","",""]
[{"$f":"IF('Clearing Calculations'!A510=\"\",\"\",'Clearing Calculations'!A510)","v":""},{"$f":"IF('Clearing Calculations'!A510,'Clearing Calculations'!B510,\"\")","v":""},{"$f":"IF('Clearing Calculations'!B510,'Clearing Calculations'!C510,\"\")","v":""},"","","",""]
[{"$f":"IF('Clearing Calculations'!A511=\"\",\"\",'Clearing Calculations'!A511)","v":""},{"$f":"IF('Clearing Calculations'!A511,'Clearing Calculations'!B511,\"\")","v":""},{"$f":"IF('Clearing Calculations'!B511,'Clearing Calculations'!C511,\"\")","v":""},"","","",""]
[{"$f":"IF('Clearing Calculations'!A512=\"\",\"\",'Clearing Calculations'!A512)","v":""},{"$f":"IF('Clearing Calculations'!A512,'Clearing Calculations'!B512,\"\")","v":""},{"$f":"IF('Clearing Calculations'!B512,'Clearing Calculations'!C512,\"\")","v":""},"","","",""]
[{"$f":"IF('Clearing Calculations'!A513=\"\",\"\",'Clearing Calculations'!A513)","v":""},{"$f":"IF('Clearing Calculations'!A513,'Clearing Calculations'!B513,\"\")","v":""},{"$f":"IF('Clearing Calculations'!B513,'Clearing Calculations'!C513,\"\")","v":""},"","","",""]
[{"$f":"IF('Clearing Calculations'!A514=\"\",\"\",'Clearing Calculations'!A514)","v":""},{"$f":"IF('Clearing Calculations'!A514,'Clearing Calculations'!B514,\"\")","v":""},{"$f":"IF('Clearing Calculations'!B514,'Clearing Calculations'!C514,\"\")","v":""},"","","",""]
[{"$f":"IF('Clearing Calculations'!A515=\"\",\"\",'Clearing Calculations'!A515)","v":""},{"$f":"IF('Clearing Calculations'!A515,'Clearing Calculations'!B515,\"\")","v":""},{"$f":"IF('Clearing Calculations'!B515,'Clearing Calculations'!C515,\"\")","v":""},"","","",""]
[{"$f":"IF('Clearing Calculations'!A516=\"\",\"\",'Clearing Calculations'!A516)","v":""},{"$f":"IF('Clearing Calculations'!A516,'Clearing Calculations'!B516,\"\")","v":""},{"$f":"IF('Clearing Calculations'!B516,'Clearing Calculations'!C516,\"\")","v":""},"","","",""]
[{"$f":"IF('Clearing Calculations'!A517=\"\",\"\",'Clearing Calculations'!A517)","v":""},{"$f":"IF('Clearing Calculations'!A517,'Clearing Calculations'!B517,\"\")","v":""},{"$f":"IF('Clearing Calculations'!B517,'Clearing Calculations'!C517,\"\")","v":""},"","","",""]
[{"$f":"IF('Clearing Calculations'!A518=\"\",\"\",'Clearing Calculations'!A518)","v":""},{"$f":"IF('Clearing Calculations'!A518,'Clearing Calculations'!B518,\"\")","v":""},{"$f":"IF('Clearing Calculations'!B518,'Clearing Calculations'!C518,\"\")","v":""},"","","",""]
[{"$f":"IF('Clearing Calculations'!A519=\"\",\"\",'Clearing Calculations'!A519)","v":""},{"$f":"IF('Clearing Calculations'!A519,'Clearing Calculations'!B519,\"\")","v":""},{"$f":"IF('Clearing Calculations'!B519,'Clearing Calculations'!C519,\"\")","v":""},"","","",""]
[{"$f":"IF('Clearing Calculations'!A520=\"\",\"\",'Clearing Calculations'!A520)","v":""},{"$f":"IF('Clearing Calculations'!A520,'Clearing Calculations'!B520,\"\")","v":""},{"$f":"IF('Clearing Calculations'!B520,'Clearing Calculations'!C520,\"\")","v":""},"","","",""]
[{"$f":"IF('Clearing Calculations'!A521=\"\",\"\",'Clearing Calculations'!A521)","v":""},{"$f":"IF('Clearing Calculations'!A521,'Clearing Calculations'!B521,\"\")","v":""},{"$f":"IF('Clearing Calculations'!B521,'Clearing Calculations'!C521,\"\")","v":""},"","","",""]
[{"$f":"IF('Clearing Calculations'!A522=\"\",\"\",'Clearing Calculations'!A522)","v":""},{"$f":"IF('Clearing Calculations'!A522,'Clearing Calculations'!B522,\"\")","v":""},{"$f":"IF('Clearing Calculations'!B522,'Clearing Calculations'!C522,\"\")","v":""},"","","",""]
[{"$f":"IF('Clearing Calculations'!A523=\"\",\"\",'Clearing Calculations'!A523)","v":""},{"$f":"IF('Clearing Calculations'!A523,'Clearing Calculations'!B523,\"\")","v":""},{"$f":"IF('Clearing Calculations'!B523,'Clearing Calculations'!C523,\"\")","v":""},"","","",""]
[{"$f":"IF('Clearing Calculations'!A524=\"\",\"\",'Clearing Calculations'!A524)","v":""},{"$f":"IF('Clearing Calculations'!A524,'Clearing Calculations'!B524,\"\")","v":""},{"$f":"IF('Clearing Calculations'!B524,'Clearing Calculations'!C524,\"\")","v":""},"","","",""]
[{"$f":"IF('Clearing Calculations'!A525=\"\",\"\",'Clearing Calculations'!A525)","v":""},{"$f":"IF('Clearing Calculations'!A525,'Clearing Calculations'!B525,\"\")","v":""},{"$f":"IF('Clearing Calculations'!B525,'Clearing Calculations'!C525,\"\")","v":""},"","","",""]
[{"$f":"IF('Clearing Calculations'!A526=\"\",\"\",'Clearing Calculations'!A526)","v":""},{"$f":"IF('Clearing Calculations'!A526,'Clearing Calculations'!B526,\"\")","v":""},{"$f":"IF('Clearing Calculations'!B526,'Clearing Calculations'!C526,\"\")","v":""},"","","",""]
[{"$f":"IF('Clearing Calculations'!A527=\"\",\"\",'Clearing Calculations'!A527)","v":""},{"$f":"IF('Clearing Calculations'!A527,'Clearing Calculations'!B527,\"\")","v":""},{"$f":"IF('Clearing Calculations'!B527,'Clearing Calculations'!C527,\"\")","v":""},"","","",""]
[{"$f":"IF('Clearing Calculations'!A528=\"\",\"\",'Clearing Calculations'!A528)","v":""},{"$f":"IF('Clearing Calculations'!A528,'Clearing Calculations'!B528,\"\")","v":""},{"$f":"IF('Clearing Calculations'!B528,'Clearing Calculations'!C528,\"\")","v":""},"","","",""]
[{"$f":"IF('Clearing Calculations'!A529=\"\",\"\",'Clearing Calculations'!A529)","v":""},{"$f":"IF('Clearing Calculations'!A529,'Clearing Calculations'!B529,\"\")","v":""},{"$f":"IF('Clearing Calculations'!B529,'Clearing Calculations'!C529,\"\")","v":""},"","","",""]
[{"$f":"IF('Clearing Calculations'!A530=\"\",\"\",'Clearing Calculations'!A530)","v":""},{"$f":"IF('Clearing Calculations'!A530,'Clearing Calculations'!B530,\"\")","v":""},{"$f":"IF('Clearing Calculations'!B530,'Clearing Calculations'!C530,\"\")","v":""},"","","",""]
[{"$f":"IF('Clearing Calculations'!A531=\"\",\"\",'Clearing Calculations'!A531)","v":""},{"$f":"IF('Clearing Calculations'!A531,'Clearing Calculations'!B531,\"\")","v":""},{"$f":"IF('Clearing Calculations'!B531,'Clearing Calculations'!C531,\"\")","v":""},"","","",""]
[{"$f":"IF('Clearing Calculations'!A532=\"\",\"\",'Clearing Calculations'!A532)","v":""},{"$f":"IF('Clearing Calculations'!A532,'Clearing Calculations'!B532,\"\")","v":""},{"$f":"IF('Clearing Calculations'!B532,'Clearing Calculations'!C532,\"\")","v":""},"","","",""]
[{"$f":"IF('Clearing Calculations'!A533=\"\",\"\",'Clearing Calculations'!A533)","v":""},{"$f":"IF('Clearing Calculations'!A533,'Clearing Calculations'!B533,\"\")","v":""},{"$f":"IF('Clearing Calculations'!B533,'Clearing Calculations'!C533,\"\")","v":""},"","","",""]
[{"$f":"IF('Clearing Calculations'!A534=\"\",\"\",'Clearing Calculations'!A534)","v":""},{"$f":"IF('Clearing Calculations'!A534,'Clearing Calculations'!B534,\"\")","v":""},{"$f":"IF('Clearing Calculations'!B534,'Clearing Calculations'!C534,\"\")","v":""},"","","",""]
[{"$f":"IF('Clearing Calculations'!A535=\"\",\"\",'Clearing Calculations'!A535)","v":""},{"$f":"IF('Clearing Calculations'!A535,'Clearing Calculations'!B535,\"\")","v":""},{"$f":"IF('Clearing Calculations'!B535,'Clearing Calculations'!C535,\"\")","v":""},"","","",""]
[{"$f":"IF('Clearing Calculations'!A536=\"\",\"\",'Clearing Calculations'!A536)","v":""},{"$f":"IF('Clearing Calculations'!A536,'Clearing Calculations'!B536,\"\")","v":""},{"$f":"IF('Clearing Calculations'!B536,'Clearing Calculations'!C536,\"\")","v":""},"","","",""]
[{"$f":"IF('Clearing Calculations'!A537=\"\",\"\",'Clearing Calculations'!A537)","v":""},{"$f":"IF('Clearing Calculations'!A537,'Clearing Calculations'!B537,\"\")","v":""},{"$f":"IF('Clearing Calculations'!B537,'Clearing Calculations'!C537,\"\")","v":""},"","","",""]
[{"$f":"IF('Clearing Calculations'!A538=\"\",\"\",'Clearing Calculations'!A538)","v":""},{"$f":"IF('Clearing Calculations'!A538,'Clearing Calculations'!B538,\"\")","v":""},{"$f":"IF('Clearing Calculations'!B538,'Clearing Calculations'!C538,\"\")","v":""},"","","",""]
[{"$f":"IF('Clearing Calculations'!A539=\"\",\"\",'Clearing Calculations'!A539)","v":""},{"$f":"IF('Clearing Calculations'!A539,'Clearing Calculations'!B539,\"\")","v":""},{"$f":"IF('Clearing Calculations'!B539,'Clearing Calculations'!C539,\"\")","v":""},"","","",""]
[{"$f":"IF('Clearing Calculations'!A540=\"\",\"\",'Clearing Calculations'!A540)","v":""},{"$f":"IF('Clearing Calculations'!A540,'Clearing Calculations'!B540,\"\")","v":""},{"$f":"IF('Clearing Calculations'!B540,'Clearing Calculations'!C540,\"\")","v":""},"","","",""]
[{"$f":"IF('Clearing Calculations'!A541=\"\",\"\",'Clearing Calculations'!A541)","v":""},{"$f":"IF('Clearing Calculations'!A541,'Clearing Calculations'!B541,\"\")","v":""},{"$f":"IF('Clearing Calculations'!B541,'Clearing Calculations'!C541,\"\")","v":""},"","","",""]
[{"$f":"IF('Clearing Calculations'!A542=\"\",\"\",'Clearing Calculations'!A542)","v":""},{"$f":"IF('Clearing Calculations'!A542,'Clearing Calculations'!B542,\"\")","v":""},{"$f":"IF('Clearing Calculations'!B542,'Clearing Calculations'!C542,\"\")","v":""},"","","",""]
[{"$f":"IF('Clearing Calculations'!A543=\"\",\"\",'Clearing Calculations'!A543)","v":""},{"$f":"IF('Clearing Calculations'!A543,'Clearing Calculations'!B543,\"\")","v":""},{"$f":"IF('Clearing Calculations'!B543,'Clearing Calculations'!C543,\"\")","v":""},"","","",""]
[{"$f":"IF('Clearing Calculations'!A544=\"\",\"\",'Clearing Calculations'!A544)","v":""},{"$f":"IF('Clearing Calculations'!A544,'Clearing Calculations'!B544,\"\")","v":""},{"$f":"IF('Clearing Calculations'!B544,'Clearing Calculations'!C544,\"\")","v":""},"","","",""]
[{"$f":"IF('Clearing Calculations'!A545=\"\",\"\",'Clearing Calculations'!A545)","v":""},{"$f":"IF('Clearing Calculations'!A545,'Clearing Calculations'!B545,\"\")","v":""},{"$f":"IF('Clearing Calculations'!B545,'Clearing Calculations'!C545,\"\")","v":""},"","","",""]
[{"$f":"IF('Clearing Calculations'!A546=\"\",\"\",'Clearing Calculations'!A546)","v":""},{"$f":"IF('Clearing Calculations'!A546,'Clearing Calculations'!B546,\"\")","v":""},{"$f":"IF('Clearing Calculations'!B546,'Clearing Calculations'!C546,\"\")","v":""},"","","",""]
[{"$f":"IF('Clearing Calculations'!A547=\"\",\"\",'Clearing Calculations'!A547)","v":""},{"$f":"IF('Clearing Calculations'!A547,'Clearing Calculations'!B547,\"\")","v":""},{"$f":"IF('Clearing Calculations'!B547,'Clearing Calculations'!C547,\"\")","v":""},"","","",""]
[{"$f":"IF('Clearing Calculations'!A548=\"\",\"\",'Clearing Calculations'!A548)","v":""},{"$f":"IF('Clearing Calculations'!A548,'Clearing Calculations'!B548,\"\")","v":""},{"$f":"IF('Clearing Calculations'!B548,'Clearing Calculations'!C548,\"\")","v":""},"","","",""]
[{"$f":"IF('Clearing Calculations'!A549=\"\",\"\",'Clearing Calculations'!A549)","v":""},{"$f":"IF('Clearing Calculations'!A549,'Clearing Calculations'!B549,\"\")","v":""},{"$f":"IF('Clearing Calculations'!B549,'Clearing Calculations'!C549,\"\")","v":""},"","","",""]
[{"$f":"IF('Clearing Calculations'!A550=\"\",\"\",'Clearing Calculations'!A550)","v":""},{"$f":"IF('Clearing Calculations'!A550,'Clearing Calculations'!B550,\"\")","v":""},{"$f":"IF('Clearing Calculations'!B550,'Clearing Calculations'!C550,\"\")","v":""},"","","",""]
[{"$f":"IF('Clearing Calculations'!A551=\"\",\"\",'Clearing Calculations'!A551)","v":""},{"$f":"IF('Clearing Calculations'!A551,'Clearing Calculations'!B551,\"\")","v":""},{"$f":"IF('Clearing Calculations'!B551,'Clearing Calculations'!C551,\"\")","v":""},"","","",""]
[{"$f":"IF('Clearing Calculations'!A552=\"\",\"\",'Clearing Calculations'!A552)","v":""},{"$f":"IF('Clearing Calculations'!A552,'Clearing Calculations'!B552,\"\")","v":""},{"$f":"IF('Clearing Calculations'!B552,'Clearing Calculations'!C552,\"\")","v":""},"","","",""]
[{"$f":"IF('Clearing Calculations'!A553=\"\",\"\",'Clearing Calculations'!A553)","v":""},{"$f":"IF('Clearing Calculations'!A553,'Clearing Calculations'!B553,\"\")","v":""},{"$f":"IF('Clearing Calculations'!B553,'Clearing Calculations'!C553,\"\")","v":""},"","","",""]
[{"$f":"IF('Clearing Calculations'!A554=\"\",\"\",'Clearing Calculations'!A554)","v":""},{"$f":"IF('Clearing Calculations'!A554,'Clearing Calculations'!B554,\"\")","v":""},{"$f":"IF('Clearing Calculations'!B554,'Clearing Calculations'!C554,\"\")","v":""},"","","",""]
[{"$f":"IF('Clearing Calculations'!A555=\"\",\"\",'Clearing Calculations'!A555)","v":""},{"$f":"IF('Clearing Calculations'!A555,'Clearing Calculations'!B555,\"\")","v":""},{"$f":"IF('Clearing Calculations'!B555,'Clearing Calculations'!C555,\"\")","v":""},"","","",""]
[{"$f":"IF('Clearing Calculations'!A556=\"\",\"\",'Clearing Calculations'!A556)","v":""},{"$f":"IF('Clearing Calculations'!A556,'Clearing Calculations'!B556,\"\")","v":""},{"$f":"IF('Clearing Calculations'!B556,'Clearing Calculations'!C556,\"\")","v":""},{"$f":"IF(A562=\"\",\"\",$B562+$C562)","v":""},{"$f":"IF(A562=\"\",\"\",(D562+D561)/2*(A562-A561))","v":""},{"$f":"IF(A562=\"\",\"\",(E562/9))","v":""},{"$f":"IF(A562=\"\",\"\",E562/$G$3)","v":""}]
[{"$f":"IF('Clearing Calculations'!A557=\"\",\"\",'Clearing Calculations'!A557)","v":""},{"$f":"IF('Clearing Calculations'!A557,'Clearing Calculations'!B557,\"\")","v":""},{"$f":"IF('Clearing Calculations'!B557,'Clearing Calculations'!C557,\"\")","v":""},"","","",""]
[{"$f":"IF('Clearing Calculations'!A558=\"\",\"\",'Clearing Calculations'!A558)","v":""},{"$f":"IF('Clearing Calculations'!A558,'Clearing Calculations'!B558,\"\")","v":""},{"$f":"IF('Clearing Calculations'!B558,'Clearing Calculations'!C558,\"\")","v":""},"","","",""]
[{"$f":"IF('Clearing Calculations'!A559=\"\",\"\",'Clearing Calculations'!A559)","v":""},{"$f":"IF('Clearing Calculations'!A559,'Clearing Calculations'!B559,\"\")","v":""},{"$f":"IF('Clearing Calculations'!B559,'Clearing Calculations'!C559,\"\")","v":""},"","","",""]
[{"$f":"IF('Clearing Calculations'!A560=\"\",\"\",'Clearing Calculations'!A560)","v":""},{"$f":"IF('Clearing Calculations'!A560,'Clearing Calculations'!B560,\"\")","v":""},{"$f":"IF('Clearing Calculations'!B560,'Clearing Calculations'!C560,\"\")","v":""},"","","",""]
[{"$f":"IF('Clearing Calculations'!A561=\"\",\"\",'Clearing Calculations'!A561)","v":""},{"$f":"IF('Clearing Calculations'!A561,'Clearing Calculations'!B561,\"\")","v":""},{"$f":"IF('Clearing Calculations'!B561,'Clearing Calculations'!C561,\"\")","v":""},"","","",""]
[{"$f":"IF('Clearing Calculations'!A562=\"\",\"\",'Clearing Calculations'!A562)","v":""},{"$f":"IF('Clearing Calculations'!A562,'Clearing Calculations'!B562,\"\")","v":""},{"$f":"IF('Clearing Calculations'!B562,'Clearing Calculations'!C562,\"\")","v":""},"","","",""]
[{"$f":"IF('Clearing Calculations'!A563=\"\",\"\",'Clearing Calculations'!A563)","v":""},{"$f":"IF('Clearing Calculations'!A563,'Clearing Calculations'!B563,\"\")","v":""},{"$f":"IF('Clearing Calculations'!B563,'Clearing Calculations'!C563,\"\")","v":""},"","","",""]
[{"$f":"IF('Clearing Calculations'!A564=\"\",\"\",'Clearing Calculations'!A564)","v":""},{"$f":"IF('Clearing Calculations'!A564,'Clearing Calculations'!B564,\"\")","v":""},{"$f":"IF('Clearing Calculations'!B564,'Clearing Calculations'!C564,\"\")","v":""},"","","",""]
[{"$f":"IF('Clearing Calculations'!A565=\"\",\"\",'Clearing Calculations'!A565)","v":""},{"$f":"IF('Clearing Calculations'!A565,'Clearing Calculations'!B565,\"\")","v":""},{"$f":"IF('Clearing Calculations'!B565,'Clearing Calculations'!C565,\"\")","v":""},"","","",""]
[{"$f":"IF('Clearing Calculations'!A566=\"\",\"\",'Clearing Calculations'!A566)","v":""},{"$f":"IF('Clearing Calculations'!A566,'Clearing Calculations'!B566,\"\")","v":""},{"$f":"IF('Clearing Calculations'!B566,'Clearing Calculations'!C566,\"\")","v":""},"","","",""]
[{"$f":"IF('Clearing Calculations'!A567=\"\",\"\",'Clearing Calculations'!A567)","v":""},{"$f":"IF('Clearing Calculations'!A567,'Clearing Calculations'!B567,\"\")","v":""},{"$f":"IF('Clearing Calculations'!B567,'Clearing Calculations'!C567,\"\")","v":""},"","","",""]
[{"$f":"IF('Clearing Calculations'!A568=\"\",\"\",'Clearing Calculations'!A568)","v":""},{"$f":"IF('Clearing Calculations'!A568,'Clearing Calculations'!B568,\"\")","v":""},{"$f":"IF('Clearing Calculations'!B568,'Clearing Calculations'!C568,\"\")","v":""},"","","",""]
[{"$f":"IF('Clearing Calculations'!A569=\"\",\"\",'Clearing Calculations'!A569)","v":""},{"$f":"IF('Clearing Calculations'!A569,'Clearing Calculations'!B569,\"\")","v":""},{"$f":"IF('Clearing Calculations'!B569,'Clearing Calculations'!C569,\"\")","v":""},"","","",""]
[{"$f":"IF('Clearing Calculations'!A570=\"\",\"\",'Clearing Calculations'!A570)","v":""},{"$f":"IF('Clearing Calculations'!A570,'Clearing Calculations'!B570,\"\")","v":""},{"$f":"IF('Clearing Calculations'!B570,'Clearing Calculations'!C570,\"\")","v":""},"","","",""]
[{"$f":"IF('Clearing Calculations'!A571=\"\",\"\",'Clearing Calculations'!A571)","v":""},{"$f":"IF('Clearing Calculations'!A571,'Clearing Calculations'!B571,\"\")","v":""},{"$f":"IF('Clearing Calculations'!B571,'Clearing Calculations'!C571,\"\")","v":""},"","","",""]
[{"$f":"IF('Clearing Calculations'!A572=\"\",\"\",'Clearing Calculations'!A572)","v":""},{"$f":"IF('Clearing Calculations'!A572,'Clearing Calculations'!B572,\"\")","v":""},{"$f":"IF('Clearing Calculations'!B572,'Clearing Calculations'!C572,\"\")","v":""},"","","",""]
[{"$f":"IF('Clearing Calculations'!A573=\"\",\"\",'Clearing Calculations'!A573)","v":""},{"$f":"IF('Clearing Calculations'!A573,'Clearing Calculations'!B573,\"\")","v":""},{"$f":"IF('Clearing Calculations'!B573,'Clearing Calculations'!C573,\"\")","v":""},"","","",""]
[{"$f":"IF('Clearing Calculations'!A574=\"\",\"\",'Clearing Calculations'!A574)","v":""},{"$f":"IF('Clearing Calculations'!A574,'Clearing Calculations'!B574,\"\")","v":""},{"$f":"IF('Clearing Calculations'!B574,'Clearing Calculations'!C574,\"\")","v":""},"","","",""]
[{"$f":"IF('Clearing Calculations'!A575=\"\",\"\",'Clearing Calculations'!A575)","v":""},{"$f":"IF('Clearing Calculations'!A575,'Clearing Calculations'!B575,\"\")","v":""},{"$f":"IF('Clearing Calculations'!B575,'Clearing Calculations'!C575,\"\")","v":""},"","","",""]
[{"$f":"IF('Clearing Calculations'!A576=\"\",\"\",'Clearing Calculations'!A576)","v":""},{"$f":"IF('Clearing Calculations'!A576,'Clearing Calculations'!B576,\"\")","v":""},{"$f":"IF('Clearing Calculations'!B576,'Clearing Calculations'!C576,\"\")","v":""},"","","",""]
[{"$f":"IF('Clearing Calculations'!A577=\"\",\"\",'Clearing Calculations'!A577)","v":""},{"$f":"IF('Clearing Calculations'!A577,'Clearing Calculations'!B577,\"\")","v":""},{"$f":"IF('Clearing Calculations'!B577,'Clearing Calculations'!C577,\"\")","v":""},"","","",""]
[{"$f":"IF('Clearing Calculations'!A578=\"\",\"\",'Clearing Calculations'!A578)","v":""},{"$f":"IF('Clearing Calculations'!A578,'Clearing Calculations'!B578,\"\")","v":""},{"$f":"IF('Clearing Calculations'!B578,'Clearing Calculations'!C578,\"\")","v":""},"","","",""]
[{"$f":"IF('Clearing Calculations'!A579=\"\",\"\",'Clearing Calculations'!A579)","v":""},{"$f":"IF('Clearing Calculations'!A579,'Clearing Calculations'!B579,\"\")","v":""},{"$f":"IF('Clearing Calculations'!B579,'Clearing Calculations'!C579,\"\")","v":""},"","","",""]
[{"$f":"IF('Clearing Calculations'!A580=\"\",\"\",'Clearing Calculations'!A580)","v":""},{"$f":"IF('Clearing Calculations'!A580,'Clearing Calculations'!B580,\"\")","v":""},{"$f":"IF('Clearing Calculations'!B580,'Clearing Calculations'!C580,\"\")","v":""},"","","",""]
[{"$f":"IF('Clearing Calculations'!A581=\"\",\"\",'Clearing Calculations'!A581)","v":""},{"$f":"IF('Clearing Calculations'!A581,'Clearing Calculations'!B581,\"\")","v":""},{"$f":"IF('Clearing Calculations'!B581,'Clearing Calculations'!C581,\"\")","v":""},"","","",""]
[{"$f":"IF('Clearing Calculations'!A582=\"\",\"\",'Clearing Calculations'!A582)","v":""},{"$f":"IF('Clearing Calculations'!A582,'Clearing Calculations'!B582,\"\")","v":""},{"$f":"IF('Clearing Calculations'!B582,'Clearing Calculations'!C582,\"\")","v":""},"","","",""]
[{"$f":"IF('Clearing Calculations'!A583=\"\",\"\",'Clearing Calculations'!A583)","v":""},{"$f":"IF('Clearing Calculations'!A583,'Clearing Calculations'!B583,\"\")","v":""},{"$f":"IF('Clearing Calculations'!B583,'Clearing Calculations'!C583,\"\")","v":""},"","","",""]
[{"$f":"IF('Clearing Calculations'!A584=\"\",\"\",'Clearing Calculations'!A584)","v":""},{"$f":"IF('Clearing Calculations'!A584,'Clearing Calculations'!B584,\"\")","v":""},{"$f":"IF('Clearing Calculations'!B584,'Clearing Calculations'!C584,\"\")","v":""},"","","",""]
[{"$f":"IF('Clearing Calculations'!A585=\"\",\"\",'Clearing Calculations'!A585)","v":""},{"$f":"IF('Clearing Calculations'!A585,'Clearing Calculations'!B585,\"\")","v":""},{"$f":"IF('Clearing Calculations'!B585,'Clearing Calculations'!C585,\"\")","v":""},"","","",""]
[{"$f":"IF('Clearing Calculations'!A586=\"\",\"\",'Clearing Calculations'!A586)","v":""},{"$f":"IF('Clearing Calculations'!A586,'Clearing Calculations'!B586,\"\")","v":""},{"$f":"IF('Clearing Calculations'!B586,'Clearing Calculations'!C586,\"\")","v":""},"","","",""]
[{"$f":"IF('Clearing Calculations'!A587=\"\",\"\",'Clearing Calculations'!A587)","v":""},{"$f":"IF('Clearing Calculations'!A587,'Clearing Calculations'!B587,\"\")","v":""},{"$f":"IF('Clearing Calculations'!B587,'Clearing Calculations'!C587,\"\")","v":""},"","","",""]
[{"$f":"IF('Clearing Calculations'!A588=\"\",\"\",'Clearing Calculations'!A588)","v":""},{"$f":"IF('Clearing Calculations'!A588,'Clearing Calculations'!B588,\"\")","v":""},{"$f":"IF('Clearing Calculations'!B588,'Clearing Calculations'!C588,\"\")","v":""},"","","",""]
[{"$f":"IF('Clearing Calculations'!A589=\"\",\"\",'Clearing Calculations'!A589)","v":""},{"$f":"IF('Clearing Calculations'!A589,'Clearing Calculations'!B589,\"\")","v":""},{"$f":"IF('Clearing Calculations'!B589,'Clearing Calculations'!C589,\"\")","v":""},"","","",""]
[{"$f":"IF('Clearing Calculations'!A590=\"\",\"\",'Clearing Calculations'!A590)","v":""},{"$f":"IF('Clearing Calculations'!A590,'Clearing Calculations'!B590,\"\")","v":""},{"$f":"IF('Clearing Calculations'!B590,'Clearing Calculations'!C590,\"\")","v":""},"","","",""]
[{"$f":"IF('Clearing Calculations'!A591=\"\",\"\",'Clearing Calculations'!A591)","v":""},{"$f":"IF('Clearing Calculations'!A591,'Clearing Calculations'!B591,\"\")","v":""},{"$f":"IF('Clearing Calculations'!B591,'Clearing Calculations'!C591,\"\")","v":""},"","","",""]
[{"$f":"IF('Clearing Calculations'!A592=\"\",\"\",'Clearing Calculations'!A592)","v":""},{"$f":"IF('Clearing Calculations'!A592,'Clearing Calculations'!B592,\"\")","v":""},{"$f":"IF('Clearing Calculations'!B592,'Clearing Calculations'!C592,\"\")","v":""},"","","",""]
[{"$f":"IF('Clearing Calculations'!A593=\"\",\"\",'Clearing Calculations'!A593)","v":""},{"$f":"IF('Clearing Calculations'!A593,'Clearing Calculations'!B593,\"\")","v":""},{"$f":"IF('Clearing Calculations'!B593,'Clearing Calculations'!C593,\"\")","v":""},"","","",""]
[{"$f":"IF('Clearing Calculations'!A594=\"\",\"\",'Clearing Calculations'!A594)","v":""},{"$f":"IF('Clearing Calculations'!A594,'Clearing Calculations'!B594,\"\")","v":""},{"$f":"IF('Clearing Calculations'!B594,'Clearing Calculations'!C594,\"\")","v":""},"","","",""]
[{"$f":"IF('Clearing Calculations'!A595=\"\",\"\",'Clearing Calculations'!A595)","v":""},{"$f":"IF('Clearing Calculations'!A595,'Clearing Calculations'!B595,\"\")","v":""},{"$f":"IF('Clearing Calculations'!B595,'Clearing Calculations'!C595,\"\")","v":""},"","","",""]
[{"$f":"IF('Clearing Calculations'!A596=\"\",\"\",'Clearing Calculations'!A596)","v":""},{"$f":"IF('Clearing Calculations'!A596,'Clearing Calculations'!B596,\"\")","v":""},{"$f":"IF('Clearing Calculations'!B596,'Clearing Calculations'!C596,\"\")","v":""},"","","",""]
[{"$f":"IF('Clearing Calculations'!A597=\"\",\"\",'Clearing Calculations'!A597)","v":""},{"$f":"IF('Clearing Calculations'!A597,'Clearing Calculations'!B597,\"\")","v":""},{"$f":"IF('Clearing Calculations'!B597,'Clearing Calculations'!C597,\"\")","v":""},"","","",""]
[{"$f":"IF('Clearing Calculations'!A598=\"\",\"\",'Clearing Calculations'!A598)","v":""},{"$f":"IF('Clearing Calculations'!A598,'Clearing Calculations'!B598,\"\")","v":""},{"$f":"IF('Clearing Calculations'!B598,'Clearing Calculations'!C598,\"\")","v":""},"","","",""]
[{"$f":"IF('Clearing Calculations'!A599=\"\",\"\",'Clearing Calculations'!A599)","v":""},{"$f":"IF('Clearing Calculations'!A599,'Clearing Calculations'!B599,\"\")","v":""},{"$f":"IF('Clearing Calculations'!B599,'Clearing Calculations'!C599,\"\")","v":""},"","","",""]
[{"$f":"IF('Clearing Calculations'!A600=\"\",\"\",'Clearing Calculations'!A600)","v":""},{"$f":"IF('Clearing Calculations'!A600,'Clearing Calculations'!B600,\"\")","v":""},{"$f":"IF('Clearing Calculations'!B600,'Clearing Calculations'!C600,\"\")","v":""},"","","",""]
[{"$f":"IF('Clearing Calculations'!A601=\"\",\"\",'Clearing Calculations'!A601)","v":""},{"$f":"IF('Clearing Calculations'!A601,'Clearing Calculations'!B601,\"\")","v":""},{"$f":"IF('Clearing Calculations'!B601,'Clearing Calculations'!C601,\"\")","v":""},"","","",""]
[{"$f":"IF('Clearing Calculations'!A602=\"\",\"\",'Clearing Calculations'!A602)","v":""},{"$f":"IF('Clearing Calculations'!A602,'Clearing Calculations'!B602,\"\")","v":""},{"$f":"IF('Clearing Calculations'!B602,'Clearing Calculations'!C602,\"\")","v":""},"","","",""]
[{"$f":"IF('Clearing Calculations'!A603=\"\",\"\",'Clearing Calculations'!A603)","v":""},{"$f":"IF('Clearing Calculations'!A603,'Clearing Calculations'!B603,\"\")","v":""},{"$f":"IF('Clearing Calculations'!B603,'Clearing Calculations'!C603,\"\")","v":""},"","","",""]
[{"$f":"IF('Clearing Calculations'!A604=\"\",\"\",'Clearing Calculations'!A604)","v":""},{"$f":"IF('Clearing Calculations'!A604,'Clearing Calculations'!B604,\"\")","v":""},{"$f":"IF('Clearing Calculations'!B604,'Clearing Calculations'!C604,\"\")","v":""},"","","",""]
[{"$f":"IF('Clearing Calculations'!A605=\"\",\"\",'Clearing Calculations'!A605)","v":""},{"$f":"IF('Clearing Calculations'!A605,'Clearing Calculations'!B605,\"\")","v":""},{"$f":"IF('Clearing Calculations'!B605,'Clearing Calculations'!C605,\"\")","v":""},"","","",""]
[{"$f":"IF('Clearing Calculations'!A606=\"\",\"\",'Clearing Calculations'!A606)","v":""},{"$f":"IF('Clearing Calculations'!A606,'Clearing Calculations'!B606,\"\")","v":""},{"$f":"IF('Clearing Calculations'!B606,'Clearing Calculations'!C606,\"\")","v":""},"","","",""]
[{"$f":"IF('Clearing Calculations'!A607=\"\",\"\",'Clearing Calculations'!A607)","v":""},{"$f":"IF('Clearing Calculations'!A607,'Clearing Calculations'!B607,\"\")","v":""},{"$f":"IF('Clearing Calculations'!B607,'Clearing Calculations'!C607,\"\")","v":""},"","","",""]
[{"$f":"IF('Clearing Calculations'!A608=\"\",\"\",'Clearing Calculations'!A608)","v":""},{"$f":"IF('Clearing Calculations'!A608,'Clearing Calculations'!B608,\"\")","v":""},{"$f":"IF('Clearing Calculations'!B608,'Clearing Calculations'!C608,\"\")","v":""},"","","",""]
[{"$f":"IF('Clearing Calculations'!A609=\"\",\"\",'Clearing Calculations'!A609)","v":""},{"$f":"IF('Clearing Calculations'!A609,'Clearing Calculations'!B609,\"\")","v":""},{"$f":"IF('Clearing Calculations'!B609,'Clearing Calculations'!C609,\"\")","v":""},"","","",""]
[{"$f":"IF('Clearing Calculations'!A610=\"\",\"\",'Clearing Calculations'!A610)","v":""},{"$f":"IF('Clearing Calculations'!A610,'Clearing Calculations'!B610,\"\")","v":""},{"$f":"IF('Clearing Calculations'!B610,'Clearing Calculations'!C610,\"\")","v":""},"","","",""]
[{"$f":"IF('Clearing Calculations'!A611=\"\",\"\",'Clearing Calculations'!A611)","v":""},{"$f":"IF('Clearing Calculations'!A611,'Clearing Calculations'!B611,\"\")","v":""},{"$f":"IF('Clearing Calculations'!B611,'Clearing Calculations'!C611,\"\")","v":""},"","","",""]
[{"$f":"IF('Clearing Calculations'!A612=\"\",\"\",'Clearing Calculations'!A612)","v":""},{"$f":"IF('Clearing Calculations'!A612,'Clearing Calculations'!B612,\"\")","v":""},{"$f":"IF('Clearing Calculations'!B612,'Clearing Calculations'!C612,\"\")","v":""},"","","",""]
[{"$f":"IF('Clearing Calculations'!A613=\"\",\"\",'Clearing Calculations'!A613)","v":""},{"$f":"IF('Clearing Calculations'!A613,'Clearing Calculations'!B613,\"\")","v":""},{"$f":"IF('Clearing Calculations'!B613,'Clearing Calculations'!C613,\"\")","v":""},"","","",""]
[{"$f":"IF('Clearing Calculations'!A614=\"\",\"\",'Clearing Calculations'!A614)","v":""},{"$f":"IF('Clearing Calculations'!A614,'Clearing Calculations'!B614,\"\")","v":""},{"$f":"IF('Clearing Calculations'!B614,'Clearing Calculations'!C614,\"\")","v":""},"","","",""]
[{"$f":"IF('Clearing Calculations'!A615=\"\",\"\",'Clearing Calculations'!A615)","v":""},{"$f":"IF('Clearing Calculations'!A615,'Clearing Calculations'!B615,\"\")","v":""},{"$f":"IF('Clearing Calculations'!B615,'Clearing Calculations'!C615,\"\")","v":""},"","","",""]
[{"$f":"IF('Clearing Calculations'!A616=\"\",\"\",'Clearing Calculations'!A616)","v":""},{"$f":"IF('Clearing Calculations'!A616,'Clearing Calculations'!B616,\"\")","v":""},{"$f":"IF('Clearing Calculations'!B616,'Clearing Calculations'!C616,\"\")","v":""},"","","",""]
[{"$f":"IF('Clearing Calculations'!A617=\"\",\"\",'Clearing Calculations'!A617)","v":""},{"$f":"IF('Clearing Calculations'!A617,'Clearing Calculations'!B617,\"\")","v":""},{"$f":"IF('Clearing Calculations'!B617,'Clearing Calculations'!C617,\"\")","v":""},"","","",""]
[{"$f":"IF('Clearing Calculations'!A618=\"\",\"\",'Clearing Calculations'!A618)","v":""},{"$f":"IF('Clearing Calculations'!A618,'Clearing Calculations'!B618,\"\")","v":""},{"$f":"IF('Clearing Calculations'!B618,'Clearing Calculations'!C618,\"\")","v":""},"","","",""]
[{"$f":"IF('Clearing Calculations'!A619=\"\",\"\",'Clearing Calculations'!A619)","v":""},{"$f":"IF('Clearing Calculations'!A619,'Clearing Calculations'!B619,\"\")","v":""},{"$f":"IF('Clearing Calculations'!B619,'Clearing Calculations'!C619,\"\")","v":""},"","","",""]
[{"$f":"IF('Clearing Calculations'!A620=\"\",\"\",'Clearing Calculations'!A620)","v":""},{"$f":"IF('Clearing Calculations'!A620,'Clearing Calculations'!B620,\"\")","v":""},{"$f":"IF('Clearing Calculations'!B620,'Clearing Calculations'!C620,\"\")","v":""},{"$f":"IF(A626=\"\",\"\",$B626+$C626)","v":""},{"$f":"IF(A626=\"\",\"\",(D626+D625)/2*(A626-A625))","v":""},{"$f":"IF(A626=\"\",\"\",(E626/9))","v":""},{"$f":"IF(A626=\"\",\"\",E626/$G$3)","v":""}]
[{"$f":"IF('Clearing Calculations'!A621=\"\",\"\",'Clearing Calculations'!A621)","v":""},{"$f":"IF('Clearing Calculations'!A621,'Clearing Calculations'!B621,\"\")","v":""},{"$f":"IF('Clearing Calculations'!B621,'Clearing Calculations'!C621,\"\")","v":""},"","","",""]
[{"$f":"IF('Clearing Calculations'!A622=\"\",\"\",'Clearing Calculations'!A622)","v":""},{"$f":"IF('Clearing Calculations'!A622,'Clearing Calculations'!B622,\"\")","v":""},{"$f":"IF('Clearing Calculations'!B622,'Clearing Calculations'!C622,\"\")","v":""},"","","",""]
[{"$f":"IF('Clearing Calculations'!A623=\"\",\"\",'Clearing Calculations'!A623)","v":""},{"$f":"IF('Clearing Calculations'!A623,'Clearing Calculations'!B623,\"\")","v":""},{"$f":"IF('Clearing Calculations'!B623,'Clearing Calculations'!C623,\"\")","v":""},"","","",""]
[{"$f":"IF('Clearing Calculations'!A624=\"\",\"\",'Clearing Calculations'!A624)","v":""},{"$f":"IF('Clearing Calculations'!A624,'Clearing Calculations'!B624,\"\")","v":""},{"$f":"IF('Clearing Calculations'!B624,'Clearing Calculations'!C624,\"\")","v":""},"","","",""]
[{"$f":"IF('Clearing Calculations'!A625=\"\",\"\",'Clearing Calculations'!A625)","v":""},{"$f":"IF('Clearing Calculations'!A625,'Clearing Calculations'!B625,\"\")","v":""},{"$f":"IF('Clearing Calculations'!B625,'Clearing Calculations'!C625,\"\")","v":""},"","","",""]
[{"$f":"IF('Clearing Calculations'!A626=\"\",\"\",'Clearing Calculations'!A626)","v":""},{"$f":"IF('Clearing Calculations'!A626,'Clearing Calculations'!B626,\"\")","v":""},{"$f":"IF('Clearing Calculations'!B626,'Clearing Calculations'!C626,\"\")","v":""},"","","",""]
[{"$f":"IF('Clearing Calculations'!A627=\"\",\"\",'Clearing Calculations'!A627)","v":""},{"$f":"IF('Clearing Calculations'!A627,'Clearing Calculations'!B627,\"\")","v":""},{"$f":"IF('Clearing Calculations'!B627,'Clearing Calculations'!C627,\"\")","v":""},"","","",""]
[{"$f":"IF('Clearing Calculations'!A628=\"\",\"\",'Clearing Calculations'!A628)","v":""},{"$f":"IF('Clearing Calculations'!A628,'Clearing Calculations'!B628,\"\")","v":""},{"$f":"IF('Clearing Calculations'!B628,'Clearing Calculations'!C628,\"\")","v":""},"","","",""]
[{"$f":"IF('Clearing Calculations'!A629=\"\",\"\",'Clearing Calculations'!A629)","v":""},{"$f":"IF('Clearing Calculations'!A629,'Clearing Calculations'!B629,\"\")","v":""},{"$f":"IF('Clearing Calculations'!B629,'Clearing Calculations'!C629,\"\")","v":""},"","","",""]
[{"$f":"IF('Clearing Calculations'!A630=\"\",\"\",'Clearing Calculations'!A630)","v":""},{"$f":"IF('Clearing Calculations'!A630,'Clearing Calculations'!B630,\"\")","v":""},{"$f":"IF('Clearing Calculations'!B630,'Clearing Calculations'!C630,\"\")","v":""},"","","",""]
[{"$f":"IF('Clearing Calculations'!A631=\"\",\"\",'Clearing Calculations'!A631)","v":""},{"$f":"IF('Clearing Calculations'!A631,'Clearing Calculations'!B631,\"\")","v":""},{"$f":"IF('Clearing Calculations'!B631,'Clearing Calculations'!C631,\"\")","v":""},"","","",""]
[{"$f":"IF('Clearing Calculations'!A632=\"\",\"\",'Clearing Calculations'!A632)","v":""},{"$f":"IF('Clearing Calculations'!A632,'Clearing Calculations'!B632,\"\")","v":""},{"$f":"IF('Clearing Calculations'!B632,'Clearing Calculations'!C632,\"\")","v":""},"","","",""]
[{"$f":"IF('Clearing Calculations'!A633=\"\",\"\",'Clearing Calculations'!A633)","v":""},{"$f":"IF('Clearing Calculations'!A633,'Clearing Calculations'!B633,\"\")","v":""},{"$f":"IF('Clearing Calculations'!B633,'Clearing Calculations'!C633,\"\")","v":""},"","","",""]
[{"$f":"IF('Clearing Calculations'!A634=\"\",\"\",'Clearing Calculations'!A634)","v":""},{"$f":"IF('Clearing Calculations'!A634,'Clearing Calculations'!B634,\"\")","v":""},{"$f":"IF('Clearing Calculations'!B634,'Clearing Calculations'!C634,\"\")","v":""},"","","",""]
[{"$f":"IF('Clearing Calculations'!A635=\"\",\"\",'Clearing Calculations'!A635)","v":""},{"$f":"IF('Clearing Calculations'!A635,'Clearing Calculations'!B635,\"\")","v":""},{"$f":"IF('Clearing Calculations'!B635,'Clearing Calculations'!C635,\"\")","v":""},"","","",""]
[{"$f":"IF('Clearing Calculations'!A636=\"\",\"\",'Clearing Calculations'!A636)","v":""},{"$f":"IF('Clearing Calculations'!A636,'Clearing Calculations'!B636,\"\")","v":""},{"$f":"IF('Clearing Calculations'!B636,'Clearing Calculations'!C636,\"\")","v":""},"","","",""]
[{"$f":"IF('Clearing Calculations'!A637=\"\",\"\",'Clearing Calculations'!A637)","v":""},{"$f":"IF('Clearing Calculations'!A637,'Clearing Calculations'!B637,\"\")","v":""},{"$f":"IF('Clearing Calculations'!B637,'Clearing Calculations'!C637,\"\")","v":""},"","","",""]
[{"$f":"IF('Clearing Calculations'!A638=\"\",\"\",'Clearing Calculations'!A638)","v":""},{"$f":"IF('Clearing Calculations'!A638,'Clearing Calculations'!B638,\"\")","v":""},{"$f":"IF('Clearing Calculations'!B638,'Clearing Calculations'!C638,\"\")","v":""},"","","",""]
[{"$f":"IF('Clearing Calculations'!A639=\"\",\"\",'Clearing Calculations'!A639)","v":""},{"$f":"IF('Clearing Calculations'!A639,'Clearing Calculations'!B639,\"\")","v":""},{"$f":"IF('Clearing Calculations'!B639,'Clearing Calculations'!C639,\"\")","v":""},"","","",""]
[{"$f":"IF('Clearing Calculations'!A640=\"\",\"\",'Clearing Calculations'!A640)","v":""},{"$f":"IF('Clearing Calculations'!A640,'Clearing Calculations'!B640,\"\")","v":""},{"$f":"IF('Clearing Calculations'!B640,'Clearing Calculations'!C640,\"\")","v":""},"","","",""]
[{"$f":"IF('Clearing Calculations'!A641=\"\",\"\",'Clearing Calculations'!A641)","v":""},{"$f":"IF('Clearing Calculations'!A641,'Clearing Calculations'!B641,\"\")","v":""},{"$f":"IF('Clearing Calculations'!B641,'Clearing Calculations'!C641,\"\")","v":""},"","","",""]
[{"$f":"IF('Clearing Calculations'!A642=\"\",\"\",'Clearing Calculations'!A642)","v":""},{"$f":"IF('Clearing Calculations'!A642,'Clearing Calculations'!B642,\"\")","v":""},{"$f":"IF('Clearing Calculations'!B642,'Clearing Calculations'!C642,\"\")","v":""},"","","",""]
[{"$f":"IF('Clearing Calculations'!A643=\"\",\"\",'Clearing Calculations'!A643)","v":""},{"$f":"IF('Clearing Calculations'!A643,'Clearing Calculations'!B643,\"\")","v":""},{"$f":"IF('Clearing Calculations'!B643,'Clearing Calculations'!C643,\"\")","v":""},"","","",""]
[{"$f":"IF('Clearing Calculations'!A644=\"\",\"\",'Clearing Calculations'!A644)","v":""},{"$f":"IF('Clearing Calculations'!A644,'Clearing Calculations'!B644,\"\")","v":""},{"$f":"IF('Clearing Calculations'!B644,'Clearing Calculations'!C644,\"\")","v":""},"","","",""]
[{"$f":"IF('Clearing Calculations'!A645=\"\",\"\",'Clearing Calculations'!A645)","v":""},{"$f":"IF('Clearing Calculations'!A645,'Clearing Calculations'!B645,\"\")","v":""},{"$f":"IF('Clearing Calculations'!B645,'Clearing Calculations'!C645,\"\")","v":""},"","","",""]
[{"$f":"IF('Clearing Calculations'!A646=\"\",\"\",'Clearing Calculations'!A646)","v":""},{"$f":"IF('Clearing Calculations'!A646,'Clearing Calculations'!B646,\"\")","v":""},{"$f":"IF('Clearing Calculations'!B646,'Clearing Calculations'!C646,\"\")","v":""},"","","",""]
[{"$f":"IF('Clearing Calculations'!A647=\"\",\"\",'Clearing Calculations'!A647)","v":""},{"$f":"IF('Clearing Calculations'!A647,'Clearing Calculations'!B647,\"\")","v":""},{"$f":"IF('Clearing Calculations'!B647,'Clearing Calculations'!C647,\"\")","v":""},"","","",""]
[{"$f":"IF('Clearing Calculations'!A648=\"\",\"\",'Clearing Calculations'!A648)","v":""},{"$f":"IF('Clearing Calculations'!A648,'Clearing Calculations'!B648,\"\")","v":""},{"$f":"IF('Clearing Calculations'!B648,'Clearing Calculations'!C648,\"\")","v":""},"","","",""]
[{"$f":"IF('Clearing Calculations'!A649=\"\",\"\",'Clearing Calculations'!A649)","v":""},{"$f":"IF('Clearing Calculations'!A649,'Clearing Calculations'!B649,\"\")","v":""},{"$f":"IF('Clearing Calculations'!B649,'Clearing Calculations'!C649,\"\")","v":""},"","","",""]
[{"$f":"IF('Clearing Calculations'!A650=\"\",\"\",'Clearing Calculations'!A650)","v":""},{"$f":"IF('Clearing Calculations'!A650,'Clearing Calculations'!B650,\"\")","v":""},{"$f":"IF('Clearing Calculations'!B650,'Clearing Calculations'!C650,\"\")","v":""},"","","",""]
[{"$f":"IF('Clearing Calculations'!A651=\"\",\"\",'Clearing Calculations'!A651)","v":""},{"$f":"IF('Clearing Calculations'!A651,'Clearing Calculations'!B651,\"\")","v":""},{"$f":"IF('Clearing Calculations'!B651,'Clearing Calculations'!C651,\"\")","v":""},"","","",""]
[{"$f":"IF('Clearing Calculations'!A652=\"\",\"\",'Clearing Calculations'!A652)","v":""},{"$f":"IF('Clearing Calculations'!A652,'Clearing Calculations'!B652,\"\")","v":""},{"$f":"IF('Clearing Calculations'!B652,'Clearing Calculations'!C652,\"\")","v":""},"","","",""]
[{"$f":"IF('Clearing Calculations'!A653=\"\",\"\",'Clearing Calculations'!A653)","v":""},{"$f":"IF('Clearing Calculations'!A653,'Clearing Calculations'!B653,\"\")","v":""},{"$f":"IF('Clearing Calculations'!B653,'Clearing Calculations'!C653,\"\")","v":""},"","","",""]
[{"$f":"IF('Clearing Calculations'!A654=\"\",\"\",'Clearing Calculations'!A654)","v":""},{"$f":"IF('Clearing Calculations'!A654,'Clearing Calculations'!B654,\"\")","v":""},{"$f":"IF('Clearing Calculations'!B654,'Clearing Calculations'!C654,\"\")","v":""},"","","",""]
[{"$f":"IF('Clearing Calculations'!A655=\"\",\"\",'Clearing Calculations'!A655)","v":""},{"$f":"IF('Clearing Calculations'!A655,'Clearing Calculations'!B655,\"\")","v":""},{"$f":"IF('Clearing Calculations'!B655,'Clearing Calculations'!C655,\"\")","v":""},"","","",""]
[{"$f":"IF('Clearing Calculations'!A656=\"\",\"\",'Clearing Calculations'!A656)","v":""},{"$f":"IF('Clearing Calculations'!A656,'Clearing Calculations'!B656,\"\")","v":""},{"$f":"IF('Clearing Calculations'!B656,'Clearing Calculations'!C656,\"\")","v":""},"","","",""]
[{"$f":"IF('Clearing Calculations'!A657=\"\",\"\",'Clearing Calculations'!A657)","v":""},{"$f":"IF('Clearing Calculations'!A657,'Clearing Calculations'!B657,\"\")","v":""},{"$f":"IF('Clearing Calculations'!B657,'Clearing Calculations'!C657,\"\")","v":""},"","","",""]
[{"$f":"IF('Clearing Calculations'!A658=\"\",\"\",'Clearing Calculations'!A658)","v":""},{"$f":"IF('Clearing Calculations'!A658,'Clearing Calculations'!B658,\"\")","v":""},{"$f":"IF('Clearing Calculations'!B658,'Clearing Calculations'!C658,\"\")","v":""},"","","",""]
[{"$f":"IF('Clearing Calculations'!A659=\"\",\"\",'Clearing Calculations'!A659)","v":""},{"$f":"IF('Clearing Calculations'!A659,'Clearing Calculations'!B659,\"\")","v":""},{"$f":"IF('Clearing Calculations'!B659,'Clearing Calculations'!C659,\"\")","v":""},"","","",""]
[{"$f":"IF('Clearing Calculations'!A660=\"\",\"\",'Clearing Calculations'!A660)","v":""},{"$f":"IF('Clearing Calculations'!A660,'Clearing Calculations'!B660,\"\")","v":""},{"$f":"IF('Clearing Calculations'!B660,'Clearing Calculations'!C660,\"\")","v":""},"","","",""]
[{"$f":"IF('Clearing Calculations'!A661=\"\",\"\",'Clearing Calculations'!A661)","v":""},{"$f":"IF('Clearing Calculations'!A661,'Clearing Calculations'!B661,\"\")","v":""},{"$f":"IF('Clearing Calculations'!B661,'Clearing Calculations'!C661,\"\")","v":""},"","","",""]
[{"$f":"IF('Clearing Calculations'!A662=\"\",\"\",'Clearing Calculations'!A662)","v":""},{"$f":"IF('Clearing Calculations'!A662,'Clearing Calculations'!B662,\"\")","v":""},{"$f":"IF('Clearing Calculations'!B662,'Clearing Calculations'!C662,\"\")","v":""},"","","",""]
[{"$f":"IF('Clearing Calculations'!A663=\"\",\"\",'Clearing Calculations'!A663)","v":""},{"$f":"IF('Clearing Calculations'!A663,'Clearing Calculations'!B663,\"\")","v":""},{"$f":"IF('Clearing Calculations'!B663,'Clearing Calculations'!C663,\"\")","v":""},"","","",""]
[{"$f":"IF('Clearing Calculations'!A664=\"\",\"\",'Clearing Calculations'!A664)","v":""},{"$f":"IF('Clearing Calculations'!A664,'Clearing Calculations'!B664,\"\")","v":""},{"$f":"IF('Clearing Calculations'!B664,'Clearing Calculations'!C664,\"\")","v":""},"","","",""]
[{"$f":"IF('Clearing Calculations'!A665=\"\",\"\",'Clearing Calculations'!A665)","v":""},{"$f":"IF('Clearing Calculations'!A665,'Clearing Calculations'!B665,\"\")","v":""},{"$f":"IF('Clearing Calculations'!B665,'Clearing Calculations'!C665,\"\")","v":""},"","","",""]
[{"$f":"IF('Clearing Calculations'!A666=\"\",\"\",'Clearing Calculations'!A666)","v":""},{"$f":"IF('Clearing Calculations'!A666,'Clearing Calculations'!B666,\"\")","v":""},{"$f":"IF('Clearing Calculations'!B666,'Clearing Calculations'!C666,\"\")","v":""},"","","",""]
[{"$f":"IF('Clearing Calculations'!A667=\"\",\"\",'Clearing Calculations'!A667)","v":""},{"$f":"IF('Clearing Calculations'!A667,'Clearing Calculations'!B667,\"\")","v":""},{"$f":"IF('Clearing Calculations'!B667,'Clearing Calculations'!C667,\"\")","v":""},"","","",""]
[{"$f":"IF('Clearing Calculations'!A668=\"\",\"\",'Clearing Calculations'!A668)","v":""},{"$f":"IF('Clearing Calculations'!A668,'Clearing Calculations'!B668,\"\")","v":""},{"$f":"IF('Clearing Calculations'!B668,'Clearing Calculations'!C668,\"\")","v":""},"","","",""]
[{"$f":"IF('Clearing Calculations'!A669=\"\",\"\",'Clearing Calculations'!A669)","v":""},{"$f":"IF('Clearing Calculations'!A669,'Clearing Calculations'!B669,\"\")","v":""},{"$f":"IF('Clearing Calculations'!B669,'Clearing Calculations'!C669,\"\")","v":""},"","","",""]
[{"$f":"IF('Clearing Calculations'!A670=\"\",\"\",'Clearing Calculations'!A670)","v":""},{"$f":"IF('Clearing Calculations'!A670,'Clearing Calculations'!B670,\"\")","v":""},{"$f":"IF('Clearing Calculations'!B670,'Clearing Calculations'!C670,\"\")","v":""},"","","",""]
[{"$f":"IF('Clearing Calculations'!A671=\"\",\"\",'Clearing Calculations'!A671)","v":""},{"$f":"IF('Clearing Calculations'!A671,'Clearing Calculations'!B671,\"\")","v":""},{"$f":"IF('Clearing Calculations'!B671,'Clearing Calculations'!C671,\"\")","v":""},"","","",""]
[{"$f":"IF('Clearing Calculations'!A672=\"\",\"\",'Clearing Calculations'!A672)","v":""},{"$f":"IF('Clearing Calculations'!A672,'Clearing Calculations'!B672,\"\")","v":""},{"$f":"IF('Clearing Calculations'!B672,'Clearing Calculations'!C672,\"\")","v":""},"","","",""]
[{"$f":"IF('Clearing Calculations'!A673=\"\",\"\",'Clearing Calculations'!A673)","v":""},{"$f":"IF('Clearing Calculations'!A673,'Clearing Calculations'!B673,\"\")","v":""},{"$f":"IF('Clearing Calculations'!B673,'Clearing Calculations'!C673,\"\")","v":""},"","","",""]
[{"$f":"IF('Clearing Calculations'!A674=\"\",\"\",'Clearing Calculations'!A674)","v":""},{"$f":"IF('Clearing Calculations'!A674,'Clearing Calculations'!B674,\"\")","v":""},{"$f":"IF('Clearing Calculations'!B674,'Clearing Calculations'!C674,\"\")","v":""},"","","",""]
[{"$f":"IF('Clearing Calculations'!A675=\"\",\"\",'Clearing Calculations'!A675)","v":""},{"$f":"IF('Clearing Calculations'!A675,'Clearing Calculations'!B675,\"\")","v":""},{"$f":"IF('Clearing Calculations'!B675,'Clearing Calculations'!C675,\"\")","v":""},"","","",""]
[{"$f":"IF('Clearing Calculations'!A676=\"\",\"\",'Clearing Calculations'!A676)","v":""},{"$f":"IF('Clearing Calculations'!A676,'Clearing Calculations'!B676,\"\")","v":""},{"$f":"IF('Clearing Calculations'!B676,'Clearing Calculations'!C676,\"\")","v":""},"","","",""]
[{"$f":"IF('Clearing Calculations'!A677=\"\",\"\",'Clearing Calculations'!A677)","v":""},{"$f":"IF('Clearing Calculations'!A677,'Clearing Calculations'!B677,\"\")","v":""},{"$f":"IF('Clearing Calculations'!B677,'Clearing Calculations'!C677,\"\")","v":""},"","","",""]
[{"$f":"IF('Clearing Calculations'!A678=\"\",\"\",'Clearing Calculations'!A678)","v":""},{"$f":"IF('Clearing Calculations'!A678,'Clearing Calculations'!B678,\"\")","v":""},{"$f":"IF('Clearing Calculations'!B678,'Clearing Calculations'!C678,\"\")","v":""},"","","",""]
[{"$f":"IF('Clearing Calculations'!A679=\"\",\"\",'Clearing Calculations'!A679)","v":""},{"$f":"IF('Clearing Calculations'!A679,'Clearing Calculations'!B679,\"\")","v":""},{"$f":"IF('Clearing Calculations'!B679,'Clearing Calculations'!C679,\"\")","v":""},"","","",""]
[{"$f":"IF('Clearing Calculations'!A680=\"\",\"\",'Clearing Calculations'!A680)","v":""},{"$f":"IF('Clearing Calculations'!A680,'Clearing Calculations'!B680,\"\")","v":""},{"$f":"IF('Clearing Calculations'!B680,'Clearing Calculations'!C680,\"\")","v":""},"","","",""]
[{"$f":"IF('Clearing Calculations'!A681=\"\",\"\",'Clearing Calculations'!A681)","v":""},{"$f":"IF('Clearing Calculations'!A681,'Clearing Calculations'!B681,\"\")","v":""},{"$f":"IF('Clearing Calculations'!B681,'Clearing Calculations'!C681,\"\")","v":""},"","","",""]
[{"$f":"IF('Clearing Calculations'!A682=\"\",\"\",'Clearing Calculations'!A682)","v":""},{"$f":"IF('Clearing Calculations'!A682,'Clearing Calculations'!B682,\"\")","v":""},{"$f":"IF('Clearing Calculations'!B682,'Clearing Calculations'!C682,\"\")","v":""},"","","",""]
[{"$f":"IF('Clearing Calculations'!A683=\"\",\"\",'Clearing Calculations'!A683)","v":""},{"$f":"IF('Clearing Calculations'!A683,'Clearing Calculations'!B683,\"\")","v":""},{"$f":"IF('Clearing Calculations'!B683,'Clearing Calculations'!C683,\"\")","v":""},"","","",""]
[{"$f":"IF('Clearing Calculations'!A684=\"\",\"\",'Clearing Calculations'!A684)","v":""},{"$f":"IF('Clearing Calculations'!A684,'Clearing Calculations'!B684,\"\")","v":""},{"$f":"IF('Clearing Calculations'!B684,'Clearing Calculations'!C684,\"\")","v":""},{"$f":"IF(A690=\"\",\"\",$B690+$C690)","v":""},{"$f":"IF(A690=\"\",\"\",(D690+D689)/2*(A690-A689))","v":""},{"$f":"IF(A690=\"\",\"\",(E690/9))","v":""},{"$f":"IF(A690=\"\",\"\",E690/$G$3)","v":""}]
[{"$f":"IF('Clearing Calculations'!A685=\"\",\"\",'Clearing Calculations'!A685)","v":""},{"$f":"IF('Clearing Calculations'!A685,'Clearing Calculations'!B685,\"\")","v":""},{"$f":"IF('Clearing Calculations'!B685,'Clearing Calculations'!C685,\"\")","v":""},"","","",""]
[{"$f":"IF('Clearing Calculations'!A686=\"\",\"\",'Clearing Calculations'!A686)","v":""},{"$f":"IF('Clearing Calculations'!A686,'Clearing Calculations'!B686,\"\")","v":""},{"$f":"IF('Clearing Calculations'!B686,'Clearing Calculations'!C686,\"\")","v":""},"","","",""]
[{"$f":"IF('Clearing Calculations'!A687=\"\",\"\",'Clearing Calculations'!A687)","v":""},{"$f":"IF('Clearing Calculations'!A687,'Clearing Calculations'!B687,\"\")","v":""},{"$f":"IF('Clearing Calculations'!B687,'Clearing Calculations'!C687,\"\")","v":""},"","","",""]
[{"$f":"IF('Clearing Calculations'!A688=\"\",\"\",'Clearing Calculations'!A688)","v":""},{"$f":"IF('Clearing Calculations'!A688,'Clearing Calculations'!B688,\"\")","v":""},{"$f":"IF('Clearing Calculations'!B688,'Clearing Calculations'!C688,\"\")","v":""},"","","",""]
[{"$f":"IF('Clearing Calculations'!A689=\"\",\"\",'Clearing Calculations'!A689)","v":""},{"$f":"IF('Clearing Calculations'!A689,'Clearing Calculations'!B689,\"\")","v":""},{"$f":"IF('Clearing Calculations'!B689,'Clearing Calculations'!C689,\"\")","v":""},"","","",""]
[{"$f":"IF('Clearing Calculations'!A690=\"\",\"\",'Clearing Calculations'!A690)","v":""},{"$f":"IF('Clearing Calculations'!A690,'Clearing Calculations'!B690,\"\")","v":""},{"$f":"IF('Clearing Calculations'!B690,'Clearing Calculations'!C690,\"\")","v":""},"","","",""]
[{"$f":"IF('Clearing Calculations'!A691=\"\",\"\",'Clearing Calculations'!A691)","v":""},{"$f":"IF('Clearing Calculations'!A691,'Clearing Calculations'!B691,\"\")","v":""},{"$f":"IF('Clearing Calculations'!B691,'Clearing Calculations'!C691,\"\")","v":""},"","","",""]
[{"$f":"IF('Clearing Calculations'!A692=\"\",\"\",'Clearing Calculations'!A692)","v":""},{"$f":"IF('Clearing Calculations'!A692,'Clearing Calculations'!B692,\"\")","v":""},{"$f":"IF('Clearing Calculations'!B692,'Clearing Calculations'!C692,\"\")","v":""},"","","",""]
[{"$f":"IF('Clearing Calculations'!A693=\"\",\"\",'Clearing Calculations'!A693)","v":""},{"$f":"IF('Clearing Calculations'!A693,'Clearing Calculations'!B693,\"\")","v":""},{"$f":"IF('Clearing Calculations'!B693,'Clearing Calculations'!C693,\"\")","v":""},"","","",""]
[{"$f":"IF('Clearing Calculations'!A694=\"\",\"\",'Clearing Calculations'!A694)","v":""},{"$f":"IF('Clearing Calculations'!A694,'Clearing Calculations'!B694,\"\")","v":""},{"$f":"IF('Clearing Calculations'!B694,'Clearing Calculations'!C694,\"\")","v":""},"","","",""]
[{"$f":"IF('Clearing Calculations'!A695=\"\",\"\",'Clearing Calculations'!A695)","v":""},{"$f":"IF('Clearing Calculations'!A695,'Clearing Calculations'!B695,\"\")","v":""},{"$f":"IF('Clearing Calculations'!B695,'Clearing Calculations'!C695,\"\")","v":""},"","","",""]
[{"$f":"IF('Clearing Calculations'!A696=\"\",\"\",'Clearing Calculations'!A696)","v":""},{"$f":"IF('Clearing Calculations'!A696,'Clearing Calculations'!B696,\"\")","v":""},{"$f":"IF('Clearing Calculations'!B696,'Clearing Calculations'!C696,\"\")","v":""},"","","",""]
[{"$f":"IF('Clearing Calculations'!A697=\"\",\"\",'Clearing Calculations'!A697)","v":""},{"$f":"IF('Clearing Calculations'!A697,'Clearing Calculations'!B697,\"\")","v":""},{"$f":"IF('Clearing Calculations'!B697,'Clearing Calculations'!C697,\"\")","v":""},"","","",""]
[{"$f":"IF('Clearing Calculations'!A698=\"\",\"\",'Clearing Calculations'!A698)","v":""},{"$f":"IF('Clearing Calculations'!A698,'Clearing Calculations'!B698,\"\")","v":""},{"$f":"IF('Clearing Calculations'!B698,'Clearing Calculations'!C698,\"\")","v":""},"","","",""]
[{"$f":"IF('Clearing Calculations'!A699=\"\",\"\",'Clearing Calculations'!A699)","v":""},{"$f":"IF('Clearing Calculations'!A699,'Clearing Calculations'!B699,\"\")","v":""},{"$f":"IF('Clearing Calculations'!B699,'Clearing Calculations'!C699,\"\")","v":""},"","","",""]
[{"$f":"IF('Clearing Calculations'!A700=\"\",\"\",'Clearing Calculations'!A700)","v":""},{"$f":"IF('Clearing Calculations'!A700,'Clearing Calculations'!B700,\"\")","v":""},{"$f":"IF('Clearing Calculations'!B700,'Clearing Calculations'!C700,\"\")","v":""},"","","",""]
[{"$f":"IF('Clearing Calculations'!A701=\"\",\"\",'Clearing Calculations'!A701)","v":""},{"$f":"IF('Clearing Calculations'!A701,'Clearing Calculations'!B701,\"\")","v":""},{"$f":"IF('Clearing Calculations'!B701,'Clearing Calculations'!C701,\"\")","v":""},"","","",""]
[{"$f":"IF('Clearing Calculations'!A702=\"\",\"\",'Clearing Calculations'!A702)","v":""},{"$f":"IF('Clearing Calculations'!A702,'Clearing Calculations'!B702,\"\")","v":""},{"$f":"IF('Clearing Calculations'!B702,'Clearing Calculations'!C702,\"\")","v":""},"","","",""]
[{"$f":"IF('Clearing Calculations'!A703=\"\",\"\",'Clearing Calculations'!A703)","v":""},{"$f":"IF('Clearing Calculations'!A703,'Clearing Calculations'!B703,\"\")","v":""},{"$f":"IF('Clearing Calculations'!B703,'Clearing Calculations'!C703,\"\")","v":""},"","","",""]
[{"$f":"IF('Clearing Calculations'!A704=\"\",\"\",'Clearing Calculations'!A704)","v":""},{"$f":"IF('Clearing Calculations'!A704,'Clearing Calculations'!B704,\"\")","v":""},{"$f":"IF('Clearing Calculations'!B704,'Clearing Calculations'!C704,\"\")","v":""},"","","",""]
[{"$f":"IF('Clearing Calculations'!A705=\"\",\"\",'Clearing Calculations'!A705)","v":""},{"$f":"IF('Clearing Calculations'!A705,'Clearing Calculations'!B705,\"\")","v":""},{"$f":"IF('Clearing Calculations'!B705,'Clearing Calculations'!C705,\"\")","v":""},"","","",""]
[{"$f":"IF('Clearing Calculations'!A706=\"\",\"\",'Clearing Calculations'!A706)","v":""},{"$f":"IF('Clearing Calculations'!A706,'Clearing Calculations'!B706,\"\")","v":""},{"$f":"IF('Clearing Calculations'!B706,'Clearing Calculations'!C706,\"\")","v":""},"","","",""]
[{"$f":"IF('Clearing Calculations'!A707=\"\",\"\",'Clearing Calculations'!A707)","v":""},{"$f":"IF('Clearing Calculations'!A707,'Clearing Calculations'!B707,\"\")","v":""},{"$f":"IF('Clearing Calculations'!B707,'Clearing Calculations'!C707,\"\")","v":""},"","","",""]
[{"$f":"IF('Clearing Calculations'!A708=\"\",\"\",'Clearing Calculations'!A708)","v":""},{"$f":"IF('Clearing Calculations'!A708,'Clearing Calculations'!B708,\"\")","v":""},{"$f":"IF('Clearing Calculations'!B708,'Clearing Calculations'!C708,\"\")","v":""},"","","",""]
[{"$f":"IF('Clearing Calculations'!A709=\"\",\"\",'Clearing Calculations'!A709)","v":""},{"$f":"IF('Clearing Calculations'!A709,'Clearing Calculations'!B709,\"\")","v":""},{"$f":"IF('Clearing Calculations'!B709,'Clearing Calculations'!C709,\"\")","v":""},"","","",""]
[{"$f":"IF('Clearing Calculations'!A710=\"\",\"\",'Clearing Calculations'!A710)","v":""},{"$f":"IF('Clearing Calculations'!A710,'Clearing Calculations'!B710,\"\")","v":""},{"$f":"IF('Clearing Calculations'!B710,'Clearing Calculations'!C710,\"\")","v":""},"","","",""]
[{"$f":"IF('Clearing Calculations'!A711=\"\",\"\",'Clearing Calculations'!A711)","v":""},{"$f":"IF('Clearing Calculations'!A711,'Clearing Calculations'!B711,\"\")","v":""},{"$f":"IF('Clearing Calculations'!B711,'Clearing Calculations'!C711,\"\")","v":""},"","","",""]
[{"$f":"IF('Clearing Calculations'!A712=\"\",\"\",'Clearing Calculations'!A712)","v":""},{"$f":"IF('Clearing Calculations'!A712,'Clearing Calculations'!B712,\"\")","v":""},{"$f":"IF('Clearing Calculations'!B712,'Clearing Calculations'!C712,\"\")","v":""},"","","",""]
[{"$f":"IF('Clearing Calculations'!A713=\"\",\"\",'Clearing Calculations'!A713)","v":""},{"$f":"IF('Clearing Calculations'!A713,'Clearing Calculations'!B713,\"\")","v":""},{"$f":"IF('Clearing Calculations'!B713,'Clearing Calculations'!C713,\"\")","v":""},"","","",""]
[{"$f":"IF('Clearing Calculations'!A714=\"\",\"\",'Clearing Calculations'!A714)","v":""},{"$f":"IF('Clearing Calculations'!A714,'Clearing Calculations'!B714,\"\")","v":""},{"$f":"IF('Clearing Calculations'!B714,'Clearing Calculations'!C714,\"\")","v":""},"","","",""]
[{"$f":"IF('Clearing Calculations'!A715=\"\",\"\",'Clearing Calculations'!A715)","v":""},{"$f":"IF('Clearing Calculations'!A715,'Clearing Calculations'!B715,\"\")","v":""},{"$f":"IF('Clearing Calculations'!B715,'Clearing Calculations'!C715,\"\")","v":""},"","","",""]
[{"$f":"IF('Clearing Calculations'!A716=\"\",\"\",'Clearing Calculations'!A716)","v":""},{"$f":"IF('Clearing Calculations'!A716,'Clearing Calculations'!B716,\"\")","v":""},{"$f":"IF('Clearing Calculations'!B716,'Clearing Calculations'!C716,\"\")","v":""},"","","",""]
[{"$f":"IF('Clearing Calculations'!A717=\"\",\"\",'Clearing Calculations'!A717)","v":""},{"$f":"IF('Clearing Calculations'!A717,'Clearing Calculations'!B717,\"\")","v":""},{"$f":"IF('Clearing Calculations'!B717,'Clearing Calculations'!C717,\"\")","v":""},"","","",""]
[{"$f":"IF('Clearing Calculations'!A718=\"\",\"\",'Clearing Calculations'!A718)","v":""},{"$f":"IF('Clearing Calculations'!A718,'Clearing Calculations'!B718,\"\")","v":""},{"$f":"IF('Clearing Calculations'!B718,'Clearing Calculations'!C718,\"\")","v":""},"","","",""]
[{"$f":"IF('Clearing Calculations'!A719=\"\",\"\",'Clearing Calculations'!A719)","v":""},{"$f":"IF('Clearing Calculations'!A719,'Clearing Calculations'!B719,\"\")","v":""},{"$f":"IF('Clearing Calculations'!B719,'Clearing Calculations'!C719,\"\")","v":""},"","","",""]
[{"$f":"IF('Clearing Calculations'!A720=\"\",\"\",'Clearing Calculations'!A720)","v":""},{"$f":"IF('Clearing Calculations'!A720,'Clearing Calculations'!B720,\"\")","v":""},{"$f":"IF('Clearing Calculations'!B720,'Clearing Calculations'!C720,\"\")","v":""},"","","",""]
[{"$f":"IF('Clearing Calculations'!A721=\"\",\"\",'Clearing Calculations'!A721)","v":""},{"$f":"IF('Clearing Calculations'!A721,'Clearing Calculations'!B721,\"\")","v":""},{"$f":"IF('Clearing Calculations'!B721,'Clearing Calculations'!C721,\"\")","v":""},"","","",""]
[{"$f":"IF('Clearing Calculations'!A722=\"\",\"\",'Clearing Calculations'!A722)","v":""},{"$f":"IF('Clearing Calculations'!A722,'Clearing Calculations'!B722,\"\")","v":""},{"$f":"IF('Clearing Calculations'!B722,'Clearing Calculations'!C722,\"\")","v":""},"","","",""]
[{"$f":"IF('Clearing Calculations'!A723=\"\",\"\",'Clearing Calculations'!A723)","v":""},{"$f":"IF('Clearing Calculations'!A723,'Clearing Calculations'!B723,\"\")","v":""},{"$f":"IF('Clearing Calculations'!B723,'Clearing Calculations'!C723,\"\")","v":""},"","","",""]
[{"$f":"IF('Clearing Calculations'!A724=\"\",\"\",'Clearing Calculations'!A724)","v":""},{"$f":"IF('Clearing Calculations'!A724,'Clearing Calculations'!B724,\"\")","v":""},{"$f":"IF('Clearing Calculations'!B724,'Clearing Calculations'!C724,\"\")","v":""},"","","",""]
[{"$f":"IF('Clearing Calculations'!A725=\"\",\"\",'Clearing Calculations'!A725)","v":""},{"$f":"IF('Clearing Calculations'!A725,'Clearing Calculations'!B725,\"\")","v":""},{"$f":"IF('Clearing Calculations'!B725,'Clearing Calculations'!C725,\"\")","v":""},"","","",""]
[{"$f":"IF('Clearing Calculations'!A726=\"\",\"\",'Clearing Calculations'!A726)","v":""},{"$f":"IF('Clearing Calculations'!A726,'Clearing Calculations'!B726,\"\")","v":""},{"$f":"IF('Clearing Calculations'!B726,'Clearing Calculations'!C726,\"\")","v":""},"","","",""]
[{"$f":"IF('Clearing Calculations'!A727=\"\",\"\",'Clearing Calculations'!A727)","v":""},{"$f":"IF('Clearing Calculations'!A727,'Clearing Calculations'!B727,\"\")","v":""},{"$f":"IF('Clearing Calculations'!B727,'Clearing Calculations'!C727,\"\")","v":""},"","","",""]
[{"$f":"IF('Clearing Calculations'!A728=\"\",\"\",'Clearing Calculations'!A728)","v":""},{"$f":"IF('Clearing Calculations'!A728,'Clearing Calculations'!B728,\"\")","v":""},{"$f":"IF('Clearing Calculations'!B728,'Clearing Calculations'!C728,\"\")","v":""},"","","",""]
[{"$f":"IF('Clearing Calculations'!A729=\"\",\"\",'Clearing Calculations'!A729)","v":""},{"$f":"IF('Clearing Calculations'!A729,'Clearing Calculations'!B729,\"\")","v":""},{"$f":"IF('Clearing Calculations'!B729,'Clearing Calculations'!C729,\"\")","v":""},"","","",""]
[{"$f":"IF('Clearing Calculations'!A730=\"\",\"\",'Clearing Calculations'!A730)","v":""},{"$f":"IF('Clearing Calculations'!A730,'Clearing Calculations'!B730,\"\")","v":""},{"$f":"IF('Clearing Calculations'!B730,'Clearing Calculations'!C730,\"\")","v":""},"","","",""]
[{"$f":"IF('Clearing Calculations'!A731=\"\",\"\",'Clearing Calculations'!A731)","v":""},{"$f":"IF('Clearing Calculations'!A731,'Clearing Calculations'!B731,\"\")","v":""},{"$f":"IF('Clearing Calculations'!B731,'Clearing Calculations'!C731,\"\")","v":""},"","","",""]
[{"$f":"IF('Clearing Calculations'!A732=\"\",\"\",'Clearing Calculations'!A732)","v":""},{"$f":"IF('Clearing Calculations'!A732,'Clearing Calculations'!B732,\"\")","v":""},{"$f":"IF('Clearing Calculations'!B732,'Clearing Calculations'!C732,\"\")","v":""},"","","",""]
[{"$f":"IF('Clearing Calculations'!A733=\"\",\"\",'Clearing Calculations'!A733)","v":""},{"$f":"IF('Clearing Calculations'!A733,'Clearing Calculations'!B733,\"\")","v":""},{"$f":"IF('Clearing Calculations'!B733,'Clearing Calculations'!C733,\"\")","v":""},"","","",""]
[{"$f":"IF('Clearing Calculations'!A734=\"\",\"\",'Clearing Calculations'!A734)","v":""},{"$f":"IF('Clearing Calculations'!A734,'Clearing Calculations'!B734,\"\")","v":""},{"$f":"IF('Clearing Calculations'!B734,'Clearing Calculations'!C734,\"\")","v":""},"","","",""]
[{"$f":"IF('Clearing Calculations'!A735=\"\",\"\",'Clearing Calculations'!A735)","v":""},{"$f":"IF('Clearing Calculations'!A735,'Clearing Calculations'!B735,\"\")","v":""},{"$f":"IF('Clearing Calculations'!B735,'Clearing Calculations'!C735,\"\")","v":""},"","","",""]
[{"$f":"IF('Clearing Calculations'!A736=\"\",\"\",'Clearing Calculations'!A736)","v":""},{"$f":"IF('Clearing Calculations'!A736,'Clearing Calculations'!B736,\"\")","v":""},{"$f":"IF('Clearing Calculations'!B736,'Clearing Calculations'!C736,\"\")","v":""},"","","",""]
[{"$f":"IF('Clearing Calculations'!A737=\"\",\"\",'Clearing Calculations'!A737)","v":""},{"$f":"IF('Clearing Calculations'!A737,'Clearing Calculations'!B737,\"\")","v":""},{"$f":"IF('Clearing Calculations'!B737,'Clearing Calculations'!C737,\"\")","v":""},"","","",""]
[{"$f":"IF('Clearing Calculations'!A738=\"\",\"\",'Clearing Calculations'!A738)","v":""},{"$f":"IF('Clearing Calculations'!A738,'Clearing Calculations'!B738,\"\")","v":""},{"$f":"IF('Clearing Calculations'!B738,'Clearing Calculations'!C738,\"\")","v":""},"","","",""]
[{"$f":"IF('Clearing Calculations'!A739=\"\",\"\",'Clearing Calculations'!A739)","v":""},{"$f":"IF('Clearing Calculations'!A739,'Clearing Calculations'!B739,\"\")","v":""},{"$f":"IF('Clearing Calculations'!B739,'Clearing Calculations'!C739,\"\")","v":""},"","","",""]
[{"$f":"IF('Clearing Calculations'!A740=\"\",\"\",'Clearing Calculations'!A740)","v":""},{"$f":"IF('Clearing Calculations'!A740,'Clearing Calculations'!B740,\"\")","v":""},{"$f":"IF('Clearing Calculations'!B740,'Clearing Calculations'!C740,\"\")","v":""},"","","",""]
[{"$f":"IF('Clearing Calculations'!A741=\"\",\"\",'Clearing Calculations'!A741)","v":""},{"$f":"IF('Clearing Calculations'!A741,'Clearing Calculations'!B741,\"\")","v":""},{"$f":"IF('Clearing Calculations'!B741,'Clearing Calculations'!C741,\"\")","v":""},"","","",""]
[{"$f":"IF('Clearing Calculations'!A742=\"\",\"\",'Clearing Calculations'!A742)","v":""},{"$f":"IF('Clearing Calculations'!A742,'Clearing Calculations'!B742,\"\")","v":""},{"$f":"IF('Clearing Calculations'!B742,'Clearing Calculations'!C742,\"\")","v":""},"","","",""]
[{"$f":"IF('Clearing Calculations'!A743=\"\",\"\",'Clearing Calculations'!A743)","v":""},{"$f":"IF('Clearing Calculations'!A743,'Clearing Calculations'!B743,\"\")","v":""},{"$f":"IF('Clearing Calculations'!B743,'Clearing Calculations'!C743,\"\")","v":""},"","","",""]
[{"$f":"IF('Clearing Calculations'!A744=\"\",\"\",'Clearing Calculations'!A744)","v":""},{"$f":"IF('Clearing Calculations'!A744,'Clearing Calculations'!B744,\"\")","v":""},{"$f":"IF('Clearing Calculations'!B744,'Clearing Calculations'!C744,\"\")","v":""},"","","",""]
[{"$f":"IF('Clearing Calculations'!A745=\"\",\"\",'Clearing Calculations'!A745)","v":""},{"$f":"IF('Clearing Calculations'!A745,'Clearing Calculations'!B745,\"\")","v":""},{"$f":"IF('Clearing Calculations'!B745,'Clearing Calculations'!C745,\"\")","v":""},"","","",""]
[{"$f":"IF('Clearing Calculations'!A746=\"\",\"\",'Clearing Calculations'!A746)","v":""},{"$f":"IF('Clearing Calculations'!A746,'Clearing Calculations'!B746,\"\")","v":""},{"$f":"IF('Clearing Calculations'!B746,'Clearing Calculations'!C746,\"\")","v":""},"","","",""]
[{"$f":"IF('Clearing Calculations'!A747=\"\",\"\",'Clearing Calculations'!A747)","v":""},{"$f":"IF('Clearing Calculations'!A747,'Clearing Calculations'!B747,\"\")","v":""},{"$f":"IF('Clearing Calculations'!B747,'Clearing Calculations'!C747,\"\")","v":""},"","","",""]
[{"$f":"IF('Clearing Calculations'!A748=\"\",\"\",'Clearing Calculations'!A748)","v":""},{"$f":"IF('Clearing Calculations'!A748,'Clearing Calculations'!B748,\"\")","v":""},{"$f":"IF('Clearing Calculations'!B748,'Clearing Calculations'!C748,\"\")","v":""},{"$f":"IF(A754=\"\",\"\",$B754+$C754)","v":""},{"$f":"IF(A754=\"\",\"\",(D754+D753)/2*(A754-A753))","v":""},{"$f":"IF(A754=\"\",\"\",(E754/9))","v":""},{"$f":"IF(A754=\"\",\"\",E754/$G$3)","v":""}]
[{"$f":"IF('Clearing Calculations'!A749=\"\",\"\",'Clearing Calculations'!A749)","v":""},{"$f":"IF('Clearing Calculations'!A749,'Clearing Calculations'!B749,\"\")","v":""},{"$f":"IF('Clearing Calculations'!B749,'Clearing Calculations'!C749,\"\")","v":""},"","","",""]
[{"$f":"IF('Clearing Calculations'!A750=\"\",\"\",'Clearing Calculations'!A750)","v":""},{"$f":"IF('Clearing Calculations'!A750,'Clearing Calculations'!B750,\"\")","v":""},{"$f":"IF('Clearing Calculations'!B750,'Clearing Calculations'!C750,\"\")","v":""},"","","",""]
[{"$f":"IF('Clearing Calculations'!A751=\"\",\"\",'Clearing Calculations'!A751)","v":""},{"$f":"IF('Clearing Calculations'!A751,'Clearing Calculations'!B751,\"\")","v":""},{"$f":"IF('Clearing Calculations'!B751,'Clearing Calculations'!C751,\"\")","v":""},"","","",""]
[{"$f":"IF('Clearing Calculations'!A752=\"\",\"\",'Clearing Calculations'!A752)","v":""},{"$f":"IF('Clearing Calculations'!A752,'Clearing Calculations'!B752,\"\")","v":""},{"$f":"IF('Clearing Calculations'!B752,'Clearing Calculations'!C752,\"\")","v":""},"","","",""]
[{"$f":"IF('Clearing Calculations'!A753=\"\",\"\",'Clearing Calculations'!A753)","v":""},{"$f":"IF('Clearing Calculations'!A753,'Clearing Calculations'!B753,\"\")","v":""},{"$f":"IF('Clearing Calculations'!B753,'Clearing Calculations'!C753,\"\")","v":""},"","","",""]
[{"$f":"IF('Clearing Calculations'!A754=\"\",\"\",'Clearing Calculations'!A754)","v":""},{"$f":"IF('Clearing Calculations'!A754,'Clearing Calculations'!B754,\"\")","v":""},{"$f":"IF('Clearing Calculations'!B754,'Clearing Calculations'!C754,\"\")","v":""},"","","",""]
[{"$f":"IF('Clearing Calculations'!A755=\"\",\"\",'Clearing Calculations'!A755)","v":""},{"$f":"IF('Clearing Calculations'!A755,'Clearing Calculations'!B755,\"\")","v":""},{"$f":"IF('Clearing Calculations'!B755,'Clearing Calculations'!C755,\"\")","v":""},"","","",""]
[{"$f":"IF('Clearing Calculations'!A756=\"\",\"\",'Clearing Calculations'!A756)","v":""},{"$f":"IF('Clearing Calculations'!A756,'Clearing Calculations'!B756,\"\")","v":""},{"$f":"IF('Clearing Calculations'!B756,'Clearing Calculations'!C756,\"\")","v":""},"","","",""]
[{"$f":"IF('Clearing Calculations'!A757=\"\",\"\",'Clearing Calculations'!A757)","v":""},{"$f":"IF('Clearing Calculations'!A757,'Clearing Calculations'!B757,\"\")","v":""},{"$f":"IF('Clearing Calculations'!B757,'Clearing Calculations'!C757,\"\")","v":""},"","","",""]
[{"$f":"IF('Clearing Calculations'!A758=\"\",\"\",'Clearing Calculations'!A758)","v":""},{"$f":"IF('Clearing Calculations'!A758,'Clearing Calculations'!B758,\"\")","v":""},{"$f":"IF('Clearing Calculations'!B758,'Clearing Calculations'!C758,\"\")","v":""},"","","",""]
[{"$f":"IF('Clearing Calculations'!A759=\"\",\"\",'Clearing Calculations'!A759)","v":""},{"$f":"IF('Clearing Calculations'!A759,'Clearing Calculations'!B759,\"\")","v":""},{"$f":"IF('Clearing Calculations'!B759,'Clearing Calculations'!C759,\"\")","v":""},"","","",""]
[{"$f":"IF('Clearing Calculations'!A760=\"\",\"\",'Clearing Calculations'!A760)","v":""},{"$f":"IF('Clearing Calculations'!A760,'Clearing Calculations'!B760,\"\")","v":""},{"$f":"IF('Clearing Calculations'!B760,'Clearing Calculations'!C760,\"\")","v":""},"","","",""]
[{"$f":"IF('Clearing Calculations'!A761=\"\",\"\",'Clearing Calculations'!A761)","v":""},{"$f":"IF('Clearing Calculations'!A761,'Clearing Calculations'!B761,\"\")","v":""},{"$f":"IF('Clearing Calculations'!B761,'Clearing Calculations'!C761,\"\")","v":""},"","","",""]
[{"$f":"IF('Clearing Calculations'!A762=\"\",\"\",'Clearing Calculations'!A762)","v":""},{"$f":"IF('Clearing Calculations'!A762,'Clearing Calculations'!B762,\"\")","v":""},{"$f":"IF('Clearing Calculations'!B762,'Clearing Calculations'!C762,\"\")","v":""},"","","",""]
[{"$f":"IF('Clearing Calculations'!A763=\"\",\"\",'Clearing Calculations'!A763)","v":""},{"$f":"IF('Clearing Calculations'!A763,'Clearing Calculations'!B763,\"\")","v":""},{"$f":"IF('Clearing Calculations'!B763,'Clearing Calculations'!C763,\"\")","v":""},"","","",""]
[{"$f":"IF('Clearing Calculations'!A764=\"\",\"\",'Clearing Calculations'!A764)","v":""},{"$f":"IF('Clearing Calculations'!A764,'Clearing Calculations'!B764,\"\")","v":""},{"$f":"IF('Clearing Calculations'!B764,'Clearing Calculations'!C764,\"\")","v":""},"","","",""]
[{"$f":"IF('Clearing Calculations'!A765=\"\",\"\",'Clearing Calculations'!A765)","v":""},{"$f":"IF('Clearing Calculations'!A765,'Clearing Calculations'!B765,\"\")","v":""},{"$f":"IF('Clearing Calculations'!B765,'Clearing Calculations'!C765,\"\")","v":""},"","","",""]
[{"$f":"IF('Clearing Calculations'!A766=\"\",\"\",'Clearing Calculations'!A766)","v":""},{"$f":"IF('Clearing Calculations'!A766,'Clearing Calculations'!B766,\"\")","v":""},{"$f":"IF('Clearing Calculations'!B766,'Clearing Calculations'!C766,\"\")","v":""},"","","",""]
[{"$f":"IF('Clearing Calculations'!A767=\"\",\"\",'Clearing Calculations'!A767)","v":""},{"$f":"IF('Clearing Calculations'!A767,'Clearing Calculations'!B767,\"\")","v":""},{"$f":"IF('Clearing Calculations'!B767,'Clearing Calculations'!C767,\"\")","v":""},"","","",""]
[{"$f":"IF('Clearing Calculations'!A768=\"\",\"\",'Clearing Calculations'!A768)","v":""},{"$f":"IF('Clearing Calculations'!A768,'Clearing Calculations'!B768,\"\")","v":""},{"$f":"IF('Clearing Calculations'!B768,'Clearing Calculations'!C768,\"\")","v":""},"","","",""]
[{"$f":"IF('Clearing Calculations'!A769=\"\",\"\",'Clearing Calculations'!A769)","v":""},{"$f":"IF('Clearing Calculations'!A769,'Clearing Calculations'!B769,\"\")","v":""},{"$f":"IF('Clearing Calculations'!B769,'Clearing Calculations'!C769,\"\")","v":""},"","","",""]
[{"$f":"IF('Clearing Calculations'!A770=\"\",\"\",'Clearing Calculations'!A770)","v":""},{"$f":"IF('Clearing Calculations'!A770,'Clearing Calculations'!B770,\"\")","v":""},{"$f":"IF('Clearing Calculations'!B770,'Clearing Calculations'!C770,\"\")","v":""},"","","",""]
[{"$f":"IF('Clearing Calculations'!A771=\"\",\"\",'Clearing Calculations'!A771)","v":""},{"$f":"IF('Clearing Calculations'!A771,'Clearing Calculations'!B771,\"\")","v":""},{"$f":"IF('Clearing Calculations'!B771,'Clearing Calculations'!C771,\"\")","v":""},"","","",""]
[{"$f":"IF('Clearing Calculations'!A772=\"\",\"\",'Clearing Calculations'!A772)","v":""},{"$f":"IF('Clearing Calculations'!A772,'Clearing Calculations'!B772,\"\")","v":""},{"$f":"IF('Clearing Calculations'!B772,'Clearing Calculations'!C772,\"\")","v":""},"","","",""]
[{"$f":"IF('Clearing Calculations'!A773=\"\",\"\",'Clearing Calculations'!A773)","v":""},{"$f":"IF('Clearing Calculations'!A773,'Clearing Calculations'!B773,\"\")","v":""},{"$f":"IF('Clearing Calculations'!B773,'Clearing Calculations'!C773,\"\")","v":""},"","","",""]
[{"$f":"IF('Clearing Calculations'!A774=\"\",\"\",'Clearing Calculations'!A774)","v":""},{"$f":"IF('Clearing Calculations'!A774,'Clearing Calculations'!B774,\"\")","v":""},{"$f":"IF('Clearing Calculations'!B774,'Clearing Calculations'!C774,\"\")","v":""},"","","",""]
[{"$f":"IF('Clearing Calculations'!A775=\"\",\"\",'Clearing Calculations'!A775)","v":""},{"$f":"IF('Clearing Calculations'!A775,'Clearing Calculations'!B775,\"\")","v":""},{"$f":"IF('Clearing Calculations'!B775,'Clearing Calculations'!C775,\"\")","v":""},"","","",""]
[{"$f":"IF('Clearing Calculations'!A776=\"\",\"\",'Clearing Calculations'!A776)","v":""},{"$f":"IF('Clearing Calculations'!A776,'Clearing Calculations'!B776,\"\")","v":""},{"$f":"IF('Clearing Calculations'!B776,'Clearing Calculations'!C776,\"\")","v":""},"","","",""]
[{"$f":"IF('Clearing Calculations'!A777=\"\",\"\",'Clearing Calculations'!A777)","v":""},{"$f":"IF('Clearing Calculations'!A777,'Clearing Calculations'!B777,\"\")","v":""},{"$f":"IF('Clearing Calculations'!B777,'Clearing Calculations'!C777,\"\")","v":""},"","","",""]
[{"$f":"IF('Clearing Calculations'!A778=\"\",\"\",'Clearing Calculations'!A778)","v":""},{"$f":"IF('Clearing Calculations'!A778,'Clearing Calculations'!B778,\"\")","v":""},{"$f":"IF('Clearing Calculations'!B778,'Clearing Calculations'!C778,\"\")","v":""},"","","",""]
[{"$f":"IF('Clearing Calculations'!A779=\"\",\"\",'Clearing Calculations'!A779)","v":""},{"$f":"IF('Clearing Calculations'!A779,'Clearing Calculations'!B779,\"\")","v":""},{"$f":"IF('Clearing Calculations'!B779,'Clearing Calculations'!C779,\"\")","v":""},"","","",""]
[{"$f":"IF('Clearing Calculations'!A780=\"\",\"\",'Clearing Calculations'!A780)","v":""},{"$f":"IF('Clearing Calculations'!A780,'Clearing Calculations'!B780,\"\")","v":""},{"$f":"IF('Clearing Calculations'!B780,'Clearing Calculations'!C780,\"\")","v":""},"","","",""]
[{"$f":"IF('Clearing Calculations'!A781=\"\",\"\",'Clearing Calculations'!A781)","v":""},{"$f":"IF('Clearing Calculations'!A781,'Clearing Calculations'!B781,\"\")","v":""},{"$f":"IF('Clearing Calculations'!B781,'Clearing Calculations'!C781,\"\")","v":""},"","","",""]
[{"$f":"IF('Clearing Calculations'!A782=\"\",\"\",'Clearing Calculations'!A782)","v":""},{"$f":"IF('Clearing Calculations'!A782,'Clearing Calculations'!B782,\"\")","v":""},{"$f":"IF('Clearing Calculations'!B782,'Clearing Calculations'!C782,\"\")","v":""},"","","",""]
[{"$f":"IF('Clearing Calculations'!A783=\"\",\"\",'Clearing Calculations'!A783)","v":""},{"$f":"IF('Clearing Calculations'!A783,'Clearing Calculations'!B783,\"\")","v":""},{"$f":"IF('Clearing Calculations'!B783,'Clearing Calculations'!C783,\"\")","v":""},"","","",""]
[{"$f":"IF('Clearing Calculations'!A784=\"\",\"\",'Clearing Calculations'!A784)","v":""},{"$f":"IF('Clearing Calculations'!A784,'Clearing Calculations'!B784,\"\")","v":""},{"$f":"IF('Clearing Calculations'!B784,'Clearing Calculations'!C784,\"\")","v":""},"","","",""]
[{"$f":"IF('Clearing Calculations'!A785=\"\",\"\",'Clearing Calculations'!A785)","v":""},{"$f":"IF('Clearing Calculations'!A785,'Clearing Calculations'!B785,\"\")","v":""},{"$f":"IF('Clearing Calculations'!B785,'Clearing Calculations'!C785,\"\")","v":""},"","","",""]
[{"$f":"IF('Clearing Calculations'!A786=\"\",\"\",'Clearing Calculations'!A786)","v":""},{"$f":"IF('Clearing Calculations'!A786,'Clearing Calculations'!B786,\"\")","v":""},{"$f":"IF('Clearing Calculations'!B786,'Clearing Calculations'!C786,\"\")","v":""},"","","",""]
[{"$f":"IF('Clearing Calculations'!A787=\"\",\"\",'Clearing Calculations'!A787)","v":""},{"$f":"IF('Clearing Calculations'!A787,'Clearing Calculations'!B787,\"\")","v":""},{"$f":"IF('Clearing Calculations'!B787,'Clearing Calculations'!C787,\"\")","v":""},"","","",""]
[{"$f":"IF('Clearing Calculations'!A788=\"\",\"\",'Clearing Calculations'!A788)","v":""},{"$f":"IF('Clearing Calculations'!A788,'Clearing Calculations'!B788,\"\")","v":""},{"$f":"IF('Clearing Calculations'!B788,'Clearing Calculations'!C788,\"\")","v":""},"","","",""]
[{"$f":"IF('Clearing Calculations'!A789=\"\",\"\",'Clearing Calculations'!A789)","v":""},{"$f":"IF('Clearing Calculations'!A789,'Clearing Calculations'!B789,\"\")","v":""},{"$f":"IF('Clearing Calculations'!B789,'Clearing Calculations'!C789,\"\")","v":""},"","","",""]
[{"$f":"IF('Clearing Calculations'!A790=\"\",\"\",'Clearing Calculations'!A790)","v":""},{"$f":"IF('Clearing Calculations'!A790,'Clearing Calculations'!B790,\"\")","v":""},{"$f":"IF('Clearing Calculations'!B790,'Clearing Calculations'!C790,\"\")","v":""},"","","",""]
[{"$f":"IF('Clearing Calculations'!A791=\"\",\"\",'Clearing Calculations'!A791)","v":""},{"$f":"IF('Clearing Calculations'!A791,'Clearing Calculations'!B791,\"\")","v":""},{"$f":"IF('Clearing Calculations'!B791,'Clearing Calculations'!C791,\"\")","v":""},"","","",""]
[{"$f":"IF('Clearing Calculations'!A792=\"\",\"\",'Clearing Calculations'!A792)","v":""},{"$f":"IF('Clearing Calculations'!A792,'Clearing Calculations'!B792,\"\")","v":""},{"$f":"IF('Clearing Calculations'!B792,'Clearing Calculations'!C792,\"\")","v":""},"","","",""]
[{"$f":"IF('Clearing Calculations'!A793=\"\",\"\",'Clearing Calculations'!A793)","v":""},{"$f":"IF('Clearing Calculations'!A793,'Clearing Calculations'!B793,\"\")","v":""},{"$f":"IF('Clearing Calculations'!B793,'Clearing Calculations'!C793,\"\")","v":""},"","","",""]
[{"$f":"IF('Clearing Calculations'!A794=\"\",\"\",'Clearing Calculations'!A794)","v":""},{"$f":"IF('Clearing Calculations'!A794,'Clearing Calculations'!B794,\"\")","v":""},{"$f":"IF('Clearing Calculations'!B794,'Clearing Calculations'!C794,\"\")","v":""},"","","",""]
[{"$f":"IF('Clearing Calculations'!A795=\"\",\"\",'Clearing Calculations'!A795)","v":""},{"$f":"IF('Clearing Calculations'!A795,'Clearing Calculations'!B795,\"\")","v":""},{"$f":"IF('Clearing Calculations'!B795,'Clearing Calculations'!C795,\"\")","v":""},"","","",""]
[{"$f":"IF('Clearing Calculations'!A796=\"\",\"\",'Clearing Calculations'!A796)","v":""},{"$f":"IF('Clearing Calculations'!A796,'Clearing Calculations'!B796,\"\")","v":""},{"$f":"IF('Clearing Calculations'!B796,'Clearing Calculations'!C796,\"\")","v":""},"","","",""]
[{"$f":"IF('Clearing Calculations'!A797=\"\",\"\",'Clearing Calculations'!A797)","v":""},{"$f":"IF('Clearing Calculations'!A797,'Clearing Calculations'!B797,\"\")","v":""},{"$f":"IF('Clearing Calculations'!B797,'Clearing Calculations'!C797,\"\")","v":""},"","","",""]
[{"$f":"IF('Clearing Calculations'!A798=\"\",\"\",'Clearing Calculations'!A798)","v":""},{"$f":"IF('Clearing Calculations'!A798,'Clearing Calculations'!B798,\"\")","v":""},{"$f":"IF('Clearing Calculations'!B798,'Clearing Calculations'!C798,\"\")","v":""},"","","",""]
[{"$f":"IF('Clearing Calculations'!A799=\"\",\"\",'Clearing Calculations'!A799)","v":""},{"$f":"IF('Clearing Calculations'!A799,'Clearing Calculations'!B799,\"\")","v":""},{"$f":"IF('Clearing Calculations'!B799,'Clearing Calculations'!C799,\"\")","v":""},"","","",""]
[{"$f":"IF('Clearing Calculations'!A800=\"\",\"\",'Clearing Calculations'!A800)","v":""},{"$f":"IF('Clearing Calculations'!A800,'Clearing Calculations'!B800,\"\")","v":""},{"$f":"IF('Clearing Calculations'!B800,'Clearing Calculations'!C800,\"\")","v":""},"","","",""]
[{"$f":"IF('Clearing Calculations'!A801=\"\",\"\",'Clearing Calculations'!A801)","v":""},{"$f":"IF('Clearing Calculations'!A801,'Clearing Calculations'!B801,\"\")","v":""},{"$f":"IF('Clearing Calculations'!B801,'Clearing Calculations'!C801,\"\")","v":""},"","","",""]
[{"$f":"IF('Clearing Calculations'!A802=\"\",\"\",'Clearing Calculations'!A802)","v":""},{"$f":"IF('Clearing Calculations'!A802,'Clearing Calculations'!B802,\"\")","v":""},{"$f":"IF('Clearing Calculations'!B802,'Clearing Calculations'!C802,\"\")","v":""},"","","",""]
[{"$f":"IF('Clearing Calculations'!A803=\"\",\"\",'Clearing Calculations'!A803)","v":""},{"$f":"IF('Clearing Calculations'!A803,'Clearing Calculations'!B803,\"\")","v":""},{"$f":"IF('Clearing Calculations'!B803,'Clearing Calculations'!C803,\"\")","v":""},"","","",""]
[{"$f":"IF('Clearing Calculations'!A804=\"\",\"\",'Clearing Calculations'!A804)","v":""},{"$f":"IF('Clearing Calculations'!A804,'Clearing Calculations'!B804,\"\")","v":""},{"$f":"IF('Clearing Calculations'!B804,'Clearing Calculations'!C804,\"\")","v":""},"","","",""]
[{"$f":"IF('Clearing Calculations'!A805=\"\",\"\",'Clearing Calculations'!A805)","v":""},{"$f":"IF('Clearing Calculations'!A805,'Clearing Calculations'!B805,\"\")","v":""},{"$f":"IF('Clearing Calculations'!B805,'Clearing Calculations'!C805,\"\")","v":""},"","","",""]
[{"$f":"IF('Clearing Calculations'!A806=\"\",\"\",'Clearing Calculations'!A806)","v":""},{"$f":"IF('Clearing Calculations'!A806,'Clearing Calculations'!B806,\"\")","v":""},{"$f":"IF('Clearing Calculations'!B806,'Clearing Calculations'!C806,\"\")","v":""},"","","",""]
[{"$f":"IF('Clearing Calculations'!A807=\"\",\"\",'Clearing Calculations'!A807)","v":""},{"$f":"IF('Clearing Calculations'!A807,'Clearing Calculations'!B807,\"\")","v":""},{"$f":"IF('Clearing Calculations'!B807,'Clearing Calculations'!C807,\"\")","v":""},"","","",""]
[{"$f":"IF('Clearing Calculations'!A808=\"\",\"\",'Clearing Calculations'!A808)","v":""},{"$f":"IF('Clearing Calculations'!A808,'Clearing Calculations'!B808,\"\")","v":""},{"$f":"IF('Clearing Calculations'!B808,'Clearing Calculations'!C808,\"\")","v":""},"","","",""]
[{"$f":"IF('Clearing Calculations'!A809=\"\",\"\",'Clearing Calculations'!A809)","v":""},{"$f":"IF('Clearing Calculations'!A809,'Clearing Calculations'!B809,\"\")","v":""},{"$f":"IF('Clearing Calculations'!B809,'Clearing Calculations'!C809,\"\")","v":""},"","","",""]
[{"$f":"IF('Clearing Calculations'!A810=\"\",\"\",'Clearing Calculations'!A810)","v":""},{"$f":"IF('Clearing Calculations'!A810,'Clearing Calculations'!B810,\"\")","v":""},{"$f":"IF('Clearing Calculations'!B810,'Clearing Calculations'!C810,\"\")","v":""},"","","",""]
[{"$f":"IF('Clearing Calculations'!A811=\"\",\"\",'Clearing Calculations'!A811)","v":""},{"$f":"IF('Clearing Calculations'!A811,'Clearing Calculations'!B811,\"\")","v":""},{"$f":"IF('Clearing Calculations'!B811,'Clearing Calculations'!C811,\"\")","v":""},"","","",""]
[{"$f":"IF('Clearing Calculations'!A812=\"\",\"\",'Clearing Calculations'!A812)","v":""},{"$f":"IF('Clearing Calculations'!A812,'Clearing Calculations'!B812,\"\")","v":""},{"$f":"IF('Clearing Calculations'!B812,'Clearing Calculations'!C812,\"\")","v":""},{"$f":"IF(A818=\"\",\"\",$B818+$C818)","v":""},{"$f":"IF(A818=\"\",\"\",(D818+D817)/2*(A818-A817))","v":""},{"$f":"IF(A818=\"\",\"\",(E818/9))","v":""},{"$f":"IF(A818=\"\",\"\",E818/$G$3)","v":""}]
[{"$f":"IF('Clearing Calculations'!A813=\"\",\"\",'Clearing Calculations'!A813)","v":""},{"$f":"IF('Clearing Calculations'!A813,'Clearing Calculations'!B813,\"\")","v":""},{"$f":"IF('Clearing Calculations'!B813,'Clearing Calculations'!C813,\"\")","v":""},"","","",""]
[{"$f":"IF('Clearing Calculations'!A814=\"\",\"\",'Clearing Calculations'!A814)","v":""},{"$f":"IF('Clearing Calculations'!A814,'Clearing Calculations'!B814,\"\")","v":""},{"$f":"IF('Clearing Calculations'!B814,'Clearing Calculations'!C814,\"\")","v":""},"","","",""]
[{"$f":"IF('Clearing Calculations'!A815=\"\",\"\",'Clearing Calculations'!A815)","v":""},{"$f":"IF('Clearing Calculations'!A815,'Clearing Calculations'!B815,\"\")","v":""},{"$f":"IF('Clearing Calculations'!B815,'Clearing Calculations'!C815,\"\")","v":""},"","","",""]
[{"$f":"IF('Clearing Calculations'!A816=\"\",\"\",'Clearing Calculations'!A816)","v":""},{"$f":"IF('Clearing Calculations'!A816,'Clearing Calculations'!B816,\"\")","v":""},{"$f":"IF('Clearing Calculations'!B816,'Clearing Calculations'!C816,\"\")","v":""},"","","",""]
[{"$f":"IF('Clearing Calculations'!A817=\"\",\"\",'Clearing Calculations'!A817)","v":""},{"$f":"IF('Clearing Calculations'!A817,'Clearing Calculations'!B817,\"\")","v":""},{"$f":"IF('Clearing Calculations'!B817,'Clearing Calculations'!C817,\"\")","v":""},"","","",""]
[{"$f":"IF('Clearing Calculations'!A818=\"\",\"\",'Clearing Calculations'!A818)","v":""},{"$f":"IF('Clearing Calculations'!A818,'Clearing Calculations'!B818,\"\")","v":""},{"$f":"IF('Clearing Calculations'!B818,'Clearing Calculations'!C818,\"\")","v":""},"","","",""]
[{"$f":"IF('Clearing Calculations'!A819=\"\",\"\",'Clearing Calculations'!A819)","v":""},{"$f":"IF('Clearing Calculations'!A819,'Clearing Calculations'!B819,\"\")","v":""},{"$f":"IF('Clearing Calculations'!B819,'Clearing Calculations'!C819,\"\")","v":""},"","","",""]
[{"$f":"IF('Clearing Calculations'!A820=\"\",\"\",'Clearing Calculations'!A820)","v":""},{"$f":"IF('Clearing Calculations'!A820,'Clearing Calculations'!B820,\"\")","v":""},{"$f":"IF('Clearing Calculations'!B820,'Clearing Calculations'!C820,\"\")","v":""},"","","",""]
[{"$f":"IF('Clearing Calculations'!A821=\"\",\"\",'Clearing Calculations'!A821)","v":""},{"$f":"IF('Clearing Calculations'!A821,'Clearing Calculations'!B821,\"\")","v":""},{"$f":"IF('Clearing Calculations'!B821,'Clearing Calculations'!C821,\"\")","v":""},"","","",""]
[{"$f":"IF('Clearing Calculations'!A822=\"\",\"\",'Clearing Calculations'!A822)","v":""},{"$f":"IF('Clearing Calculations'!A822,'Clearing Calculations'!B822,\"\")","v":""},{"$f":"IF('Clearing Calculations'!B822,'Clearing Calculations'!C822,\"\")","v":""},"","","",""]
[{"$f":"IF('Clearing Calculations'!A823=\"\",\"\",'Clearing Calculations'!A823)","v":""},{"$f":"IF('Clearing Calculations'!A823,'Clearing Calculations'!B823,\"\")","v":""},{"$f":"IF('Clearing Calculations'!B823,'Clearing Calculations'!C823,\"\")","v":""},"","","",""]
[{"$f":"IF('Clearing Calculations'!A824=\"\",\"\",'Clearing Calculations'!A824)","v":""},{"$f":"IF('Clearing Calculations'!A824,'Clearing Calculations'!B824,\"\")","v":""},{"$f":"IF('Clearing Calculations'!B824,'Clearing Calculations'!C824,\"\")","v":""},"","","",""]
[{"$f":"IF('Clearing Calculations'!A825=\"\",\"\",'Clearing Calculations'!A825)","v":""},{"$f":"IF('Clearing Calculations'!A825,'Clearing Calculations'!B825,\"\")","v":""},{"$f":"IF('Clearing Calculations'!B825,'Clearing Calculations'!C825,\"\")","v":""},"","","",""]
[{"$f":"IF('Clearing Calculations'!A826=\"\",\"\",'Clearing Calculations'!A826)","v":""},{"$f":"IF('Clearing Calculations'!A826,'Clearing Calculations'!B826,\"\")","v":""},{"$f":"IF('Clearing Calculations'!B826,'Clearing Calculations'!C826,\"\")","v":""},"","","",""]
[{"$f":"IF('Clearing Calculations'!A827=\"\",\"\",'Clearing Calculations'!A827)","v":""},{"$f":"IF('Clearing Calculations'!A827,'Clearing Calculations'!B827,\"\")","v":""},{"$f":"IF('Clearing Calculations'!B827,'Clearing Calculations'!C827,\"\")","v":""},"","","",""]
[{"$f":"IF('Clearing Calculations'!A828=\"\",\"\",'Clearing Calculations'!A828)","v":""},{"$f":"IF('Clearing Calculations'!A828,'Clearing Calculations'!B828,\"\")","v":""},{"$f":"IF('Clearing Calculations'!B828,'Clearing Calculations'!C828,\"\")","v":""},"","","",""]
[{"$f":"IF('Clearing Calculations'!A829=\"\",\"\",'Clearing Calculations'!A829)","v":""},{"$f":"IF('Clearing Calculations'!A829,'Clearing Calculations'!B829,\"\")","v":""},{"$f":"IF('Clearing Calculations'!B829,'Clearing Calculations'!C829,\"\")","v":""},"","","",""]
[{"$f":"IF('Clearing Calculations'!A830=\"\",\"\",'Clearing Calculations'!A830)","v":""},{"$f":"IF('Clearing Calculations'!A830,'Clearing Calculations'!B830,\"\")","v":""},{"$f":"IF('Clearing Calculations'!B830,'Clearing Calculations'!C830,\"\")","v":""},"","","",""]
[{"$f":"IF('Clearing Calculations'!A831=\"\",\"\",'Clearing Calculations'!A831)","v":""},{"$f":"IF('Clearing Calculations'!A831,'Clearing Calculations'!B831,\"\")","v":""},{"$f":"IF('Clearing Calculations'!B831,'Clearing Calculations'!C831,\"\")","v":""},"","","",""]
[{"$f":"IF('Clearing Calculations'!A832=\"\",\"\",'Clearing Calculations'!A832)","v":""},{"$f":"IF('Clearing Calculations'!A832,'Clearing Calculations'!B832,\"\")","v":""},{"$f":"IF('Clearing Calculations'!B832,'Clearing Calculations'!C832,\"\")","v":""},"","","",""]
[{"$f":"IF('Clearing Calculations'!A833=\"\",\"\",'Clearing Calculations'!A833)","v":""},{"$f":"IF('Clearing Calculations'!A833,'Clearing Calculations'!B833,\"\")","v":""},{"$f":"IF('Clearing Calculations'!B833,'Clearing Calculations'!C833,\"\")","v":""},"","","",""]
[{"$f":"IF('Clearing Calculations'!A834=\"\",\"\",'Clearing Calculations'!A834)","v":""},{"$f":"IF('Clearing Calculations'!A834,'Clearing Calculations'!B834,\"\")","v":""},{"$f":"IF('Clearing Calculations'!B834,'Clearing Calculations'!C834,\"\")","v":""},"","","",""]
[{"$f":"IF('Clearing Calculations'!A835=\"\",\"\",'Clearing Calculations'!A835)","v":""},{"$f":"IF('Clearing Calculations'!A835,'Clearing Calculations'!B835,\"\")","v":""},{"$f":"IF('Clearing Calculations'!B835,'Clearing Calculations'!C835,\"\")","v":""},"","","",""]
[{"$f":"IF('Clearing Calculations'!A836=\"\",\"\",'Clearing Calculations'!A836)","v":""},{"$f":"IF('Clearing Calculations'!A836,'Clearing Calculations'!B836,\"\")","v":""},{"$f":"IF('Clearing Calculations'!B836,'Clearing Calculations'!C836,\"\")","v":""},"","","",""]
[{"$f":"IF('Clearing Calculations'!A837=\"\",\"\",'Clearing Calculations'!A837)","v":""},{"$f":"IF('Clearing Calculations'!A837,'Clearing Calculations'!B837,\"\")","v":""},{"$f":"IF('Clearing Calculations'!B837,'Clearing Calculations'!C837,\"\")","v":""},"","","",""]
[{"$f":"IF('Clearing Calculations'!A838=\"\",\"\",'Clearing Calculations'!A838)","v":""},{"$f":"IF('Clearing Calculations'!A838,'Clearing Calculations'!B838,\"\")","v":""},{"$f":"IF('Clearing Calculations'!B838,'Clearing Calculations'!C838,\"\")","v":""},"","","",""]
[{"$f":"IF('Clearing Calculations'!A839=\"\",\"\",'Clearing Calculations'!A839)","v":""},{"$f":"IF('Clearing Calculations'!A839,'Clearing Calculations'!B839,\"\")","v":""},{"$f":"IF('Clearing Calculations'!B839,'Clearing Calculations'!C839,\"\")","v":""},"","","",""]
[{"$f":"IF('Clearing Calculations'!A840=\"\",\"\",'Clearing Calculations'!A840)","v":""},{"$f":"IF('Clearing Calculations'!A840,'Clearing Calculations'!B840,\"\")","v":""},{"$f":"IF('Clearing Calculations'!B840,'Clearing Calculations'!C840,\"\")","v":""},"","","",""]
[{"$f":"IF('Clearing Calculations'!A841=\"\",\"\",'Clearing Calculations'!A841)","v":""},{"$f":"IF('Clearing Calculations'!A841,'Clearing Calculations'!B841,\"\")","v":""},{"$f":"IF('Clearing Calculations'!B841,'Clearing Calculations'!C841,\"\")","v":""},"","","",""]
[{"$f":"IF('Clearing Calculations'!A842=\"\",\"\",'Clearing Calculations'!A842)","v":""},{"$f":"IF('Clearing Calculations'!A842,'Clearing Calculations'!B842,\"\")","v":""},{"$f":"IF('Clearing Calculations'!B842,'Clearing Calculations'!C842,\"\")","v":""},"","","",""]
[{"$f":"IF('Clearing Calculations'!A843=\"\",\"\",'Clearing Calculations'!A843)","v":""},{"$f":"IF('Clearing Calculations'!A843,'Clearing Calculations'!B843,\"\")","v":""},{"$f":"IF('Clearing Calculations'!B843,'Clearing Calculations'!C843,\"\")","v":""},"","","",""]
[{"$f":"IF('Clearing Calculations'!A844=\"\",\"\",'Clearing Calculations'!A844)","v":""},{"$f":"IF('Clearing Calculations'!A844,'Clearing Calculations'!B844,\"\")","v":""},{"$f":"IF('Clearing Calculations'!B844,'Clearing Calculations'!C844,\"\")","v":""},"","","",""]
[{"$f":"IF('Clearing Calculations'!A845=\"\",\"\",'Clearing Calculations'!A845)","v":""},{"$f":"IF('Clearing Calculations'!A845,'Clearing Calculations'!B845,\"\")","v":""},{"$f":"IF('Clearing Calculations'!B845,'Clearing Calculations'!C845,\"\")","v":""},"","","",""]
[{"$f":"IF('Clearing Calculations'!A846=\"\",\"\",'Clearing Calculations'!A846)","v":""},{"$f":"IF('Clearing Calculations'!A846,'Clearing Calculations'!B846,\"\")","v":""},{"$f":"IF('Clearing Calculations'!B846,'Clearing Calculations'!C846,\"\")","v":""},"","","",""]
[{"$f":"IF('Clearing Calculations'!A847=\"\",\"\",'Clearing Calculations'!A847)","v":""},{"$f":"IF('Clearing Calculations'!A847,'Clearing Calculations'!B847,\"\")","v":""},{"$f":"IF('Clearing Calculations'!B847,'Clearing Calculations'!C847,\"\")","v":""},"","","",""]
[{"$f":"IF('Clearing Calculations'!A848=\"\",\"\",'Clearing Calculations'!A848)","v":""},{"$f":"IF('Clearing Calculations'!A848,'Clearing Calculations'!B848,\"\")","v":""},{"$f":"IF('Clearing Calculations'!B848,'Clearing Calculations'!C848,\"\")","v":""},"","","",""]
[{"$f":"IF('Clearing Calculations'!A849=\"\",\"\",'Clearing Calculations'!A849)","v":""},{"$f":"IF('Clearing Calculations'!A849,'Clearing Calculations'!B849,\"\")","v":""},{"$f":"IF('Clearing Calculations'!B849,'Clearing Calculations'!C849,\"\")","v":""},"","","",""]
[{"$f":"IF('Clearing Calculations'!A850=\"\",\"\",'Clearing Calculations'!A850)","v":""},{"$f":"IF('Clearing Calculations'!A850,'Clearing Calculations'!B850,\"\")","v":""},{"$f":"IF('Clearing Calculations'!B850,'Clearing Calculations'!C850,\"\")","v":""},"","","",""]
[{"$f":"IF('Clearing Calculations'!A851=\"\",\"\",'Clearing Calculations'!A851)","v":""},{"$f":"IF('Clearing Calculations'!A851,'Clearing Calculations'!B851,\"\")","v":""},{"$f":"IF('Clearing Calculations'!B851,'Clearing Calculations'!C851,\"\")","v":""},"","","",""]
[{"$f":"IF('Clearing Calculations'!A852=\"\",\"\",'Clearing Calculations'!A852)","v":""},{"$f":"IF('Clearing Calculations'!A852,'Clearing Calculations'!B852,\"\")","v":""},{"$f":"IF('Clearing Calculations'!B852,'Clearing Calculations'!C852,\"\")","v":""},"","","",""]
[{"$f":"IF('Clearing Calculations'!A853=\"\",\"\",'Clearing Calculations'!A853)","v":""},{"$f":"IF('Clearing Calculations'!A853,'Clearing Calculations'!B853,\"\")","v":""},{"$f":"IF('Clearing Calculations'!B853,'Clearing Calculations'!C853,\"\")","v":""},"","","",""]
[{"$f":"IF('Clearing Calculations'!A854=\"\",\"\",'Clearing Calculations'!A854)","v":""},{"$f":"IF('Clearing Calculations'!A854,'Clearing Calculations'!B854,\"\")","v":""},{"$f":"IF('Clearing Calculations'!B854,'Clearing Calculations'!C854,\"\")","v":""},"","","",""]
[{"$f":"IF('Clearing Calculations'!A855=\"\",\"\",'Clearing Calculations'!A855)","v":""},{"$f":"IF('Clearing Calculations'!A855,'Clearing Calculations'!B855,\"\")","v":""},{"$f":"IF('Clearing Calculations'!B855,'Clearing Calculations'!C855,\"\")","v":""},"","","",""]
[{"$f":"IF('Clearing Calculations'!A856=\"\",\"\",'Clearing Calculations'!A856)","v":""},{"$f":"IF('Clearing Calculations'!A856,'Clearing Calculations'!B856,\"\")","v":""},{"$f":"IF('Clearing Calculations'!B856,'Clearing Calculations'!C856,\"\")","v":""},"","","",""]
[{"$f":"IF('Clearing Calculations'!A857=\"\",\"\",'Clearing Calculations'!A857)","v":""},{"$f":"IF('Clearing Calculations'!A857,'Clearing Calculations'!B857,\"\")","v":""},{"$f":"IF('Clearing Calculations'!B857,'Clearing Calculations'!C857,\"\")","v":""},"","","",""]
[{"$f":"IF('Clearing Calculations'!A858=\"\",\"\",'Clearing Calculations'!A858)","v":""},{"$f":"IF('Clearing Calculations'!A858,'Clearing Calculations'!B858,\"\")","v":""},{"$f":"IF('Clearing Calculations'!B858,'Clearing Calculations'!C858,\"\")","v":""},"","","",""]
[{"$f":"IF('Clearing Calculations'!A859=\"\",\"\",'Clearing Calculations'!A859)","v":""},{"$f":"IF('Clearing Calculations'!A859,'Clearing Calculations'!B859,\"\")","v":""},{"$f":"IF('Clearing Calculations'!B859,'Clearing Calculations'!C859,\"\")","v":""},"","","",""]
[{"$f":"IF('Clearing Calculations'!A860=\"\",\"\",'Clearing Calculations'!A860)","v":""},{"$f":"IF('Clearing Calculations'!A860,'Clearing Calculations'!B860,\"\")","v":""},{"$f":"IF('Clearing Calculations'!B860,'Clearing Calculations'!C860,\"\")","v":""},"","","",""]
[{"$f":"IF('Clearing Calculations'!A861=\"\",\"\",'Clearing Calculations'!A861)","v":""},{"$f":"IF('Clearing Calculations'!A861,'Clearing Calculations'!B861,\"\")","v":""},{"$f":"IF('Clearing Calculations'!B861,'Clearing Calculations'!C861,\"\")","v":""},"","","",""]
[{"$f":"IF('Clearing Calculations'!A862=\"\",\"\",'Clearing Calculations'!A862)","v":""},{"$f":"IF('Clearing Calculations'!A862,'Clearing Calculations'!B862,\"\")","v":""},{"$f":"IF('Clearing Calculations'!B862,'Clearing Calculations'!C862,\"\")","v":""},"","","",""]
[{"$f":"IF('Clearing Calculations'!A863=\"\",\"\",'Clearing Calculations'!A863)","v":""},{"$f":"IF('Clearing Calculations'!A863,'Clearing Calculations'!B863,\"\")","v":""},{"$f":"IF('Clearing Calculations'!B863,'Clearing Calculations'!C863,\"\")","v":""},"","","",""]
[{"$f":"IF('Clearing Calculations'!A864=\"\",\"\",'Clearing Calculations'!A864)","v":""},{"$f":"IF('Clearing Calculations'!A864,'Clearing Calculations'!B864,\"\")","v":""},{"$f":"IF('Clearing Calculations'!B864,'Clearing Calculations'!C864,\"\")","v":""},"","","",""]
[{"$f":"IF('Clearing Calculations'!A865=\"\",\"\",'Clearing Calculations'!A865)","v":""},{"$f":"IF('Clearing Calculations'!A865,'Clearing Calculations'!B865,\"\")","v":""},{"$f":"IF('Clearing Calculations'!B865,'Clearing Calculations'!C865,\"\")","v":""},"","","",""]
[{"$f":"IF('Clearing Calculations'!A866=\"\",\"\",'Clearing Calculations'!A866)","v":""},{"$f":"IF('Clearing Calculations'!A866,'Clearing Calculations'!B866,\"\")","v":""},{"$f":"IF('Clearing Calculations'!B866,'Clearing Calculations'!C866,\"\")","v":""},"","","",""]
[{"$f":"IF('Clearing Calculations'!A867=\"\",\"\",'Clearing Calculations'!A867)","v":""},{"$f":"IF('Clearing Calculations'!A867,'Clearing Calculations'!B867,\"\")","v":""},{"$f":"IF('Clearing Calculations'!B867,'Clearing Calculations'!C867,\"\")","v":""},"","","",""]
[{"$f":"IF('Clearing Calculations'!A868=\"\",\"\",'Clearing Calculations'!A868)","v":""},{"$f":"IF('Clearing Calculations'!A868,'Clearing Calculations'!B868,\"\")","v":""},{"$f":"IF('Clearing Calculations'!B868,'Clearing Calculations'!C868,\"\")","v":""},"","","",""]
[{"$f":"IF('Clearing Calculations'!A869=\"\",\"\",'Clearing Calculations'!A869)","v":""},{"$f":"IF('Clearing Calculations'!A869,'Clearing Calculations'!B869,\"\")","v":""},{"$f":"IF('Clearing Calculations'!B869,'Clearing Calculations'!C869,\"\")","v":""},"","","",""]
[{"$f":"IF('Clearing Calculations'!A870=\"\",\"\",'Clearing Calculations'!A870)","v":""},{"$f":"IF('Clearing Calculations'!A870,'Clearing Calculations'!B870,\"\")","v":""},{"$f":"IF('Clearing Calculations'!B870,'Clearing Calculations'!C870,\"\")","v":""},"","","",""]
[{"$f":"IF('Clearing Calculations'!A871=\"\",\"\",'Clearing Calculations'!A871)","v":""},{"$f":"IF('Clearing Calculations'!A871,'Clearing Calculations'!B871,\"\")","v":""},{"$f":"IF('Clearing Calculations'!B871,'Clearing Calculations'!C871,\"\")","v":""},"","","",""]
[{"$f":"IF('Clearing Calculations'!A872=\"\",\"\",'Clearing Calculations'!A872)","v":""},{"$f":"IF('Clearing Calculations'!A872,'Clearing Calculations'!B872,\"\")","v":""},{"$f":"IF('Clearing Calculations'!B872,'Clearing Calculations'!C872,\"\")","v":""},"","","",""]
[{"$f":"IF('Clearing Calculations'!A873=\"\",\"\",'Clearing Calculations'!A873)","v":""},{"$f":"IF('Clearing Calculations'!A873,'Clearing Calculations'!B873,\"\")","v":""},{"$f":"IF('Clearing Calculations'!B873,'Clearing Calculations'!C873,\"\")","v":""},"","","",""]
[{"$f":"IF('Clearing Calculations'!A874=\"\",\"\",'Clearing Calculations'!A874)","v":""},{"$f":"IF('Clearing Calculations'!A874,'Clearing Calculations'!B874,\"\")","v":""},{"$f":"IF('Clearing Calculations'!B874,'Clearing Calculations'!C874,\"\")","v":""},"","","",""]
[{"$f":"IF('Clearing Calculations'!A875=\"\",\"\",'Clearing Calculations'!A875)","v":""},{"$f":"IF('Clearing Calculations'!A875,'Clearing Calculations'!B875,\"\")","v":""},{"$f":"IF('Clearing Calculations'!B875,'Clearing Calculations'!C875,\"\")","v":""},"","","",""]
[{"$f":"IF('Clearing Calculations'!A876=\"\",\"\",'Clearing Calculations'!A876)","v":""},{"$f":"IF('Clearing Calculations'!A876,'Clearing Calculations'!B876,\"\")","v":""},{"$f":"IF('Clearing Calculations'!B876,'Clearing Calculations'!C876,\"\")","v":""},{"$f":"IF(A882=\"\",\"\",$B882+$C882)","v":""},{"$f":"IF(A882=\"\",\"\",(D882+D881)/2*(A882-A881))","v":""},{"$f":"IF(A882=\"\",\"\",(E882/9))","v":""},{"$f":"IF(A882=\"\",\"\",E882/$G$3)","v":""}]
[{"$f":"IF('Clearing Calculations'!A877=\"\",\"\",'Clearing Calculations'!A877)","v":""},{"$f":"IF('Clearing Calculations'!A877,'Clearing Calculations'!B877,\"\")","v":""},{"$f":"IF('Clearing Calculations'!B877,'Clearing Calculations'!C877,\"\")","v":""},"","","",""]
[{"$f":"IF('Clearing Calculations'!A878=\"\",\"\",'Clearing Calculations'!A878)","v":""},{"$f":"IF('Clearing Calculations'!A878,'Clearing Calculations'!B878,\"\")","v":""},{"$f":"IF('Clearing Calculations'!B878,'Clearing Calculations'!C878,\"\")","v":""},"","","",""]
[{"$f":"IF('Clearing Calculations'!A879=\"\",\"\",'Clearing Calculations'!A879)","v":""},{"$f":"IF('Clearing Calculations'!A879,'Clearing Calculations'!B879,\"\")","v":""},{"$f":"IF('Clearing Calculations'!B879,'Clearing Calculations'!C879,\"\")","v":""},"","","",""]
[{"$f":"IF('Clearing Calculations'!A880=\"\",\"\",'Clearing Calculations'!A880)","v":""},{"$f":"IF('Clearing Calculations'!A880,'Clearing Calculations'!B880,\"\")","v":""},{"$f":"IF('Clearing Calculations'!B880,'Clearing Calculations'!C880,\"\")","v":""},"","","",""]
[{"$f":"IF('Clearing Calculations'!A881=\"\",\"\",'Clearing Calculations'!A881)","v":""},{"$f":"IF('Clearing Calculations'!A881,'Clearing Calculations'!B881,\"\")","v":""},{"$f":"IF('Clearing Calculations'!B881,'Clearing Calculations'!C881,\"\")","v":""},"","","",""]
[{"$f":"IF('Clearing Calculations'!A882=\"\",\"\",'Clearing Calculations'!A882)","v":""},{"$f":"IF('Clearing Calculations'!A882,'Clearing Calculations'!B882,\"\")","v":""},{"$f":"IF('Clearing Calculations'!B882,'Clearing Calculations'!C882,\"\")","v":""},"","","",""]
[{"$f":"IF('Clearing Calculations'!A883=\"\",\"\",'Clearing Calculations'!A883)","v":""},{"$f":"IF('Clearing Calculations'!A883,'Clearing Calculations'!B883,\"\")","v":""},{"$f":"IF('Clearing Calculations'!B883,'Clearing Calculations'!C883,\"\")","v":""},"","","",""]
[{"$f":"IF('Clearing Calculations'!A884=\"\",\"\",'Clearing Calculations'!A884)","v":""},{"$f":"IF('Clearing Calculations'!A884,'Clearing Calculations'!B884,\"\")","v":""},{"$f":"IF('Clearing Calculations'!B884,'Clearing Calculations'!C884,\"\")","v":""},"","","",""]
[{"$f":"IF('Clearing Calculations'!A885=\"\",\"\",'Clearing Calculations'!A885)","v":""},{"$f":"IF('Clearing Calculations'!A885,'Clearing Calculations'!B885,\"\")","v":""},{"$f":"IF('Clearing Calculations'!B885,'Clearing Calculations'!C885,\"\")","v":""},"","","",""]
[{"$f":"IF('Clearing Calculations'!A886=\"\",\"\",'Clearing Calculations'!A886)","v":""},{"$f":"IF('Clearing Calculations'!A886,'Clearing Calculations'!B886,\"\")","v":""},{"$f":"IF('Clearing Calculations'!B886,'Clearing Calculations'!C886,\"\")","v":""},"","","",""]
[{"$f":"IF('Clearing Calculations'!A887=\"\",\"\",'Clearing Calculations'!A887)","v":""},{"$f":"IF('Clearing Calculations'!A887,'Clearing Calculations'!B887,\"\")","v":""},{"$f":"IF('Clearing Calculations'!B887,'Clearing Calculations'!C887,\"\")","v":""},"","","",""]
[{"$f":"IF('Clearing Calculations'!A888=\"\",\"\",'Clearing Calculations'!A888)","v":""},{"$f":"IF('Clearing Calculations'!A888,'Clearing Calculations'!B888,\"\")","v":""},{"$f":"IF('Clearing Calculations'!B888,'Clearing Calculations'!C888,\"\")","v":""},"","","",""]
[{"$f":"IF('Clearing Calculations'!A889=\"\",\"\",'Clearing Calculations'!A889)","v":""},{"$f":"IF('Clearing Calculations'!A889,'Clearing Calculations'!B889,\"\")","v":""},{"$f":"IF('Clearing Calculations'!B889,'Clearing Calculations'!C889,\"\")","v":""},"","","",""]
[{"$f":"IF('Clearing Calculations'!A890=\"\",\"\",'Clearing Calculations'!A890)","v":""},{"$f":"IF('Clearing Calculations'!A890,'Clearing Calculations'!B890,\"\")","v":""},{"$f":"IF('Clearing Calculations'!B890,'Clearing Calculations'!C890,\"\")","v":""},"","","",""]
[{"$f":"IF('Clearing Calculations'!A891=\"\",\"\",'Clearing Calculations'!A891)","v":""},{"$f":"IF('Clearing Calculations'!A891,'Clearing Calculations'!B891,\"\")","v":""},{"$f":"IF('Clearing Calculations'!B891,'Clearing Calculations'!C891,\"\")","v":""},"","","",""]
[{"$f":"IF('Clearing Calculations'!A892=\"\",\"\",'Clearing Calculations'!A892)","v":""},{"$f":"IF('Clearing Calculations'!A892,'Clearing Calculations'!B892,\"\")","v":""},{"$f":"IF('Clearing Calculations'!B892,'Clearing Calculations'!C892,\"\")","v":""},"","","",""]
[{"$f":"IF('Clearing Calculations'!A893=\"\",\"\",'Clearing Calculations'!A893)","v":""},{"$f":"IF('Clearing Calculations'!A893,'Clearing Calculations'!B893,\"\")","v":""},{"$f":"IF('Clearing Calculations'!B893,'Clearing Calculations'!C893,\"\")","v":""},"","","",""]
[{"$f":"IF('Clearing Calculations'!A894=\"\",\"\",'Clearing Calculations'!A894)","v":""},{"$f":"IF('Clearing Calculations'!A894,'Clearing Calculations'!B894,\"\")","v":""},{"$f":"IF('Clearing Calculations'!B894,'Clearing Calculations'!C894,\"\")","v":""},"","","",""]
[{"$f":"IF('Clearing Calculations'!A895=\"\",\"\",'Clearing Calculations'!A895)","v":""},{"$f":"IF('Clearing Calculations'!A895,'Clearing Calculations'!B895,\"\")","v":""},{"$f":"IF('Clearing Calculations'!B895,'Clearing Calculations'!C895,\"\")","v":""},"","","",""]
[{"$f":"IF('Clearing Calculations'!A896=\"\",\"\",'Clearing Calculations'!A896)","v":""},{"$f":"IF('Clearing Calculations'!A896,'Clearing Calculations'!B896,\"\")","v":""},{"$f":"IF('Clearing Calculations'!B896,'Clearing Calculations'!C896,\"\")","v":""},"","","",""]
[{"$f":"IF('Clearing Calculations'!A897=\"\",\"\",'Clearing Calculations'!A897)","v":""},{"$f":"IF('Clearing Calculations'!A897,'Clearing Calculations'!B897,\"\")","v":""},{"$f":"IF('Clearing Calculations'!B897,'Clearing Calculations'!C897,\"\")","v":""},"","","",""]
[{"$f":"IF('Clearing Calculations'!A898=\"\",\"\",'Clearing Calculations'!A898)","v":""},{"$f":"IF('Clearing Calculations'!A898,'Clearing Calculations'!B898,\"\")","v":""},{"$f":"IF('Clearing Calculations'!B898,'Clearing Calculations'!C898,\"\")","v":""},"","","",""]
[{"$f":"IF('Clearing Calculations'!A899=\"\",\"\",'Clearing Calculations'!A899)","v":""},{"$f":"IF('Clearing Calculations'!A899,'Clearing Calculations'!B899,\"\")","v":""},{"$f":"IF('Clearing Calculations'!B899,'Clearing Calculations'!C899,\"\")","v":""},"","","",""]
[{"$f":"IF('Clearing Calculations'!A900=\"\",\"\",'Clearing Calculations'!A900)","v":""},{"$f":"IF('Clearing Calculations'!A900,'Clearing Calculations'!B900,\"\")","v":""},{"$f":"IF('Clearing Calculations'!B900,'Clearing Calculations'!C900,\"\")","v":""},"","","",""]
[{"$f":"IF('Clearing Calculations'!A901=\"\",\"\",'Clearing Calculations'!A901)","v":""},{"$f":"IF('Clearing Calculations'!A901,'Clearing Calculations'!B901,\"\")","v":""},{"$f":"IF('Clearing Calculations'!B901,'Clearing Calculations'!C901,\"\")","v":""},"","","",""]
[{"$f":"IF('Clearing Calculations'!A902=\"\",\"\",'Clearing Calculations'!A902)","v":""},{"$f":"IF('Clearing Calculations'!A902,'Clearing Calculations'!B902,\"\")","v":""},{"$f":"IF('Clearing Calculations'!B902,'Clearing Calculations'!C902,\"\")","v":""},"","","",""]
[{"$f":"IF('Clearing Calculations'!A903=\"\",\"\",'Clearing Calculations'!A903)","v":""},{"$f":"IF('Clearing Calculations'!A903,'Clearing Calculations'!B903,\"\")","v":""},{"$f":"IF('Clearing Calculations'!B903,'Clearing Calculations'!C903,\"\")","v":""},"","","",""]
[{"$f":"IF('Clearing Calculations'!A904=\"\",\"\",'Clearing Calculations'!A904)","v":""},{"$f":"IF('Clearing Calculations'!A904,'Clearing Calculations'!B904,\"\")","v":""},{"$f":"IF('Clearing Calculations'!B904,'Clearing Calculations'!C904,\"\")","v":""},"","","",""]
[{"$f":"IF('Clearing Calculations'!A905=\"\",\"\",'Clearing Calculations'!A905)","v":""},{"$f":"IF('Clearing Calculations'!A905,'Clearing Calculations'!B905,\"\")","v":""},{"$f":"IF('Clearing Calculations'!B905,'Clearing Calculations'!C905,\"\")","v":""},"","","",""]
[{"$f":"IF('Clearing Calculations'!A906=\"\",\"\",'Clearing Calculations'!A906)","v":""},{"$f":"IF('Clearing Calculations'!A906,'Clearing Calculations'!B906,\"\")","v":""},{"$f":"IF('Clearing Calculations'!B906,'Clearing Calculations'!C906,\"\")","v":""},"","","",""]
[{"$f":"IF('Clearing Calculations'!A907=\"\",\"\",'Clearing Calculations'!A907)","v":""},{"$f":"IF('Clearing Calculations'!A907,'Clearing Calculations'!B907,\"\")","v":""},{"$f":"IF('Clearing Calculations'!B907,'Clearing Calculations'!C907,\"\")","v":""},"","","",""]
[{"$f":"IF('Clearing Calculations'!A908=\"\",\"\",'Clearing Calculations'!A908)","v":""},{"$f":"IF('Clearing Calculations'!A908,'Clearing Calculations'!B908,\"\")","v":""},{"$f":"IF('Clearing Calculations'!B908,'Clearing Calculations'!C908,\"\")","v":""},"","","",""]
[{"$f":"IF('Clearing Calculations'!A909=\"\",\"\",'Clearing Calculations'!A909)","v":""},{"$f":"IF('Clearing Calculations'!A909,'Clearing Calculations'!B909,\"\")","v":""},{"$f":"IF('Clearing Calculations'!B909,'Clearing Calculations'!C909,\"\")","v":""},"","","",""]
[{"$f":"IF('Clearing Calculations'!A910=\"\",\"\",'Clearing Calculations'!A910)","v":""},{"$f":"IF('Clearing Calculations'!A910,'Clearing Calculations'!B910,\"\")","v":""},{"$f":"IF('Clearing Calculations'!B910,'Clearing Calculations'!C910,\"\")","v":""},"","","",""]
[{"$f":"IF('Clearing Calculations'!A911=\"\",\"\",'Clearing Calculations'!A911)","v":""},{"$f":"IF('Clearing Calculations'!A911,'Clearing Calculations'!B911,\"\")","v":""},{"$f":"IF('Clearing Calculations'!B911,'Clearing Calculations'!C911,\"\")","v":""},"","","",""]
[{"$f":"IF('Clearing Calculations'!A912=\"\",\"\",'Clearing Calculations'!A912)","v":""},{"$f":"IF('Clearing Calculations'!A912,'Clearing Calculations'!B912,\"\")","v":""},{"$f":"IF('Clearing Calculations'!B912,'Clearing Calculations'!C912,\"\")","v":""},"","","",""]
[{"$f":"IF('Clearing Calculations'!A913=\"\",\"\",'Clearing Calculations'!A913)","v":""},{"$f":"IF('Clearing Calculations'!A913,'Clearing Calculations'!B913,\"\")","v":""},{"$f":"IF('Clearing Calculations'!B913,'Clearing Calculations'!C913,\"\")","v":""},"","","",""]
[{"$f":"IF('Clearing Calculations'!A914=\"\",\"\",'Clearing Calculations'!A914)","v":""},{"$f":"IF('Clearing Calculations'!A914,'Clearing Calculations'!B914,\"\")","v":""},{"$f":"IF('Clearing Calculations'!B914,'Clearing Calculations'!C914,\"\")","v":""},"","","",""]
[{"$f":"IF('Clearing Calculations'!A915=\"\",\"\",'Clearing Calculations'!A915)","v":""},{"$f":"IF('Clearing Calculations'!A915,'Clearing Calculations'!B915,\"\")","v":""},{"$f":"IF('Clearing Calculations'!B915,'Clearing Calculations'!C915,\"\")","v":""},"","","",""]
[{"$f":"IF('Clearing Calculations'!A916=\"\",\"\",'Clearing Calculations'!A916)","v":""},{"$f":"IF('Clearing Calculations'!A916,'Clearing Calculations'!B916,\"\")","v":""},{"$f":"IF('Clearing Calculations'!B916,'Clearing Calculations'!C916,\"\")","v":""},"","","",""]
[{"$f":"IF('Clearing Calculations'!A917=\"\",\"\",'Clearing Calculations'!A917)","v":""},{"$f":"IF('Clearing Calculations'!A917,'Clearing Calculations'!B917,\"\")","v":""},{"$f":"IF('Clearing Calculations'!B917,'Clearing Calculations'!C917,\"\")","v":""},"","","",""]
[{"$f":"IF('Clearing Calculations'!A918=\"\",\"\",'Clearing Calculations'!A918)","v":""},{"$f":"IF('Clearing Calculations'!A918,'Clearing Calculations'!B918,\"\")","v":""},{"$f":"IF('Clearing Calculations'!B918,'Clearing Calculations'!C918,\"\")","v":""},"","","",""]
[{"$f":"IF('Clearing Calculations'!A919=\"\",\"\",'Clearing Calculations'!A919)","v":""},{"$f":"IF('Clearing Calculations'!A919,'Clearing Calculations'!B919,\"\")","v":""},{"$f":"IF('Clearing Calculations'!B919,'Clearing Calculations'!C919,\"\")","v":""},"","","",""]
[{"$f":"IF('Clearing Calculations'!A920=\"\",\"\",'Clearing Calculations'!A920)","v":""},{"$f":"IF('Clearing Calculations'!A920,'Clearing Calculations'!B920,\"\")","v":""},{"$f":"IF('Clearing Calculations'!B920,'Clearing Calculations'!C920,\"\")","v":""},"","","",""]
[{"$f":"IF('Clearing Calculations'!A921=\"\",\"\",'Clearing Calculations'!A921)","v":""},{"$f":"IF('Clearing Calculations'!A921,'Clearing Calculations'!B921,\"\")","v":""},{"$f":"IF('Clearing Calculations'!B921,'Clearing Calculations'!C921,\"\")","v":""},"","","",""]
[{"$f":"IF('Clearing Calculations'!A922=\"\",\"\",'Clearing Calculations'!A922)","v":""},{"$f":"IF('Clearing Calculations'!A922,'Clearing Calculations'!B922,\"\")","v":""},{"$f":"IF('Clearing Calculations'!B922,'Clearing Calculations'!C922,\"\")","v":""},"","","",""]
[{"$f":"IF('Clearing Calculations'!A923=\"\",\"\",'Clearing Calculations'!A923)","v":""},{"$f":"IF('Clearing Calculations'!A923,'Clearing Calculations'!B923,\"\")","v":""},{"$f":"IF('Clearing Calculations'!B923,'Clearing Calculations'!C923,\"\")","v":""},"","","",""]
[{"$f":"IF('Clearing Calculations'!A924=\"\",\"\",'Clearing Calculations'!A924)","v":""},{"$f":"IF('Clearing Calculations'!A924,'Clearing Calculations'!B924,\"\")","v":""},{"$f":"IF('Clearing Calculations'!B924,'Clearing Calculations'!C924,\"\")","v":""},"","","",""]
[{"$f":"IF('Clearing Calculations'!A925=\"\",\"\",'Clearing Calculations'!A925)","v":""},{"$f":"IF('Clearing Calculations'!A925,'Clearing Calculations'!B925,\"\")","v":""},{"$f":"IF('Clearing Calculations'!B925,'Clearing Calculations'!C925,\"\")","v":""},"","","",""]
[{"$f":"IF('Clearing Calculations'!A926=\"\",\"\",'Clearing Calculations'!A926)","v":""},{"$f":"IF('Clearing Calculations'!A926,'Clearing Calculations'!B926,\"\")","v":""},{"$f":"IF('Clearing Calculations'!B926,'Clearing Calculations'!C926,\"\")","v":""},"","","",""]
[{"$f":"IF('Clearing Calculations'!A927=\"\",\"\",'Clearing Calculations'!A927)","v":""},{"$f":"IF('Clearing Calculations'!A927,'Clearing Calculations'!B927,\"\")","v":""},{"$f":"IF('Clearing Calculations'!B927,'Clearing Calculations'!C927,\"\")","v":""},"","","",""]
[{"$f":"IF('Clearing Calculations'!A928=\"\",\"\",'Clearing Calculations'!A928)","v":""},{"$f":"IF('Clearing Calculations'!A928,'Clearing Calculations'!B928,\"\")","v":""},{"$f":"IF('Clearing Calculations'!B928,'Clearing Calculations'!C928,\"\")","v":""},"","","",""]
[{"$f":"IF('Clearing Calculations'!A929=\"\",\"\",'Clearing Calculations'!A929)","v":""},{"$f":"IF('Clearing Calculations'!A929,'Clearing Calculations'!B929,\"\")","v":""},{"$f":"IF('Clearing Calculations'!B929,'Clearing Calculations'!C929,\"\")","v":""},"","","",""]
[{"$f":"IF('Clearing Calculations'!A930=\"\",\"\",'Clearing Calculations'!A930)","v":""},{"$f":"IF('Clearing Calculations'!A930,'Clearing Calculations'!B930,\"\")","v":""},{"$f":"IF('Clearing Calculations'!B930,'Clearing Calculations'!C930,\"\")","v":""},"","","",""]
[{"$f":"IF('Clearing Calculations'!A931=\"\",\"\",'Clearing Calculations'!A931)","v":""},{"$f":"IF('Clearing Calculations'!A931,'Clearing Calculations'!B931,\"\")","v":""},{"$f":"IF('Clearing Calculations'!B931,'Clearing Calculations'!C931,\"\")","v":""},"","","",""]
[{"$f":"IF('Clearing Calculations'!A932=\"\",\"\",'Clearing Calculations'!A932)","v":""},{"$f":"IF('Clearing Calculations'!A932,'Clearing Calculations'!B932,\"\")","v":""},{"$f":"IF('Clearing Calculations'!B932,'Clearing Calculations'!C932,\"\")","v":""},"","","",""]
[{"$f":"IF('Clearing Calculations'!A933=\"\",\"\",'Clearing Calculations'!A933)","v":""},{"$f":"IF('Clearing Calculations'!A933,'Clearing Calculations'!B933,\"\")","v":""},{"$f":"IF('Clearing Calculations'!B933,'Clearing Calculations'!C933,\"\")","v":""},"","","",""]
[{"$f":"IF('Clearing Calculations'!A934=\"\",\"\",'Clearing Calculations'!A934)","v":""},{"$f":"IF('Clearing Calculations'!A934,'Clearing Calculations'!B934,\"\")","v":""},{"$f":"IF('Clearing Calculations'!B934,'Clearing Calculations'!C934,\"\")","v":""},"","","",""]
[{"$f":"IF('Clearing Calculations'!A935=\"\",\"\",'Clearing Calculations'!A935)","v":""},{"$f":"IF('Clearing Calculations'!A935,'Clearing Calculations'!B935,\"\")","v":""},{"$f":"IF('Clearing Calculations'!B935,'Clearing Calculations'!C935,\"\")","v":""},"","","",""]
[{"$f":"IF('Clearing Calculations'!A936=\"\",\"\",'Clearing Calculations'!A936)","v":""},{"$f":"IF('Clearing Calculations'!A936,'Clearing Calculations'!B936,\"\")","v":""},{"$f":"IF('Clearing Calculations'!B936,'Clearing Calculations'!C936,\"\")","v":""},"","","",""]
[{"$f":"IF('Clearing Calculations'!A937=\"\",\"\",'Clearing Calculations'!A937)","v":""},{"$f":"IF('Clearing Calculations'!A937,'Clearing Calculations'!B937,\"\")","v":""},{"$f":"IF('Clearing Calculations'!B937,'Clearing Calculations'!C937,\"\")","v":""},"","","",""]
[{"$f":"IF('Clearing Calculations'!A938=\"\",\"\",'Clearing Calculations'!A938)","v":""},{"$f":"IF('Clearing Calculations'!A938,'Clearing Calculations'!B938,\"\")","v":""},{"$f":"IF('Clearing Calculations'!B938,'Clearing Calculations'!C938,\"\")","v":""},"","","",""]
[{"$f":"IF('Clearing Calculations'!A939=\"\",\"\",'Clearing Calculations'!A939)","v":""},{"$f":"IF('Clearing Calculations'!A939,'Clearing Calculations'!B939,\"\")","v":""},{"$f":"IF('Clearing Calculations'!B939,'Clearing Calculations'!C939,\"\")","v":""},"","","",""]
[{"$f":"IF('Clearing Calculations'!A940=\"\",\"\",'Clearing Calculations'!A940)","v":""},{"$f":"IF('Clearing Calculations'!A940,'Clearing Calculations'!B940,\"\")","v":""},{"$f":"IF('Clearing Calculations'!B940,'Clearing Calculations'!C940,\"\")","v":""},{"$f":"IF(A946=\"\",\"\",$B946+$C946)","v":""},{"$f":"IF(A946=\"\",\"\",(D946+D945)/2*(A946-A945))","v":""},{"$f":"IF(A946=\"\",\"\",(E946/9))","v":""},{"$f":"IF(A946=\"\",\"\",E946/$G$3)","v":""}]
[{"$f":"IF('Clearing Calculations'!A941=\"\",\"\",'Clearing Calculations'!A941)","v":""},{"$f":"IF('Clearing Calculations'!A941,'Clearing Calculations'!B941,\"\")","v":""},{"$f":"IF('Clearing Calculations'!B941,'Clearing Calculations'!C941,\"\")","v":""},"","","",""]
[{"$f":"IF('Clearing Calculations'!A942=\"\",\"\",'Clearing Calculations'!A942)","v":""},{"$f":"IF('Clearing Calculations'!A942,'Clearing Calculations'!B942,\"\")","v":""},{"$f":"IF('Clearing Calculations'!B942,'Clearing Calculations'!C942,\"\")","v":""},"","","",""]
[{"$f":"IF('Clearing Calculations'!A943=\"\",\"\",'Clearing Calculations'!A943)","v":""},{"$f":"IF('Clearing Calculations'!A943,'Clearing Calculations'!B943,\"\")","v":""},{"$f":"IF('Clearing Calculations'!B943,'Clearing Calculations'!C943,\"\")","v":""},"","","",""]
[{"$f":"IF('Clearing Calculations'!A944=\"\",\"\",'Clearing Calculations'!A944)","v":""},{"$f":"IF('Clearing Calculations'!A944,'Clearing Calculations'!B944,\"\")","v":""},{"$f":"IF('Clearing Calculations'!B944,'Clearing Calculations'!C944,\"\")","v":""},"","","",""]
[{"$f":"IF('Clearing Calculations'!A945=\"\",\"\",'Clearing Calculations'!A945)","v":""},{"$f":"IF('Clearing Calculations'!A945,'Clearing Calculations'!B945,\"\")","v":""},{"$f":"IF('Clearing Calculations'!B945,'Clearing Calculations'!C945,\"\")","v":""},"","","",""]
[{"$f":"IF('Clearing Calculations'!A946=\"\",\"\",'Clearing Calculations'!A946)","v":""},{"$f":"IF('Clearing Calculations'!A946,'Clearing Calculations'!B946,\"\")","v":""},{"$f":"IF('Clearing Calculations'!B946,'Clearing Calculations'!C946,\"\")","v":""},"","","",""]
[{"$f":"IF('Clearing Calculations'!A947=\"\",\"\",'Clearing Calculations'!A947)","v":""},{"$f":"IF('Clearing Calculations'!A947,'Clearing Calculations'!B947,\"\")","v":""},{"$f":"IF('Clearing Calculations'!B947,'Clearing Calculations'!C947,\"\")","v":""},"","","",""]
[{"$f":"IF('Clearing Calculations'!A948=\"\",\"\",'Clearing Calculations'!A948)","v":""},{"$f":"IF('Clearing Calculations'!A948,'Clearing Calculations'!B948,\"\")","v":""},{"$f":"IF('Clearing Calculations'!B948,'Clearing Calculations'!C948,\"\")","v":""},"","","",""]
[{"$f":"IF('Clearing Calculations'!A949=\"\",\"\",'Clearing Calculations'!A949)","v":""},{"$f":"IF('Clearing Calculations'!A949,'Clearing Calculations'!B949,\"\")","v":""},{"$f":"IF('Clearing Calculations'!B949,'Clearing Calculations'!C949,\"\")","v":""},"","","",""]
[{"$f":"IF('Clearing Calculations'!A950=\"\",\"\",'Clearing Calculations'!A950)","v":""},{"$f":"IF('Clearing Calculations'!A950,'Clearing Calculations'!B950,\"\")","v":""},{"$f":"IF('Clearing Calculations'!B950,'Clearing Calculations'!C950,\"\")","v":""},"","","",""]
[{"$f":"IF('Clearing Calculations'!A951=\"\",\"\",'Clearing Calculations'!A951)","v":""},{"$f":"IF('Clearing Calculations'!A951,'Clearing Calculations'!B951,\"\")","v":""},{"$f":"IF('Clearing Calculations'!B951,'Clearing Calculations'!C951,\"\")","v":""},"","","",""]
[{"$f":"IF('Clearing Calculations'!A952=\"\",\"\",'Clearing Calculations'!A952)","v":""},{"$f":"IF('Clearing Calculations'!A952,'Clearing Calculations'!B952,\"\")","v":""},{"$f":"IF('Clearing Calculations'!B952,'Clearing Calculations'!C952,\"\")","v":""},"","","",""]
[{"$f":"IF('Clearing Calculations'!A953=\"\",\"\",'Clearing Calculations'!A953)","v":""},{"$f":"IF('Clearing Calculations'!A953,'Clearing Calculations'!B953,\"\")","v":""},{"$f":"IF('Clearing Calculations'!B953,'Clearing Calculations'!C953,\"\")","v":""},"","","",""]
[{"$f":"IF('Clearing Calculations'!A954=\"\",\"\",'Clearing Calculations'!A954)","v":""},{"$f":"IF('Clearing Calculations'!A954,'Clearing Calculations'!B954,\"\")","v":""},{"$f":"IF('Clearing Calculations'!B954,'Clearing Calculations'!C954,\"\")","v":""},"","","",""]
[{"$f":"IF('Clearing Calculations'!A955=\"\",\"\",'Clearing Calculations'!A955)","v":""},{"$f":"IF('Clearing Calculations'!A955,'Clearing Calculations'!B955,\"\")","v":""},{"$f":"IF('Clearing Calculations'!B955,'Clearing Calculations'!C955,\"\")","v":""},"","","",""]
[{"$f":"IF('Clearing Calculations'!A956=\"\",\"\",'Clearing Calculations'!A956)","v":""},{"$f":"IF('Clearing Calculations'!A956,'Clearing Calculations'!B956,\"\")","v":""},{"$f":"IF('Clearing Calculations'!B956,'Clearing Calculations'!C956,\"\")","v":""},"","","",""]
[{"$f":"IF('Clearing Calculations'!A957=\"\",\"\",'Clearing Calculations'!A957)","v":""},{"$f":"IF('Clearing Calculations'!A957,'Clearing Calculations'!B957,\"\")","v":""},{"$f":"IF('Clearing Calculations'!B957,'Clearing Calculations'!C957,\"\")","v":""},"","","",""]
[{"$f":"IF('Clearing Calculations'!A958=\"\",\"\",'Clearing Calculations'!A958)","v":""},{"$f":"IF('Clearing Calculations'!A958,'Clearing Calculations'!B958,\"\")","v":""},{"$f":"IF('Clearing Calculations'!B958,'Clearing Calculations'!C958,\"\")","v":""},"","","",""]
[{"$f":"IF('Clearing Calculations'!A959=\"\",\"\",'Clearing Calculations'!A959)","v":""},{"$f":"IF('Clearing Calculations'!A959,'Clearing Calculations'!B959,\"\")","v":""},{"$f":"IF('Clearing Calculations'!B959,'Clearing Calculations'!C959,\"\")","v":""},"","","",""]
[{"$f":"IF('Clearing Calculations'!A960=\"\",\"\",'Clearing Calculations'!A960)","v":""},{"$f":"IF('Clearing Calculations'!A960,'Clearing Calculations'!B960,\"\")","v":""},{"$f":"IF('Clearing Calculations'!B960,'Clearing Calculations'!C960,\"\")","v":""},"","","",""]
[{"$f":"IF('Clearing Calculations'!A961=\"\",\"\",'Clearing Calculations'!A961)","v":""},{"$f":"IF('Clearing Calculations'!A961,'Clearing Calculations'!B961,\"\")","v":""},{"$f":"IF('Clearing Calculations'!B961,'Clearing Calculations'!C961,\"\")","v":""},"","","",""]
[{"$f":"IF('Clearing Calculations'!A962=\"\",\"\",'Clearing Calculations'!A962)","v":""},{"$f":"IF('Clearing Calculations'!A962,'Clearing Calculations'!B962,\"\")","v":""},{"$f":"IF('Clearing Calculations'!B962,'Clearing Calculations'!C962,\"\")","v":""},"","","",""]
[{"$f":"IF('Clearing Calculations'!A963=\"\",\"\",'Clearing Calculations'!A963)","v":""},{"$f":"IF('Clearing Calculations'!A963,'Clearing Calculations'!B963,\"\")","v":""},{"$f":"IF('Clearing Calculations'!B963,'Clearing Calculations'!C963,\"\")","v":""},"","","",""]
[{"$f":"IF('Clearing Calculations'!A964=\"\",\"\",'Clearing Calculations'!A964)","v":""},{"$f":"IF('Clearing Calculations'!A964,'Clearing Calculations'!B964,\"\")","v":""},{"$f":"IF('Clearing Calculations'!B964,'Clearing Calculations'!C964,\"\")","v":""},"","","",""]
[{"$f":"IF('Clearing Calculations'!A965=\"\",\"\",'Clearing Calculations'!A965)","v":""},{"$f":"IF('Clearing Calculations'!A965,'Clearing Calculations'!B965,\"\")","v":""},{"$f":"IF('Clearing Calculations'!B965,'Clearing Calculations'!C965,\"\")","v":""},"","","",""]
[{"$f":"IF('Clearing Calculations'!A966=\"\",\"\",'Clearing Calculations'!A966)","v":""},{"$f":"IF('Clearing Calculations'!A966,'Clearing Calculations'!B966,\"\")","v":""},{"$f":"IF('Clearing Calculations'!B966,'Clearing Calculations'!C966,\"\")","v":""},"","","",""]
[{"$f":"IF('Clearing Calculations'!A967=\"\",\"\",'Clearing Calculations'!A967)","v":""},{"$f":"IF('Clearing Calculations'!A967,'Clearing Calculations'!B967,\"\")","v":""},{"$f":"IF('Clearing Calculations'!B967,'Clearing Calculations'!C967,\"\")","v":""},"","","",""]
[{"$f":"IF('Clearing Calculations'!A968=\"\",\"\",'Clearing Calculations'!A968)","v":""},{"$f":"IF('Clearing Calculations'!A968,'Clearing Calculations'!B968,\"\")","v":""},{"$f":"IF('Clearing Calculations'!B968,'Clearing Calculations'!C968,\"\")","v":""},"","","",""]
[{"$f":"IF('Clearing Calculations'!A969=\"\",\"\",'Clearing Calculations'!A969)","v":""},{"$f":"IF('Clearing Calculations'!A969,'Clearing Calculations'!B969,\"\")","v":""},{"$f":"IF('Clearing Calculations'!B969,'Clearing Calculations'!C969,\"\")","v":""},"","","",""]
[{"$f":"IF('Clearing Calculations'!A970=\"\",\"\",'Clearing Calculations'!A970)","v":""},{"$f":"IF('Clearing Calculations'!A970,'Clearing Calculations'!B970,\"\")","v":""},{"$f":"IF('Clearing Calculations'!B970,'Clearing Calculations'!C970,\"\")","v":""},"","","",""]
[{"$f":"IF('Clearing Calculations'!A971=\"\",\"\",'Clearing Calculations'!A971)","v":""},{"$f":"IF('Clearing Calculations'!A971,'Clearing Calculations'!B971,\"\")","v":""},{"$f":"IF('Clearing Calculations'!B971,'Clearing Calculations'!C971,\"\")","v":""},"","","",""]
[{"$f":"IF('Clearing Calculations'!A972=\"\",\"\",'Clearing Calculations'!A972)","v":""},{"$f":"IF('Clearing Calculations'!A972,'Clearing Calculations'!B972,\"\")","v":""},{"$f":"IF('Clearing Calculations'!B972,'Clearing Calculations'!C972,\"\")","v":""},"","","",""]
[{"$f":"IF('Clearing Calculations'!A973=\"\",\"\",'Clearing Calculations'!A973)","v":""},{"$f":"IF('Clearing Calculations'!A973,'Clearing Calculations'!B973,\"\")","v":""},{"$f":"IF('Clearing Calculations'!B973,'Clearing Calculations'!C973,\"\")","v":""},"","","",""]
[{"$f":"IF('Clearing Calculations'!A974=\"\",\"\",'Clearing Calculations'!A974)","v":""},{"$f":"IF('Clearing Calculations'!A974,'Clearing Calculations'!B974,\"\")","v":""},{"$f":"IF('Clearing Calculations'!B974,'Clearing Calculations'!C974,\"\")","v":""},"","","",""]
[{"$f":"IF('Clearing Calculations'!A975=\"\",\"\",'Clearing Calculations'!A975)","v":""},{"$f":"IF('Clearing Calculations'!A975,'Clearing Calculations'!B975,\"\")","v":""},{"$f":"IF('Clearing Calculations'!B975,'Clearing Calculations'!C975,\"\")","v":""},"","","",""]
[{"$f":"IF('Clearing Calculations'!A976=\"\",\"\",'Clearing Calculations'!A976)","v":""},{"$f":"IF('Clearing Calculations'!A976,'Clearing Calculations'!B976,\"\")","v":""},{"$f":"IF('Clearing Calculations'!B976,'Clearing Calculations'!C976,\"\")","v":""},"","","",""]
[{"$f":"IF('Clearing Calculations'!A977=\"\",\"\",'Clearing Calculations'!A977)","v":""},{"$f":"IF('Clearing Calculations'!A977,'Clearing Calculations'!B977,\"\")","v":""},{"$f":"IF('Clearing Calculations'!B977,'Clearing Calculations'!C977,\"\")","v":""},"","","",""]
[{"$f":"IF('Clearing Calculations'!A978=\"\",\"\",'Clearing Calculations'!A978)","v":""},{"$f":"IF('Clearing Calculations'!A978,'Clearing Calculations'!B978,\"\")","v":""},{"$f":"IF('Clearing Calculations'!B978,'Clearing Calculations'!C978,\"\")","v":""},"","","",""]
[{"$f":"IF('Clearing Calculations'!A979=\"\",\"\",'Clearing Calculations'!A979)","v":""},{"$f":"IF('Clearing Calculations'!A979,'Clearing Calculations'!B979,\"\")","v":""},{"$f":"IF('Clearing Calculations'!B979,'Clearing Calculations'!C979,\"\")","v":""},"","","",""]
[{"$f":"IF('Clearing Calculations'!A980=\"\",\"\",'Clearing Calculations'!A980)","v":""},{"$f":"IF('Clearing Calculations'!A980,'Clearing Calculations'!B980,\"\")","v":""},{"$f":"IF('Clearing Calculations'!B980,'Clearing Calculations'!C980,\"\")","v":""},"","","",""]
[{"$f":"IF('Clearing Calculations'!A981=\"\",\"\",'Clearing Calculations'!A981)","v":""},{"$f":"IF('Clearing Calculations'!A981,'Clearing Calculations'!B981,\"\")","v":""},{"$f":"IF('Clearing Calculations'!B981,'Clearing Calculations'!C981,\"\")","v":""},"","","",""]
[{"$f":"IF('Clearing Calculations'!A982=\"\",\"\",'Clearing Calculations'!A982)","v":""},{"$f":"IF('Clearing Calculations'!A982,'Clearing Calculations'!B982,\"\")","v":""},{"$f":"IF('Clearing Calculations'!B982,'Clearing Calculations'!C982,\"\")","v":""},"","","",""]
[{"$f":"IF('Clearing Calculations'!A983=\"\",\"\",'Clearing Calculations'!A983)","v":""},{"$f":"IF('Clearing Calculations'!A983,'Clearing Calculations'!B983,\"\")","v":""},{"$f":"IF('Clearing Calculations'!B983,'Clearing Calculations'!C983,\"\")","v":""},"","","",""]
[{"$f":"IF('Clearing Calculations'!A984=\"\",\"\",'Clearing Calculations'!A984)","v":""},{"$f":"IF('Clearing Calculations'!A984,'Clearing Calculations'!B984,\"\")","v":""},{"$f":"IF('Clearing Calculations'!B984,'Clearing Calculations'!C984,\"\")","v":""},"","","",""]
[{"$f":"IF('Clearing Calculations'!A985=\"\",\"\",'Clearing Calculations'!A985)","v":""},{"$f":"IF('Clearing Calculations'!A985,'Clearing Calculations'!B985,\"\")","v":""},{"$f":"IF('Clearing Calculations'!B985,'Clearing Calculations'!C985,\"\")","v":""},"","","",""]
[{"$f":"IF('Clearing Calculations'!A986=\"\",\"\",'Clearing Calculations'!A986)","v":""},{"$f":"IF('Clearing Calculations'!A986,'Clearing Calculations'!B986,\"\")","v":""},{"$f":"IF('Clearing Calculations'!B986,'Clearing Calculations'!C986,\"\")","v":""},"","","",""]
[{"$f":"IF('Clearing Calculations'!A987=\"\",\"\",'Clearing Calculations'!A987)","v":""},{"$f":"IF('Clearing Calculations'!A987,'Clearing Calculations'!B987,\"\")","v":""},{"$f":"IF('Clearing Calculations'!B987,'Clearing Calculations'!C987,\"\")","v":""},"","","",""]
[{"$f":"IF('Clearing Calculations'!A988=\"\",\"\",'Clearing Calculations'!A988)","v":""},{"$f":"IF('Clearing Calculations'!A988,'Clearing Calculations'!B988,\"\")","v":""},{"$f":"IF('Clearing Calculations'!B988,'Clearing Calculations'!C988,\"\")","v":""},"","","",""]
[{"$f":"IF('Clearing Calculations'!A989=\"\",\"\",'Clearing Calculations'!A989)","v":""},{"$f":"IF('Clearing Calculations'!A989,'Clearing Calculations'!B989,\"\")","v":""},{"$f":"IF('Clearing Calculations'!B989,'Clearing Calculations'!C989,\"\")","v":""},"","","",""]
[{"$f":"IF('Clearing Calculations'!A990=\"\",\"\",'Clearing Calculations'!A990)","v":""},{"$f":"IF('Clearing Calculations'!A990,'Clearing Calculations'!B990,\"\")","v":""},{"$f":"IF('Clearing Calculations'!B990,'Clearing Calculations'!C990,\"\")","v":""},"","","",""]
[{"$f":"IF('Clearing Calculations'!A991=\"\",\"\",'Clearing Calculations'!A991)","v":""},{"$f":"IF('Clearing Calculations'!A991,'Clearing Calculations'!B991,\"\")","v":""},{"$f":"IF('Clearing Calculations'!B991,'Clearing Calculations'!C991,\"\")","v":""},"","","",""]
[{"$f":"IF('Clearing Calculations'!A992=\"\",\"\",'Clearing Calculations'!A992)","v":""},{"$f":"IF('Clearing Calculations'!A992,'Clearing Calculations'!B992,\"\")","v":""},{"$f":"IF('Clearing Calculations'!B992,'Clearing Calculations'!C992,\"\")","v":""},"","","",""]
[{"$f":"IF('Clearing Calculations'!A993=\"\",\"\",'Clearing Calculations'!A993)","v":""},{"$f":"IF('Clearing Calculations'!A993,'Clearing Calculations'!B993,\"\")","v":""},{"$f":"IF('Clearing Calculations'!B993,'Clearing Calculations'!C993,\"\")","v":""},"","","",""]
[{"$f":"IF('Clearing Calculations'!A994=\"\",\"\",'Clearing Calculations'!A994)","v":""},{"$f":"IF('Clearing Calculations'!A994,'Clearing Calculations'!B994,\"\")","v":""},{"$f":"IF('Clearing Calculations'!B994,'Clearing Calculations'!C994,\"\")","v":""},"","","",""]
[{"$f":"IF('Clearing Calculations'!A995=\"\",\"\",'Clearing Calculations'!A995)","v":""},{"$f":"IF('Clearing Calculations'!A995,'Clearing Calculations'!B995,\"\")","v":""},{"$f":"IF('Clearing Calculations'!B995,'Clearing Calculations'!C995,\"\")","v":""},"","","",""]
[{"$f":"IF('Clearing Calculations'!A996=\"\",\"\",'Clearing Calculations'!A996)","v":""},{"$f":"IF('Clearing Calculations'!A996,'Clearing Calculations'!B996,\"\")","v":""},{"$f":"IF('Clearing Calculations'!B996,'Clearing Calculations'!C996,\"\")","v":""},"","","",""]
[{"$f":"IF('Clearing Calculations'!A997=\"\",\"\",'Clearing Calculations'!A997)","v":""},{"$f":"IF('Clearing Calculations'!A997,'Clearing Calculations'!B997,\"\")","v":""},{"$f":"IF('Clearing Calculations'!B997,'Clearing Calculations'!C997,\"\")","v":""},"","","",""]
[{"$f":"IF('Clearing Calculations'!A998=\"\",\"\",'Clearing Calculations'!A998)","v":""},{"$f":"IF('Clearing Calculations'!A998,'Clearing Calculations'!B998,\"\")","v":""},{"$f":"IF('Clearing Calculations'!B998,'Clearing Calculations'!C998,\"\")","v":""},"","","",""]
[{"$f":"IF('Clearing Calculations'!A999=\"\",\"\",'Clearing Calculations'!A999)","v":""},{"$f":"IF('Clearing Calculations'!A999,'Clearing Calculations'!B999,\"\")","v":""},{"$f":"IF('Clearing Calculations'!B999,'Clearing Calculations'!C999,\"\")","v":""},"","","",""]
[{"$f":"IF('Clearing Calculations'!A1000=\"\",\"\",'Clearing Calculations'!A1000)","v":""},{"$f":"IF('Clearing Calculations'!A1000,'Clearing Calculations'!B1000,\"\")","v":""},{"$f":"IF('Clearing Calculations'!B1000,'Clearing Calculations'!C1000,\"\")","v":""},"","","",""]
[{"$f":"IF('Clearing Calculations'!A1001=\"\",\"\",'Clearing Calculations'!A1001)","v":""},{"$f":"IF('Clearing Calculations'!A1001,'Clearing Calculations'!B1001,\"\")","v":""},{"$f":"IF('Clearing Calculations'!B1001,'Clearing Calculations'!C1001,\"\")","v":""},"","","",""]
[{"$f":"IF('Clearing Calculations'!A1002=\"\",\"\",'Clearing Calculations'!A1002)","v":""},{"$f":"IF('Clearing Calculations'!A1002,'Clearing Calculations'!B1002,\"\")","v":""},{"$f":"IF('Clearing Calculations'!B1002,'Clearing Calculations'!C1002,\"\")","v":""},"","","",""]
[{"$f":"IF('Clearing Calculations'!A1003=\"\",\"\",'Clearing Calculations'!A1003)","v":""},{"$f":"IF('Clearing Calculations'!A1003,'Clearing Calculations'!B1003,\"\")","v":""},{"$f":"IF('Clearing Calculations'!B1003,'Clearing Calculations'!C1003,\"\")","v":""},"","","",""]
[{"$f":"IF('Clearing Calculations'!A1004=\"\",\"\",'Clearing Calculations'!A1004)","v":""},{"$f":"IF('Clearing Calculations'!A1004,'Clearing Calculations'!B1004,\"\")","v":""},{"$f":"IF('Clearing Calculations'!B1004,'Clearing Calculations'!C1004,\"\")","v":""},{"$f":"IF(A1010=\"\",\"\",$B1010+$C1010)","v":""},{"$f":"IF(A1010=\"\",\"\",(D1010+D1009)/2*(A1010-A1009))","v":""},{"$f":"IF(A1010=\"\",\"\",(E1010/9))","v":""},{"$f":"IF(A1010=\"\",\"\",E1010/$G$3)","v":""}]
[{"$f":"IF('Clearing Calculations'!A1005=\"\",\"\",'Clearing Calculations'!A1005)","v":""},{"$f":"IF('Clearing Calculations'!A1005,'Clearing Calculations'!B1005,\"\")","v":""},{"$f":"IF('Clearing Calculations'!B1005,'Clearing Calculations'!C1005,\"\")","v":""},"","","",""]
[{"$f":"IF('Clearing Calculations'!A1006=\"\",\"\",'Clearing Calculations'!A1006)","v":""},{"$f":"IF('Clearing Calculations'!A1006,'Clearing Calculations'!B1006,\"\")","v":""},{"$f":"IF('Clearing Calculations'!B1006,'Clearing Calculations'!C1006,\"\")","v":""},"","","",""]
[{"$f":"IF('Clearing Calculations'!A1007=\"\",\"\",'Clearing Calculations'!A1007)","v":""},{"$f":"IF('Clearing Calculations'!A1007,'Clearing Calculations'!B1007,\"\")","v":""},{"$f":"IF('Clearing Calculations'!B1007,'Clearing Calculations'!C1007,\"\")","v":""},"","","",""]
[{"$f":"IF('Clearing Calculations'!A1008=\"\",\"\",'Clearing Calculations'!A1008)","v":""},{"$f":"IF('Clearing Calculations'!A1008,'Clearing Calculations'!B1008,\"\")","v":""},{"$f":"IF('Clearing Calculations'!B1008,'Clearing Calculations'!C1008,\"\")","v":""},"","","",""]
[{"$f":"IF('Clearing Calculations'!A1009=\"\",\"\",'Clearing Calculations'!A1009)","v":""},{"$f":"IF('Clearing Calculations'!A1009,'Clearing Calculations'!B1009,\"\")","v":""},{"$f":"IF('Clearing Calculations'!B1009,'Clearing Calculations'!C1009,\"\")","v":""},"","","",""]
[{"$f":"IF('Clearing Calculations'!A1010=\"\",\"\",'Clearing Calculations'!A1010)","v":""},{"$f":"IF('Clearing Calculations'!A1010,'Clearing Calculations'!B1010,\"\")","v":""},{"$f":"IF('Clearing Calculations'!B1010,'Clearing Calculations'!C1010,\"\")","v":""},"","","",""]
[{"$f":"IF('Clearing Calculations'!A1011=\"\",\"\",'Clearing Calculations'!A1011)","v":""},{"$f":"IF('Clearing Calculations'!A1011,'Clearing Calculations'!B1011,\"\")","v":""},{"$f":"IF('Clearing Calculations'!B1011,'Clearing Calculations'!C1011,\"\")","v":""},"","","",""]
[{"$f":"IF('Clearing Calculations'!A1012=\"\",\"\",'Clearing Calculations'!A1012)","v":""},{"$f":"IF('Clearing Calculations'!A1012,'Clearing Calculations'!B1012,\"\")","v":""},{"$f":"IF('Clearing Calculations'!B1012,'Clearing Calculations'!C1012,\"\")","v":""},"","","",""]
[{"$f":"IF('Clearing Calculations'!A1013=\"\",\"\",'Clearing Calculations'!A1013)","v":""},{"$f":"IF('Clearing Calculations'!A1013,'Clearing Calculations'!B1013,\"\")","v":""},{"$f":"IF('Clearing Calculations'!B1013,'Clearing Calculations'!C1013,\"\")","v":""},"","","",""]
[{"$f":"IF('Clearing Calculations'!A1014=\"\",\"\",'Clearing Calculations'!A1014)","v":""},{"$f":"IF('Clearing Calculations'!A1014,'Clearing Calculations'!B1014,\"\")","v":""},{"$f":"IF('Clearing Calculations'!B1014,'Clearing Calculations'!C1014,\"\")","v":""},"","","",""]
[{"$f":"IF('Clearing Calculations'!A1015=\"\",\"\",'Clearing Calculations'!A1015)","v":""},{"$f":"IF('Clearing Calculations'!A1015,'Clearing Calculations'!B1015,\"\")","v":""},{"$f":"IF('Clearing Calculations'!B1015,'Clearing Calculations'!C1015,\"\")","v":""},"","","",""]
[{"$f":"IF('Clearing Calculations'!A1016=\"\",\"\",'Clearing Calculations'!A1016)","v":""},{"$f":"IF('Clearing Calculations'!A1016,'Clearing Calculations'!B1016,\"\")","v":""},{"$f":"IF('Clearing Calculations'!B1016,'Clearing Calculations'!C1016,\"\")","v":""},"","","",""]
[{"$f":"IF('Clearing Calculations'!A1017=\"\",\"\",'Clearing Calculations'!A1017)","v":""},{"$f":"IF('Clearing Calculations'!A1017,'Clearing Calculations'!B1017,\"\")","v":""},{"$f":"IF('Clearing Calculations'!B1017,'Clearing Calculations'!C1017,\"\")","v":""},"","","",""]
[{"$f":"IF('Clearing Calculations'!A1018=\"\",\"\",'Clearing Calculations'!A1018)","v":""},{"$f":"IF('Clearing Calculations'!A1018,'Clearing Calculations'!B1018,\"\")","v":""},{"$f":"IF('Clearing Calculations'!B1018,'Clearing Calculations'!C1018,\"\")","v":""},"","","",""]
[{"$f":"IF('Clearing Calculations'!A1019=\"\",\"\",'Clearing Calculations'!A1019)","v":""},{"$f":"IF('Clearing Calculations'!A1019,'Clearing Calculations'!B1019,\"\")","v":""},{"$f":"IF('Clearing Calculations'!B1019,'Clearing Calculations'!C1019,\"\")","v":""},"","","",""]
[{"$f":"IF('Clearing Calculations'!A1020=\"\",\"\",'Clearing Calculations'!A1020)","v":""},{"$f":"IF('Clearing Calculations'!A1020,'Clearing Calculations'!B1020,\"\")","v":""},{"$f":"IF('Clearing Calculations'!B1020,'Clearing Calculations'!C1020,\"\")","v":""},"","","",""]
[{"$f":"IF('Clearing Calculations'!A1021=\"\",\"\",'Clearing Calculations'!A1021)","v":""},{"$f":"IF('Clearing Calculations'!A1021,'Clearing Calculations'!B1021,\"\")","v":""},{"$f":"IF('Clearing Calculations'!B1021,'Clearing Calculations'!C1021,\"\")","v":""},"","","",""]
[{"$f":"IF('Clearing Calculations'!A1022=\"\",\"\",'Clearing Calculations'!A1022)","v":""},{"$f":"IF('Clearing Calculations'!A1022,'Clearing Calculations'!B1022,\"\")","v":""},{"$f":"IF('Clearing Calculations'!B1022,'Clearing Calculations'!C1022,\"\")","v":""},"","","",""]
[{"$f":"IF('Clearing Calculations'!A1023=\"\",\"\",'Clearing Calculations'!A1023)","v":""},{"$f":"IF('Clearing Calculations'!A1023,'Clearing Calculations'!B1023,\"\")","v":""},{"$f":"IF('Clearing Calculations'!B1023,'Clearing Calculations'!C1023,\"\")","v":""},"","","",""]
[{"$f":"IF('Clearing Calculations'!A1024=\"\",\"\",'Clearing Calculations'!A1024)","v":""},{"$f":"IF('Clearing Calculations'!A1024,'Clearing Calculations'!B1024,\"\")","v":""},{"$f":"IF('Clearing Calculations'!B1024,'Clearing Calculations'!C1024,\"\")","v":""},"","","",""]
[{"$f":"IF('Clearing Calculations'!A1025=\"\",\"\",'Clearing Calculations'!A1025)","v":""},{"$f":"IF('Clearing Calculations'!A1025,'Clearing Calculations'!B1025,\"\")","v":""},{"$f":"IF('Clearing Calculations'!B1025,'Clearing Calculations'!C1025,\"\")","v":""},"","","",""]
[{"$f":"IF('Clearing Calculations'!A1026=\"\",\"\",'Clearing Calculations'!A1026)","v":""},{"$f":"IF('Clearing Calculations'!A1026,'Clearing Calculations'!B1026,\"\")","v":""},{"$f":"IF('Clearing Calculations'!B1026,'Clearing Calculations'!C1026,\"\")","v":""},"","","",""]
[{"$f":"IF('Clearing Calculations'!A1027=\"\",\"\",'Clearing Calculations'!A1027)","v":""},{"$f":"IF('Clearing Calculations'!A1027,'Clearing Calculations'!B1027,\"\")","v":""},{"$f":"IF('Clearing Calculations'!B1027,'Clearing Calculations'!C1027,\"\")","v":""},"","","",""]
[{"$f":"IF('Clearing Calculations'!A1028=\"\",\"\",'Clearing Calculations'!A1028)","v":""},{"$f":"IF('Clearing Calculations'!A1028,'Clearing Calculations'!B1028,\"\")","v":""},{"$f":"IF('Clearing Calculations'!B1028,'Clearing Calculations'!C1028,\"\")","v":""},"","","",""]
[{"$f":"IF('Clearing Calculations'!A1029=\"\",\"\",'Clearing Calculations'!A1029)","v":""},{"$f":"IF('Clearing Calculations'!A1029,'Clearing Calculations'!B1029,\"\")","v":""},{"$f":"IF('Clearing Calculations'!B1029,'Clearing Calculations'!C1029,\"\")","v":""},"","","",""]
[{"$f":"IF('Clearing Calculations'!A1030=\"\",\"\",'Clearing Calculations'!A1030)","v":""},{"$f":"IF('Clearing Calculations'!A1030,'Clearing Calculations'!B1030,\"\")","v":""},{"$f":"IF('Clearing Calculations'!B1030,'Clearing Calculations'!C1030,\"\")","v":""},"","","",""]
[{"$f":"IF('Clearing Calculations'!A1031=\"\",\"\",'Clearing Calculations'!A1031)","v":""},{"$f":"IF('Clearing Calculations'!A1031,'Clearing Calculations'!B1031,\"\")","v":""},{"$f":"IF('Clearing Calculations'!B1031,'Clearing Calculations'!C1031,\"\")","v":""},"","","",""]
[{"$f":"IF('Clearing Calculations'!A1032=\"\",\"\",'Clearing Calculations'!A1032)","v":""},{"$f":"IF('Clearing Calculations'!A1032,'Clearing Calculations'!B1032,\"\")","v":""},{"$f":"IF('Clearing Calculations'!B1032,'Clearing Calculations'!C1032,\"\")","v":""},"","","",""]
[{"$f":"IF('Clearing Calculations'!A1033=\"\",\"\",'Clearing Calculations'!A1033)","v":""},{"$f":"IF('Clearing Calculations'!A1033,'Clearing Calculations'!B1033,\"\")","v":""},{"$f":"IF('Clearing Calculations'!B1033,'Clearing Calculations'!C1033,\"\")","v":""},"","","",""]
[{"$f":"IF('Clearing Calculations'!A1034=\"\",\"\",'Clearing Calculations'!A1034)","v":""},{"$f":"IF('Clearing Calculations'!A1034,'Clearing Calculations'!B1034,\"\")","v":""},{"$f":"IF('Clearing Calculations'!B1034,'Clearing Calculations'!C1034,\"\")","v":""},"","","",""]
[{"$f":"IF('Clearing Calculations'!A1035=\"\",\"\",'Clearing Calculations'!A1035)","v":""},{"$f":"IF('Clearing Calculations'!A1035,'Clearing Calculations'!B1035,\"\")","v":""},{"$f":"IF('Clearing Calculations'!B1035,'Clearing Calculations'!C1035,\"\")","v":""},"","","",""]
[{"$f":"IF('Clearing Calculations'!A1036=\"\",\"\",'Clearing Calculations'!A1036)","v":""},{"$f":"IF('Clearing Calculations'!A1036,'Clearing Calculations'!B1036,\"\")","v":""},{"$f":"IF('Clearing Calculations'!B1036,'Clearing Calculations'!C1036,\"\")","v":""},"","","",""]
[{"$f":"IF('Clearing Calculations'!A1037=\"\",\"\",'Clearing Calculations'!A1037)","v":""},{"$f":"IF('Clearing Calculations'!A1037,'Clearing Calculations'!B1037,\"\")","v":""},{"$f":"IF('Clearing Calculations'!B1037,'Clearing Calculations'!C1037,\"\")","v":""},"","","",""]
[{"$f":"IF('Clearing Calculations'!A1038=\"\",\"\",'Clearing Calculations'!A1038)","v":""},{"$f":"IF('Clearing Calculations'!A1038,'Clearing Calculations'!B1038,\"\")","v":""},{"$f":"IF('Clearing Calculations'!B1038,'Clearing Calculations'!C1038,\"\")","v":""},"","","",""]
[{"$f":"IF('Clearing Calculations'!A1039=\"\",\"\",'Clearing Calculations'!A1039)","v":""},{"$f":"IF('Clearing Calculations'!A1039,'Clearing Calculations'!B1039,\"\")","v":""},{"$f":"IF('Clearing Calculations'!B1039,'Clearing Calculations'!C1039,\"\")","v":""},"","","",""]
[{"$f":"IF('Clearing Calculations'!A1040=\"\",\"\",'Clearing Calculations'!A1040)","v":""},{"$f":"IF('Clearing Calculations'!A1040,'Clearing Calculations'!B1040,\"\")","v":""},{"$f":"IF('Clearing Calculations'!B1040,'Clearing Calculations'!C1040,\"\")","v":""},"","","",""]
[{"$f":"IF('Clearing Calculations'!A1041=\"\",\"\",'Clearing Calculations'!A1041)","v":""},{"$f":"IF('Clearing Calculations'!A1041,'Clearing Calculations'!B1041,\"\")","v":""},{"$f":"IF('Clearing Calculations'!B1041,'Clearing Calculations'!C1041,\"\")","v":""},"","","",""]
[{"$f":"IF('Clearing Calculations'!A1042=\"\",\"\",'Clearing Calculations'!A1042)","v":""},{"$f":"IF('Clearing Calculations'!A1042,'Clearing Calculations'!B1042,\"\")","v":""},{"$f":"IF('Clearing Calculations'!B1042,'Clearing Calculations'!C1042,\"\")","v":""},"","","",""]
[{"$f":"IF('Clearing Calculations'!A1043=\"\",\"\",'Clearing Calculations'!A1043)","v":""},{"$f":"IF('Clearing Calculations'!A1043,'Clearing Calculations'!B1043,\"\")","v":""},{"$f":"IF('Clearing Calculations'!B1043,'Clearing Calculations'!C1043,\"\")","v":""},"","","",""]
[{"$f":"IF('Clearing Calculations'!A1044=\"\",\"\",'Clearing Calculations'!A1044)","v":""},{"$f":"IF('Clearing Calculations'!A1044,'Clearing Calculations'!B1044,\"\")","v":""},{"$f":"IF('Clearing Calculations'!B1044,'Clearing Calculations'!C1044,\"\")","v":""},"","","",""]
[{"$f":"IF('Clearing Calculations'!A1045=\"\",\"\",'Clearing Calculations'!A1045)","v":""},{"$f":"IF('Clearing Calculations'!A1045,'Clearing Calculations'!B1045,\"\")","v":""},{"$f":"IF('Clearing Calculations'!B1045,'Clearing Calculations'!C1045,\"\")","v":""},"","","",""]
[{"$f":"IF('Clearing Calculations'!A1046=\"\",\"\",'Clearing Calculations'!A1046)","v":""},{"$f":"IF('Clearing Calculations'!A1046,'Clearing Calculations'!B1046,\"\")","v":""},{"$f":"IF('Clearing Calculations'!B1046,'Clearing Calculations'!C1046,\"\")","v":""},"","","",""]
[{"$f":"IF('Clearing Calculations'!A1047=\"\",\"\",'Clearing Calculations'!A1047)","v":""},{"$f":"IF('Clearing Calculations'!A1047,'Clearing Calculations'!B1047,\"\")","v":""},{"$f":"IF('Clearing Calculations'!B1047,'Clearing Calculations'!C1047,\"\")","v":""},"","","",""]
[{"$f":"IF('Clearing Calculations'!A1048=\"\",\"\",'Clearing Calculations'!A1048)","v":""},{"$f":"IF('Clearing Calculations'!A1048,'Clearing Calculations'!B1048,\"\")","v":""},{"$f":"IF('Clearing Calculations'!B1048,'Clearing Calculations'!C1048,\"\")","v":""},"","","",""]
[{"$f":"IF('Clearing Calculations'!A1049=\"\",\"\",'Clearing Calculations'!A1049)","v":""},{"$f":"IF('Clearing Calculations'!A1049,'Clearing Calculations'!B1049,\"\")","v":""},{"$f":"IF('Clearing Calculations'!B1049,'Clearing Calculations'!C1049,\"\")","v":""},"","","",""]
[{"$f":"IF('Clearing Calculations'!A1050=\"\",\"\",'Clearing Calculations'!A1050)","v":""},{"$f":"IF('Clearing Calculations'!A1050,'Clearing Calculations'!B1050,\"\")","v":""},{"$f":"IF('Clearing Calculations'!B1050,'Clearing Calculations'!C1050,\"\")","v":""},"","","",""]
[{"$f":"IF('Clearing Calculations'!A1051=\"\",\"\",'Clearing Calculations'!A1051)","v":""},{"$f":"IF('Clearing Calculations'!A1051,'Clearing Calculations'!B1051,\"\")","v":""},{"$f":"IF('Clearing Calculations'!B1051,'Clearing Calculations'!C1051,\"\")","v":""},"","","",""]
[{"$f":"IF('Clearing Calculations'!A1052=\"\",\"\",'Clearing Calculations'!A1052)","v":""},{"$f":"IF('Clearing Calculations'!A1052,'Clearing Calculations'!B1052,\"\")","v":""},{"$f":"IF('Clearing Calculations'!B1052,'Clearing Calculations'!C1052,\"\")","v":""},"","","",""]
[{"$f":"IF('Clearing Calculations'!A1053=\"\",\"\",'Clearing Calculations'!A1053)","v":""},{"$f":"IF('Clearing Calculations'!A1053,'Clearing Calculations'!B1053,\"\")","v":""},{"$f":"IF('Clearing Calculations'!B1053,'Clearing Calculations'!C1053,\"\")","v":""},"","","",""]
[{"$f":"IF('Clearing Calculations'!A1054=\"\",\"\",'Clearing Calculations'!A1054)","v":""},{"$f":"IF('Clearing Calculations'!A1054,'Clearing Calculations'!B1054,\"\")","v":""},{"$f":"IF('Clearing Calculations'!B1054,'Clearing Calculations'!C1054,\"\")","v":""},"","","",""]
[{"$f":"IF('Clearing Calculations'!A1055=\"\",\"\",'Clearing Calculations'!A1055)","v":""},{"$f":"IF('Clearing Calculations'!A1055,'Clearing Calculations'!B1055,\"\")","v":""},{"$f":"IF('Clearing Calculations'!B1055,'Clearing Calculations'!C1055,\"\")","v":""},"","","",""]
[{"$f":"IF('Clearing Calculations'!A1056=\"\",\"\",'Clearing Calculations'!A1056)","v":""},{"$f":"IF('Clearing Calculations'!A1056,'Clearing Calculations'!B1056,\"\")","v":""},{"$f":"IF('Clearing Calculations'!B1056,'Clearing Calculations'!C1056,\"\")","v":""},"","","",""]
[{"$f":"IF('Clearing Calculations'!A1057=\"\",\"\",'Clearing Calculations'!A1057)","v":""},{"$f":"IF('Clearing Calculations'!A1057,'Clearing Calculations'!B1057,\"\")","v":""},{"$f":"IF('Clearing Calculations'!B1057,'Clearing Calculations'!C1057,\"\")","v":""},"","","",""]
[{"$f":"IF('Clearing Calculations'!A1058=\"\",\"\",'Clearing Calculations'!A1058)","v":""},{"$f":"IF('Clearing Calculations'!A1058,'Clearing Calculations'!B1058,\"\")","v":""},{"$f":"IF('Clearing Calculations'!B1058,'Clearing Calculations'!C1058,\"\")","v":""},"","","",""]
[{"$f":"IF('Clearing Calculations'!A1059=\"\",\"\",'Clearing Calculations'!A1059)","v":""},{"$f":"IF('Clearing Calculations'!A1059,'Clearing Calculations'!B1059,\"\")","v":""},{"$f":"IF('Clearing Calculations'!B1059,'Clearing Calculations'!C1059,\"\")","v":""},"","","",""]
[{"$f":"IF('Clearing Calculations'!A1060=\"\",\"\",'Clearing Calculations'!A1060)","v":""},{"$f":"IF('Clearing Calculations'!A1060,'Clearing Calculations'!B1060,\"\")","v":""},{"$f":"IF('Clearing Calculations'!B1060,'Clearing Calculations'!C1060,\"\")","v":""},"","","",""]
[{"$f":"IF('Clearing Calculations'!A1061=\"\",\"\",'Clearing Calculations'!A1061)","v":""},{"$f":"IF('Clearing Calculations'!A1061,'Clearing Calculations'!B1061,\"\")","v":""},{"$f":"IF('Clearing Calculations'!B1061,'Clearing Calculations'!C1061,\"\")","v":""},"","","",""]
[{"$f":"IF('Clearing Calculations'!A1062=\"\",\"\",'Clearing Calculations'!A1062)","v":""},{"$f":"IF('Clearing Calculations'!A1062,'Clearing Calculations'!B1062,\"\")","v":""},{"$f":"IF('Clearing Calculations'!B1062,'Clearing Calculations'!C1062,\"\")","v":""},"","","",""]
[{"$f":"IF('Clearing Calculations'!A1063=\"\",\"\",'Clearing Calculations'!A1063)","v":""},{"$f":"IF('Clearing Calculations'!A1063,'Clearing Calculations'!B1063,\"\")","v":""},{"$f":"IF('Clearing Calculations'!B1063,'Clearing Calculations'!C1063,\"\")","v":""},"","","",""]
[{"$f":"IF('Clearing Calculations'!A1064=\"\",\"\",'Clearing Calculations'!A1064)","v":""},{"$f":"IF('Clearing Calculations'!A1064,'Clearing Calculations'!B1064,\"\")","v":""},{"$f":"IF('Clearing Calculations'!B1064,'Clearing Calculations'!C1064,\"\")","v":""},"","","",""]
[{"$f":"IF('Clearing Calculations'!A1065=\"\",\"\",'Clearing Calculations'!A1065)","v":""},{"$f":"IF('Clearing Calculations'!A1065,'Clearing Calculations'!B1065,\"\")","v":""},{"$f":"IF('Clearing Calculations'!B1065,'Clearing Calculations'!C1065,\"\")","v":""},"","","",""]
[{"$f":"IF('Clearing Calculations'!A1066=\"\",\"\",'Clearing Calculations'!A1066)","v":""},{"$f":"IF('Clearing Calculations'!A1066,'Clearing Calculations'!B1066,\"\")","v":""},{"$f":"IF('Clearing Calculations'!B1066,'Clearing Calculations'!C1066,\"\")","v":""},"","","",""]
[{"$f":"IF('Clearing Calculations'!A1067=\"\",\"\",'Clearing Calculations'!A1067)","v":""},{"$f":"IF('Clearing Calculations'!A1067,'Clearing Calculations'!B1067,\"\")","v":""},{"$f":"IF('Clearing Calculations'!B1067,'Clearing Calculations'!C1067,\"\")","v":""},"","","",""]
[{"$f":"IF('Clearing Calculations'!A1068=\"\",\"\",'Clearing Calculations'!A1068)","v":""},{"$f":"IF('Clearing Calculations'!A1068,'Clearing Calculations'!B1068,\"\")","v":""},{"$f":"IF('Clearing Calculations'!B1068,'Clearing Calculations'!C1068,\"\")","v":""},{"$f":"IF(A1074=\"\",\"\",$B1074+$C1074)","v":""},{"$f":"IF(A1074=\"\",\"\",(D1074+D1073)/2*(A1074-A1073))","v":""},{"$f":"IF(A1074=\"\",\"\",(E1074/9))","v":""},{"$f":"IF(A1074=\"\",\"\",E1074/$G$3)","v":""}]
[{"$f":"IF('Clearing Calculations'!A1069=\"\",\"\",'Clearing Calculations'!A1069)","v":""},{"$f":"IF('Clearing Calculations'!A1069,'Clearing Calculations'!B1069,\"\")","v":""},{"$f":"IF('Clearing Calculations'!B1069,'Clearing Calculations'!C1069,\"\")","v":""},"","","",""]
[{"$f":"IF('Clearing Calculations'!A1070=\"\",\"\",'Clearing Calculations'!A1070)","v":""},{"$f":"IF('Clearing Calculations'!A1070,'Clearing Calculations'!B1070,\"\")","v":""},{"$f":"IF('Clearing Calculations'!B1070,'Clearing Calculations'!C1070,\"\")","v":""},"","","",""]
[{"$f":"IF('Clearing Calculations'!A1071=\"\",\"\",'Clearing Calculations'!A1071)","v":""},{"$f":"IF('Clearing Calculations'!A1071,'Clearing Calculations'!B1071,\"\")","v":""},{"$f":"IF('Clearing Calculations'!B1071,'Clearing Calculations'!C1071,\"\")","v":""},"","","",""]
[{"$f":"IF('Clearing Calculations'!A1072=\"\",\"\",'Clearing Calculations'!A1072)","v":""},{"$f":"IF('Clearing Calculations'!A1072,'Clearing Calculations'!B1072,\"\")","v":""},{"$f":"IF('Clearing Calculations'!B1072,'Clearing Calculations'!C1072,\"\")","v":""},"","","",""]
[{"$f":"IF('Clearing Calculations'!A1073=\"\",\"\",'Clearing Calculations'!A1073)","v":""},{"$f":"IF('Clearing Calculations'!A1073,'Clearing Calculations'!B1073,\"\")","v":""},{"$f":"IF('Clearing Calculations'!B1073,'Clearing Calculations'!C1073,\"\")","v":""},"","","",""]
[{"$f":"IF('Clearing Calculations'!A1074=\"\",\"\",'Clearing Calculations'!A1074)","v":""},{"$f":"IF('Clearing Calculations'!A1074,'Clearing Calculations'!B1074,\"\")","v":""},{"$f":"IF('Clearing Calculations'!B1074,'Clearing Calculations'!C1074,\"\")","v":""},"","","",""]
[{"$f":"IF('Clearing Calculations'!A1075=\"\",\"\",'Clearing Calculations'!A1075)","v":""},{"$f":"IF('Clearing Calculations'!A1075,'Clearing Calculations'!B1075,\"\")","v":""},{"$f":"IF('Clearing Calculations'!B1075,'Clearing Calculations'!C1075,\"\")","v":""},"","","",""]
[{"$f":"IF('Clearing Calculations'!A1076=\"\",\"\",'Clearing Calculations'!A1076)","v":""},{"$f":"IF('Clearing Calculations'!A1076,'Clearing Calculations'!B1076,\"\")","v":""},{"$f":"IF('Clearing Calculations'!B1076,'Clearing Calculations'!C1076,\"\")","v":""},"","","",""]
[{"$f":"IF('Clearing Calculations'!A1077=\"\",\"\",'Clearing Calculations'!A1077)","v":""},{"$f":"IF('Clearing Calculations'!A1077,'Clearing Calculations'!B1077,\"\")","v":""},{"$f":"IF('Clearing Calculations'!B1077,'Clearing Calculations'!C1077,\"\")","v":""},"","","",""]
[{"$f":"IF('Clearing Calculations'!A1078=\"\",\"\",'Clearing Calculations'!A1078)","v":""},{"$f":"IF('Clearing Calculations'!A1078,'Clearing Calculations'!B1078,\"\")","v":""},{"$f":"IF('Clearing Calculations'!B1078,'Clearing Calculations'!C1078,\"\")","v":""},"","","",""]
[{"$f":"IF('Clearing Calculations'!A1079=\"\",\"\",'Clearing Calculations'!A1079)","v":""},{"$f":"IF('Clearing Calculations'!A1079,'Clearing Calculations'!B1079,\"\")","v":""},{"$f":"IF('Clearing Calculations'!B1079,'Clearing Calculations'!C1079,\"\")","v":""},"","","",""]
[{"$f":"IF('Clearing Calculations'!A1080=\"\",\"\",'Clearing Calculations'!A1080)","v":""},{"$f":"IF('Clearing Calculations'!A1080,'Clearing Calculations'!B1080,\"\")","v":""},{"$f":"IF('Clearing Calculations'!B1080,'Clearing Calculations'!C1080,\"\")","v":""},"","","",""]
[{"$f":"IF('Clearing Calculations'!A1081=\"\",\"\",'Clearing Calculations'!A1081)","v":""},{"$f":"IF('Clearing Calculations'!A1081,'Clearing Calculations'!B1081,\"\")","v":""},{"$f":"IF('Clearing Calculations'!B1081,'Clearing Calculations'!C1081,\"\")","v":""},"","","",""]
[{"$f":"IF('Clearing Calculations'!A1082=\"\",\"\",'Clearing Calculations'!A1082)","v":""},{"$f":"IF('Clearing Calculations'!A1082,'Clearing Calculations'!B1082,\"\")","v":""},{"$f":"IF('Clearing Calculations'!B1082,'Clearing Calculations'!C1082,\"\")","v":""},"","","",""]
[{"$f":"IF('Clearing Calculations'!A1083=\"\",\"\",'Clearing Calculations'!A1083)","v":""},{"$f":"IF('Clearing Calculations'!A1083,'Clearing Calculations'!B1083,\"\")","v":""},{"$f":"IF('Clearing Calculations'!B1083,'Clearing Calculations'!C1083,\"\")","v":""},"","","",""]
[{"$f":"IF('Clearing Calculations'!A1084=\"\",\"\",'Clearing Calculations'!A1084)","v":""},{"$f":"IF('Clearing Calculations'!A1084,'Clearing Calculations'!B1084,\"\")","v":""},{"$f":"IF('Clearing Calculations'!B1084,'Clearing Calculations'!C1084,\"\")","v":""},"","","",""]
[{"$f":"IF('Clearing Calculations'!A1085=\"\",\"\",'Clearing Calculations'!A1085)","v":""},{"$f":"IF('Clearing Calculations'!A1085,'Clearing Calculations'!B1085,\"\")","v":""},{"$f":"IF('Clearing Calculations'!B1085,'Clearing Calculations'!C1085,\"\")","v":""},"","","",""]
[{"$f":"IF('Clearing Calculations'!A1086=\"\",\"\",'Clearing Calculations'!A1086)","v":""},{"$f":"IF('Clearing Calculations'!A1086,'Clearing Calculations'!B1086,\"\")","v":""},{"$f":"IF('Clearing Calculations'!B1086,'Clearing Calculations'!C1086,\"\")","v":""},"","","",""]
[{"$f":"IF('Clearing Calculations'!A1087=\"\",\"\",'Clearing Calculations'!A1087)","v":""},{"$f":"IF('Clearing Calculations'!A1087,'Clearing Calculations'!B1087,\"\")","v":""},{"$f":"IF('Clearing Calculations'!B1087,'Clearing Calculations'!C1087,\"\")","v":""},"","","",""]
[{"$f":"IF('Clearing Calculations'!A1088=\"\",\"\",'Clearing Calculations'!A1088)","v":""},{"$f":"IF('Clearing Calculations'!A1088,'Clearing Calculations'!B1088,\"\")","v":""},{"$f":"IF('Clearing Calculations'!B1088,'Clearing Calculations'!C1088,\"\")","v":""},"","","",""]
[{"$f":"IF('Clearing Calculations'!A1089=\"\",\"\",'Clearing Calculations'!A1089)","v":""},{"$f":"IF('Clearing Calculations'!A1089,'Clearing Calculations'!B1089,\"\")","v":""},{"$f":"IF('Clearing Calculations'!B1089,'Clearing Calculations'!C1089,\"\")","v":""},"","","",""]
[{"$f":"IF('Clearing Calculations'!A1090=\"\",\"\",'Clearing Calculations'!A1090)","v":""},{"$f":"IF('Clearing Calculations'!A1090,'Clearing Calculations'!B1090,\"\")","v":""},{"$f":"IF('Clearing Calculations'!B1090,'Clearing Calculations'!C1090,\"\")","v":""},"","","",""]
[{"$f":"IF('Clearing Calculations'!A1091=\"\",\"\",'Clearing Calculations'!A1091)","v":""},{"$f":"IF('Clearing Calculations'!A1091,'Clearing Calculations'!B1091,\"\")","v":""},{"$f":"IF('Clearing Calculations'!B1091,'Clearing Calculations'!C1091,\"\")","v":""},"","","",""]
[{"$f":"IF('Clearing Calculations'!A1092=\"\",\"\",'Clearing Calculations'!A1092)","v":""},{"$f":"IF('Clearing Calculations'!A1092,'Clearing Calculations'!B1092,\"\")","v":""},{"$f":"IF('Clearing Calculations'!B1092,'Clearing Calculations'!C1092,\"\")","v":""},"","","",""]
[{"$f":"IF('Clearing Calculations'!A1093=\"\",\"\",'Clearing Calculations'!A1093)","v":""},{"$f":"IF('Clearing Calculations'!A1093,'Clearing Calculations'!B1093,\"\")","v":""},{"$f":"IF('Clearing Calculations'!B1093,'Clearing Calculations'!C1093,\"\")","v":""},"","","",""]
[{"$f":"IF('Clearing Calculations'!A1094=\"\",\"\",'Clearing Calculations'!A1094)","v":""},{"$f":"IF('Clearing Calculations'!A1094,'Clearing Calculations'!B1094,\"\")","v":""},{"$f":"IF('Clearing Calculations'!B1094,'Clearing Calculations'!C1094,\"\")","v":""},"","","",""]
[{"$f":"IF('Clearing Calculations'!A1095=\"\",\"\",'Clearing Calculations'!A1095)","v":""},{"$f":"IF('Clearing Calculations'!A1095,'Clearing Calculations'!B1095,\"\")","v":""},{"$f":"IF('Clearing Calculations'!B1095,'Clearing Calculations'!C1095,\"\")","v":""},"","","",""]
[{"$f":"IF('Clearing Calculations'!A1096=\"\",\"\",'Clearing Calculations'!A1096)","v":""},{"$f":"IF('Clearing Calculations'!A1096,'Clearing Calculations'!B1096,\"\")","v":""},{"$f":"IF('Clearing Calculations'!B1096,'Clearing Calculations'!C1096,\"\")","v":""},"","","",""]
[{"$f":"IF('Clearing Calculations'!A1097=\"\",\"\",'Clearing Calculations'!A1097)","v":""},{"$f":"IF('Clearing Calculations'!A1097,'Clearing Calculations'!B1097,\"\")","v":""},{"$f":"IF('Clearing Calculations'!B1097,'Clearing Calculations'!C1097,\"\")","v":""},"","","",""]
[{"$f":"IF('Clearing Calculations'!A1098=\"\",\"\",'Clearing Calculations'!A1098)","v":""},{"$f":"IF('Clearing Calculations'!A1098,'Clearing Calculations'!B1098,\"\")","v":""},{"$f":"IF('Clearing Calculations'!B1098,'Clearing Calculations'!C1098,\"\")","v":""},"","","",""]
[{"$f":"IF('Clearing Calculations'!A1099=\"\",\"\",'Clearing Calculations'!A1099)","v":""},{"$f":"IF('Clearing Calculations'!A1099,'Clearing Calculations'!B1099,\"\")","v":""},{"$f":"IF('Clearing Calculations'!B1099,'Clearing Calculations'!C1099,\"\")","v":""},"","","",""]
[{"$f":"IF('Clearing Calculations'!A1100=\"\",\"\",'Clearing Calculations'!A1100)","v":""},{"$f":"IF('Clearing Calculations'!A1100,'Clearing Calculations'!B1100,\"\")","v":""},{"$f":"IF('Clearing Calculations'!B1100,'Clearing Calculations'!C1100,\"\")","v":""},"","","",""]
[{"$f":"IF('Clearing Calculations'!A1101=\"\",\"\",'Clearing Calculations'!A1101)","v":""},{"$f":"IF('Clearing Calculations'!A1101,'Clearing Calculations'!B1101,\"\")","v":""},{"$f":"IF('Clearing Calculations'!B1101,'Clearing Calculations'!C1101,\"\")","v":""},"","","",""]
[{"$f":"IF('Clearing Calculations'!A1102=\"\",\"\",'Clearing Calculations'!A1102)","v":""},{"$f":"IF('Clearing Calculations'!A1102,'Clearing Calculations'!B1102,\"\")","v":""},{"$f":"IF('Clearing Calculations'!B1102,'Clearing Calculations'!C1102,\"\")","v":""},"","","",""]
[{"$f":"IF('Clearing Calculations'!A1103=\"\",\"\",'Clearing Calculations'!A1103)","v":""},{"$f":"IF('Clearing Calculations'!A1103,'Clearing Calculations'!B1103,\"\")","v":""},{"$f":"IF('Clearing Calculations'!B1103,'Clearing Calculations'!C1103,\"\")","v":""},"","","",""]
[{"$f":"IF('Clearing Calculations'!A1104=\"\",\"\",'Clearing Calculations'!A1104)","v":""},{"$f":"IF('Clearing Calculations'!A1104,'Clearing Calculations'!B1104,\"\")","v":""},{"$f":"IF('Clearing Calculations'!B1104,'Clearing Calculations'!C1104,\"\")","v":""},"","","",""]
[{"$f":"IF('Clearing Calculations'!A1105=\"\",\"\",'Clearing Calculations'!A1105)","v":""},{"$f":"IF('Clearing Calculations'!A1105,'Clearing Calculations'!B1105,\"\")","v":""},{"$f":"IF('Clearing Calculations'!B1105,'Clearing Calculations'!C1105,\"\")","v":""},"","","",""]
[{"$f":"IF('Clearing Calculations'!A1106=\"\",\"\",'Clearing Calculations'!A1106)","v":""},{"$f":"IF('Clearing Calculations'!A1106,'Clearing Calculations'!B1106,\"\")","v":""},{"$f":"IF('Clearing Calculations'!B1106,'Clearing Calculations'!C1106,\"\")","v":""},"","","",""]
[{"$f":"IF('Clearing Calculations'!A1107=\"\",\"\",'Clearing Calculations'!A1107)","v":""},{"$f":"IF('Clearing Calculations'!A1107,'Clearing Calculations'!B1107,\"\")","v":""},{"$f":"IF('Clearing Calculations'!B1107,'Clearing Calculations'!C1107,\"\")","v":""},"","","",""]
[{"$f":"IF('Clearing Calculations'!A1108=\"\",\"\",'Clearing Calculations'!A1108)","v":""},{"$f":"IF('Clearing Calculations'!A1108,'Clearing Calculations'!B1108,\"\")","v":""},{"$f":"IF('Clearing Calculations'!B1108,'Clearing Calculations'!C1108,\"\")","v":""},"","","",""]
[{"$f":"IF('Clearing Calculations'!A1109=\"\",\"\",'Clearing Calculations'!A1109)","v":""},{"$f":"IF('Clearing Calculations'!A1109,'Clearing Calculations'!B1109,\"\")","v":""},{"$f":"IF('Clearing Calculations'!B1109,'Clearing Calculations'!C1109,\"\")","v":""},"","","",""]
[{"$f":"IF('Clearing Calculations'!A1110=\"\",\"\",'Clearing Calculations'!A1110)","v":""},{"$f":"IF('Clearing Calculations'!A1110,'Clearing Calculations'!B1110,\"\")","v":""},{"$f":"IF('Clearing Calculations'!B1110,'Clearing Calculations'!C1110,\"\")","v":""},"","","",""]
[{"$f":"IF('Clearing Calculations'!A1111=\"\",\"\",'Clearing Calculations'!A1111)","v":""},{"$f":"IF('Clearing Calculations'!A1111,'Clearing Calculations'!B1111,\"\")","v":""},{"$f":"IF('Clearing Calculations'!B1111,'Clearing Calculations'!C1111,\"\")","v":""},"","","",""]
[{"$f":"IF('Clearing Calculations'!A1112=\"\",\"\",'Clearing Calculations'!A1112)","v":""},{"$f":"IF('Clearing Calculations'!A1112,'Clearing Calculations'!B1112,\"\")","v":""},{"$f":"IF('Clearing Calculations'!B1112,'Clearing Calculations'!C1112,\"\")","v":""},"","","",""]
[{"$f":"IF('Clearing Calculations'!A1113=\"\",\"\",'Clearing Calculations'!A1113)","v":""},{"$f":"IF('Clearing Calculations'!A1113,'Clearing Calculations'!B1113,\"\")","v":""},{"$f":"IF('Clearing Calculations'!B1113,'Clearing Calculations'!C1113,\"\")","v":""},"","","",""]
[{"$f":"IF('Clearing Calculations'!A1114=\"\",\"\",'Clearing Calculations'!A1114)","v":""},{"$f":"IF('Clearing Calculations'!A1114,'Clearing Calculations'!B1114,\"\")","v":""},{"$f":"IF('Clearing Calculations'!B1114,'Clearing Calculations'!C1114,\"\")","v":""},"","","",""]
[{"$f":"IF('Clearing Calculations'!A1115=\"\",\"\",'Clearing Calculations'!A1115)","v":""},{"$f":"IF('Clearing Calculations'!A1115,'Clearing Calculations'!B1115,\"\")","v":""},{"$f":"IF('Clearing Calculations'!B1115,'Clearing Calculations'!C1115,\"\")","v":""},"","","",""]
[{"$f":"IF('Clearing Calculations'!A1116=\"\",\"\",'Clearing Calculations'!A1116)","v":""},{"$f":"IF('Clearing Calculations'!A1116,'Clearing Calculations'!B1116,\"\")","v":""},{"$f":"IF('Clearing Calculations'!B1116,'Clearing Calculations'!C1116,\"\")","v":""},"","","",""]
[{"$f":"IF('Clearing Calculations'!A1117=\"\",\"\",'Clearing Calculations'!A1117)","v":""},{"$f":"IF('Clearing Calculations'!A1117,'Clearing Calculations'!B1117,\"\")","v":""},{"$f":"IF('Clearing Calculations'!B1117,'Clearing Calculations'!C1117,\"\")","v":""},"","","",""]
[{"$f":"IF('Clearing Calculations'!A1118=\"\",\"\",'Clearing Calculations'!A1118)","v":""},{"$f":"IF('Clearing Calculations'!A1118,'Clearing Calculations'!B1118,\"\")","v":""},{"$f":"IF('Clearing Calculations'!B1118,'Clearing Calculations'!C1118,\"\")","v":""},"","","",""]
[{"$f":"IF('Clearing Calculations'!A1119=\"\",\"\",'Clearing Calculations'!A1119)","v":""},{"$f":"IF('Clearing Calculations'!A1119,'Clearing Calculations'!B1119,\"\")","v":""},{"$f":"IF('Clearing Calculations'!B1119,'Clearing Calculations'!C1119,\"\")","v":""},"","","",""]
[{"$f":"IF('Clearing Calculations'!A1120=\"\",\"\",'Clearing Calculations'!A1120)","v":""},{"$f":"IF('Clearing Calculations'!A1120,'Clearing Calculations'!B1120,\"\")","v":""},{"$f":"IF('Clearing Calculations'!B1120,'Clearing Calculations'!C1120,\"\")","v":""},"","","",""]
[{"$f":"IF('Clearing Calculations'!A1121=\"\",\"\",'Clearing Calculations'!A1121)","v":""},{"$f":"IF('Clearing Calculations'!A1121,'Clearing Calculations'!B1121,\"\")","v":""},{"$f":"IF('Clearing Calculations'!B1121,'Clearing Calculations'!C1121,\"\")","v":""},"","","",""]
[{"$f":"IF('Clearing Calculations'!A1122=\"\",\"\",'Clearing Calculations'!A1122)","v":""},{"$f":"IF('Clearing Calculations'!A1122,'Clearing Calculations'!B1122,\"\")","v":""},{"$f":"IF('Clearing Calculations'!B1122,'Clearing Calculations'!C1122,\"\")","v":""},"","","",""]
[{"$f":"IF('Clearing Calculations'!A1123=\"\",\"\",'Clearing Calculations'!A1123)","v":""},{"$f":"IF('Clearing Calculations'!A1123,'Clearing Calculations'!B1123,\"\")","v":""},{"$f":"IF('Clearing Calculations'!B1123,'Clearing Calculations'!C1123,\"\")","v":""},"","","",""]
[{"$f":"IF('Clearing Calculations'!A1124=\"\",\"\",'Clearing Calculations'!A1124)","v":""},{"$f":"IF('Clearing Calculations'!A1124,'Clearing Calculations'!B1124,\"\")","v":""},{"$f":"IF('Clearing Calculations'!B1124,'Clearing Calculations'!C1124,\"\")","v":""},"","","",""]
[{"$f":"IF('Clearing Calculations'!A1125=\"\",\"\",'Clearing Calculations'!A1125)","v":""},{"$f":"IF('Clearing Calculations'!A1125,'Clearing Calculations'!B1125,\"\")","v":""},{"$f":"IF('Clearing Calculations'!B1125,'Clearing Calculations'!C1125,\"\")","v":""},"","","",""]
[{"$f":"IF('Clearing Calculations'!A1126=\"\",\"\",'Clearing Calculations'!A1126)","v":""},{"$f":"IF('Clearing Calculations'!A1126,'Clearing Calculations'!B1126,\"\")","v":""},{"$f":"IF('Clearing Calculations'!B1126,'Clearing Calculations'!C1126,\"\")","v":""},"","","",""]
[{"$f":"IF('Clearing Calculations'!A1127=\"\",\"\",'Clearing Calculations'!A1127)","v":""},{"$f":"IF('Clearing Calculations'!A1127,'Clearing Calculations'!B1127,\"\")","v":""},{"$f":"IF('Clearing Calculations'!B1127,'Clearing Calculations'!C1127,\"\")","v":""},"","","",""]
[{"$f":"IF('Clearing Calculations'!A1128=\"\",\"\",'Clearing Calculations'!A1128)","v":""},{"$f":"IF('Clearing Calculations'!A1128,'Clearing Calculations'!B1128,\"\")","v":""},{"$f":"IF('Clearing Calculations'!B1128,'Clearing Calculations'!C1128,\"\")","v":""},"","","",""]
[{"$f":"IF('Clearing Calculations'!A1129=\"\",\"\",'Clearing Calculations'!A1129)","v":""},{"$f":"IF('Clearing Calculations'!A1129,'Clearing Calculations'!B1129,\"\")","v":""},{"$f":"IF('Clearing Calculations'!B1129,'Clearing Calculations'!C1129,\"\")","v":""},"","","",""]
[{"$f":"IF('Clearing Calculations'!A1130=\"\",\"\",'Clearing Calculations'!A1130)","v":""},{"$f":"IF('Clearing Calculations'!A1130,'Clearing Calculations'!B1130,\"\")","v":""},{"$f":"IF('Clearing Calculations'!B1130,'Clearing Calculations'!C1130,\"\")","v":""},"","","",""]
[{"$f":"IF('Clearing Calculations'!A1131=\"\",\"\",'Clearing Calculations'!A1131)","v":""},{"$f":"IF('Clearing Calculations'!A1131,'Clearing Calculations'!B1131,\"\")","v":""},{"$f":"IF('Clearing Calculations'!B1131,'Clearing Calculations'!C1131,\"\")","v":""},"","","",""]
[{"$f":"IF('Clearing Calculations'!A1132=\"\",\"\",'Clearing Calculations'!A1132)","v":""},{"$f":"IF('Clearing Calculations'!A1132,'Clearing Calculations'!B1132,\"\")","v":""},{"$f":"IF('Clearing Calculations'!B1132,'Clearing Calculations'!C1132,\"\")","v":""},{"$f":"IF(A1138=\"\",\"\",$B1138+$C1138)","v":""},{"$f":"IF(A1138=\"\",\"\",(D1138+D1137)/2*(A1138-A1137))","v":""},{"$f":"IF(A1138=\"\",\"\",(E1138/9))","v":""},{"$f":"IF(A1138=\"\",\"\",E1138/$G$3)","v":""}]
[{"$f":"IF('Clearing Calculations'!A1133=\"\",\"\",'Clearing Calculations'!A1133)","v":""},{"$f":"IF('Clearing Calculations'!A1133,'Clearing Calculations'!B1133,\"\")","v":""},{"$f":"IF('Clearing Calculations'!B1133,'Clearing Calculations'!C1133,\"\")","v":""},"","","",""]
[{"$f":"IF('Clearing Calculations'!A1134=\"\",\"\",'Clearing Calculations'!A1134)","v":""},{"$f":"IF('Clearing Calculations'!A1134,'Clearing Calculations'!B1134,\"\")","v":""},{"$f":"IF('Clearing Calculations'!B1134,'Clearing Calculations'!C1134,\"\")","v":""},"","","",""]
[{"$f":"IF('Clearing Calculations'!A1135=\"\",\"\",'Clearing Calculations'!A1135)","v":""},{"$f":"IF('Clearing Calculations'!A1135,'Clearing Calculations'!B1135,\"\")","v":""},{"$f":"IF('Clearing Calculations'!B1135,'Clearing Calculations'!C1135,\"\")","v":""},"","","",""]
[{"$f":"IF('Clearing Calculations'!A1136=\"\",\"\",'Clearing Calculations'!A1136)","v":""},{"$f":"IF('Clearing Calculations'!A1136,'Clearing Calculations'!B1136,\"\")","v":""},{"$f":"IF('Clearing Calculations'!B1136,'Clearing Calculations'!C1136,\"\")","v":""},"","","",""]
[{"$f":"IF('Clearing Calculations'!A1137=\"\",\"\",'Clearing Calculations'!A1137)","v":""},{"$f":"IF('Clearing Calculations'!A1137,'Clearing Calculations'!B1137,\"\")","v":""},{"$f":"IF('Clearing Calculations'!B1137,'Clearing Calculations'!C1137,\"\")","v":""},"","","",""]
[{"$f":"IF('Clearing Calculations'!A1138=\"\",\"\",'Clearing Calculations'!A1138)","v":""},{"$f":"IF('Clearing Calculations'!A1138,'Clearing Calculations'!B1138,\"\")","v":""},{"$f":"IF('Clearing Calculations'!B1138,'Clearing Calculations'!C1138,\"\")","v":""},"","","",""]
[{"$f":"IF('Clearing Calculations'!A1139=\"\",\"\",'Clearing Calculations'!A1139)","v":""},{"$f":"IF('Clearing Calculations'!A1139,'Clearing Calculations'!B1139,\"\")","v":""},{"$f":"IF('Clearing Calculations'!B1139,'Clearing Calculations'!C1139,\"\")","v":""},"","","",""]
[{"$f":"IF('Clearing Calculations'!A1140=\"\",\"\",'Clearing Calculations'!A1140)","v":""},{"$f":"IF('Clearing Calculations'!A1140,'Clearing Calculations'!B1140,\"\")","v":""},{"$f":"IF('Clearing Calculations'!B1140,'Clearing Calculations'!C1140,\"\")","v":""},"","","",""]
[{"$f":"IF('Clearing Calculations'!A1141=\"\",\"\",'Clearing Calculations'!A1141)","v":""},{"$f":"IF('Clearing Calculations'!A1141,'Clearing Calculations'!B1141,\"\")","v":""},{"$f":"IF('Clearing Calculations'!B1141,'Clearing Calculations'!C1141,\"\")","v":""},"","","",""]
[{"$f":"IF('Clearing Calculations'!A1142=\"\",\"\",'Clearing Calculations'!A1142)","v":""},{"$f":"IF('Clearing Calculations'!A1142,'Clearing Calculations'!B1142,\"\")","v":""},{"$f":"IF('Clearing Calculations'!B1142,'Clearing Calculations'!C1142,\"\")","v":""},"","","",""]
[{"$f":"IF('Clearing Calculations'!A1143=\"\",\"\",'Clearing Calculations'!A1143)","v":""},{"$f":"IF('Clearing Calculations'!A1143,'Clearing Calculations'!B1143,\"\")","v":""},{"$f":"IF('Clearing Calculations'!B1143,'Clearing Calculations'!C1143,\"\")","v":""},"","","",""]
[{"$f":"IF('Clearing Calculations'!A1144=\"\",\"\",'Clearing Calculations'!A1144)","v":""},{"$f":"IF('Clearing Calculations'!A1144,'Clearing Calculations'!B1144,\"\")","v":""},{"$f":"IF('Clearing Calculations'!B1144,'Clearing Calculations'!C1144,\"\")","v":""},"","","",""]
[{"$f":"IF('Clearing Calculations'!A1145=\"\",\"\",'Clearing Calculations'!A1145)","v":""},{"$f":"IF('Clearing Calculations'!A1145,'Clearing Calculations'!B1145,\"\")","v":""},{"$f":"IF('Clearing Calculations'!B1145,'Clearing Calculations'!C1145,\"\")","v":""},"","","",""]
[{"$f":"IF('Clearing Calculations'!A1146=\"\",\"\",'Clearing Calculations'!A1146)","v":""},{"$f":"IF('Clearing Calculations'!A1146,'Clearing Calculations'!B1146,\"\")","v":""},{"$f":"IF('Clearing Calculations'!B1146,'Clearing Calculations'!C1146,\"\")","v":""},"","","",""]
[{"$f":"IF('Clearing Calculations'!A1147=\"\",\"\",'Clearing Calculations'!A1147)","v":""},{"$f":"IF('Clearing Calculations'!A1147,'Clearing Calculations'!B1147,\"\")","v":""},{"$f":"IF('Clearing Calculations'!B1147,'Clearing Calculations'!C1147,\"\")","v":""},"","","",""]
[{"$f":"IF('Clearing Calculations'!A1148=\"\",\"\",'Clearing Calculations'!A1148)","v":""},{"$f":"IF('Clearing Calculations'!A1148,'Clearing Calculations'!B1148,\"\")","v":""},{"$f":"IF('Clearing Calculations'!B1148,'Clearing Calculations'!C1148,\"\")","v":""},"","","",""]
[{"$f":"IF('Clearing Calculations'!A1149=\"\",\"\",'Clearing Calculations'!A1149)","v":""},{"$f":"IF('Clearing Calculations'!A1149,'Clearing Calculations'!B1149,\"\")","v":""},{"$f":"IF('Clearing Calculations'!B1149,'Clearing Calculations'!C1149,\"\")","v":""},"","","",""]
[{"$f":"IF('Clearing Calculations'!A1150=\"\",\"\",'Clearing Calculations'!A1150)","v":""},{"$f":"IF('Clearing Calculations'!A1150,'Clearing Calculations'!B1150,\"\")","v":""},{"$f":"IF('Clearing Calculations'!B1150,'Clearing Calculations'!C1150,\"\")","v":""},"","","",""]
[{"$f":"IF('Clearing Calculations'!A1151=\"\",\"\",'Clearing Calculations'!A1151)","v":""},{"$f":"IF('Clearing Calculations'!A1151,'Clearing Calculations'!B1151,\"\")","v":""},{"$f":"IF('Clearing Calculations'!B1151,'Clearing Calculations'!C1151,\"\")","v":""},"","","",""]
[{"$f":"IF('Clearing Calculations'!A1152=\"\",\"\",'Clearing Calculations'!A1152)","v":""},{"$f":"IF('Clearing Calculations'!A1152,'Clearing Calculations'!B1152,\"\")","v":""},{"$f":"IF('Clearing Calculations'!B1152,'Clearing Calculations'!C1152,\"\")","v":""},"","","",""]
[{"$f":"IF('Clearing Calculations'!A1153=\"\",\"\",'Clearing Calculations'!A1153)","v":""},{"$f":"IF('Clearing Calculations'!A1153,'Clearing Calculations'!B1153,\"\")","v":""},{"$f":"IF('Clearing Calculations'!B1153,'Clearing Calculations'!C1153,\"\")","v":""},"","","",""]
[{"$f":"IF('Clearing Calculations'!A1154=\"\",\"\",'Clearing Calculations'!A1154)","v":""},{"$f":"IF('Clearing Calculations'!A1154,'Clearing Calculations'!B1154,\"\")","v":""},{"$f":"IF('Clearing Calculations'!B1154,'Clearing Calculations'!C1154,\"\")","v":""},"","","",""]
[{"$f":"IF('Clearing Calculations'!A1155=\"\",\"\",'Clearing Calculations'!A1155)","v":""},{"$f":"IF('Clearing Calculations'!A1155,'Clearing Calculations'!B1155,\"\")","v":""},{"$f":"IF('Clearing Calculations'!B1155,'Clearing Calculations'!C1155,\"\")","v":""},"","","",""]
[{"$f":"IF('Clearing Calculations'!A1156=\"\",\"\",'Clearing Calculations'!A1156)","v":""},{"$f":"IF('Clearing Calculations'!A1156,'Clearing Calculations'!B1156,\"\")","v":""},{"$f":"IF('Clearing Calculations'!B1156,'Clearing Calculations'!C1156,\"\")","v":""},"","","",""]
[{"$f":"IF('Clearing Calculations'!A1157=\"\",\"\",'Clearing Calculations'!A1157)","v":""},{"$f":"IF('Clearing Calculations'!A1157,'Clearing Calculations'!B1157,\"\")","v":""},{"$f":"IF('Clearing Calculations'!B1157,'Clearing Calculations'!C1157,\"\")","v":""},"","","",""]
[{"$f":"IF('Clearing Calculations'!A1158=\"\",\"\",'Clearing Calculations'!A1158)","v":""},{"$f":"IF('Clearing Calculations'!A1158,'Clearing Calculations'!B1158,\"\")","v":""},{"$f":"IF('Clearing Calculations'!B1158,'Clearing Calculations'!C1158,\"\")","v":""},"","","",""]
[{"$f":"IF('Clearing Calculations'!A1159=\"\",\"\",'Clearing Calculations'!A1159)","v":""},{"$f":"IF('Clearing Calculations'!A1159,'Clearing Calculations'!B1159,\"\")","v":""},{"$f":"IF('Clearing Calculations'!B1159,'Clearing Calculations'!C1159,\"\")","v":""},"","","",""]
[{"$f":"IF('Clearing Calculations'!A1160=\"\",\"\",'Clearing Calculations'!A1160)","v":""},{"$f":"IF('Clearing Calculations'!A1160,'Clearing Calculations'!B1160,\"\")","v":""},{"$f":"IF('Clearing Calculations'!B1160,'Clearing Calculations'!C1160,\"\")","v":""},"","","",""]
[{"$f":"IF('Clearing Calculations'!A1161=\"\",\"\",'Clearing Calculations'!A1161)","v":""},{"$f":"IF('Clearing Calculations'!A1161,'Clearing Calculations'!B1161,\"\")","v":""},{"$f":"IF('Clearing Calculations'!B1161,'Clearing Calculations'!C1161,\"\")","v":""},"","","",""]
[{"$f":"IF('Clearing Calculations'!A1162=\"\",\"\",'Clearing Calculations'!A1162)","v":""},{"$f":"IF('Clearing Calculations'!A1162,'Clearing Calculations'!B1162,\"\")","v":""},{"$f":"IF('Clearing Calculations'!B1162,'Clearing Calculations'!C1162,\"\")","v":""},"","","",""]
[{"$f":"IF('Clearing Calculations'!A1163=\"\",\"\",'Clearing Calculations'!A1163)","v":""},{"$f":"IF('Clearing Calculations'!A1163,'Clearing Calculations'!B1163,\"\")","v":""},{"$f":"IF('Clearing Calculations'!B1163,'Clearing Calculations'!C1163,\"\")","v":""},"","","",""]
[{"$f":"IF('Clearing Calculations'!A1164=\"\",\"\",'Clearing Calculations'!A1164)","v":""},{"$f":"IF('Clearing Calculations'!A1164,'Clearing Calculations'!B1164,\"\")","v":""},{"$f":"IF('Clearing Calculations'!B1164,'Clearing Calculations'!C1164,\"\")","v":""},"","","",""]
[{"$f":"IF('Clearing Calculations'!A1165=\"\",\"\",'Clearing Calculations'!A1165)","v":""},{"$f":"IF('Clearing Calculations'!A1165,'Clearing Calculations'!B1165,\"\")","v":""},{"$f":"IF('Clearing Calculations'!B1165,'Clearing Calculations'!C1165,\"\")","v":""},"","","",""]
[{"$f":"IF('Clearing Calculations'!A1166=\"\",\"\",'Clearing Calculations'!A1166)","v":""},{"$f":"IF('Clearing Calculations'!A1166,'Clearing Calculations'!B1166,\"\")","v":""},{"$f":"IF('Clearing Calculations'!B1166,'Clearing Calculations'!C1166,\"\")","v":""},"","","",""]
[{"$f":"IF('Clearing Calculations'!A1167=\"\",\"\",'Clearing Calculations'!A1167)","v":""},{"$f":"IF('Clearing Calculations'!A1167,'Clearing Calculations'!B1167,\"\")","v":""},{"$f":"IF('Clearing Calculations'!B1167,'Clearing Calculations'!C1167,\"\")","v":""},"","","",""]
[{"$f":"IF('Clearing Calculations'!A1168=\"\",\"\",'Clearing Calculations'!A1168)","v":""},{"$f":"IF('Clearing Calculations'!A1168,'Clearing Calculations'!B1168,\"\")","v":""},{"$f":"IF('Clearing Calculations'!B1168,'Clearing Calculations'!C1168,\"\")","v":""},"","","",""]
[{"$f":"IF('Clearing Calculations'!A1169=\"\",\"\",'Clearing Calculations'!A1169)","v":""},{"$f":"IF('Clearing Calculations'!A1169,'Clearing Calculations'!B1169,\"\")","v":""},{"$f":"IF('Clearing Calculations'!B1169,'Clearing Calculations'!C1169,\"\")","v":""},"","","",""]
[{"$f":"IF('Clearing Calculations'!A1170=\"\",\"\",'Clearing Calculations'!A1170)","v":""},{"$f":"IF('Clearing Calculations'!A1170,'Clearing Calculations'!B1170,\"\")","v":""},{"$f":"IF('Clearing Calculations'!B1170,'Clearing Calculations'!C1170,\"\")","v":""},"","","",""]
[{"$f":"IF('Clearing Calculations'!A1171=\"\",\"\",'Clearing Calculations'!A1171)","v":""},{"$f":"IF('Clearing Calculations'!A1171,'Clearing Calculations'!B1171,\"\")","v":""},{"$f":"IF('Clearing Calculations'!B1171,'Clearing Calculations'!C1171,\"\")","v":""},"","","",""]
[{"$f":"IF('Clearing Calculations'!A1172=\"\",\"\",'Clearing Calculations'!A1172)","v":""},{"$f":"IF('Clearing Calculations'!A1172,'Clearing Calculations'!B1172,\"\")","v":""},{"$f":"IF('Clearing Calculations'!B1172,'Clearing Calculations'!C1172,\"\")","v":""},"","","",""]
[{"$f":"IF('Clearing Calculations'!A1173=\"\",\"\",'Clearing Calculations'!A1173)","v":""},{"$f":"IF('Clearing Calculations'!A1173,'Clearing Calculations'!B1173,\"\")","v":""},{"$f":"IF('Clearing Calculations'!B1173,'Clearing Calculations'!C1173,\"\")","v":""},"","","",""]
[{"$f":"IF('Clearing Calculations'!A1174=\"\",\"\",'Clearing Calculations'!A1174)","v":""},{"$f":"IF('Clearing Calculations'!A1174,'Clearing Calculations'!B1174,\"\")","v":""},{"$f":"IF('Clearing Calculations'!B1174,'Clearing Calculations'!C1174,\"\")","v":""},"","","",""]
[{"$f":"IF('Clearing Calculations'!A1175=\"\",\"\",'Clearing Calculations'!A1175)","v":""},{"$f":"IF('Clearing Calculations'!A1175,'Clearing Calculations'!B1175,\"\")","v":""},{"$f":"IF('Clearing Calculations'!B1175,'Clearing Calculations'!C1175,\"\")","v":""},"","","",""]
[{"$f":"IF('Clearing Calculations'!A1176=\"\",\"\",'Clearing Calculations'!A1176)","v":""},{"$f":"IF('Clearing Calculations'!A1176,'Clearing Calculations'!B1176,\"\")","v":""},{"$f":"IF('Clearing Calculations'!B1176,'Clearing Calculations'!C1176,\"\")","v":""},"","","",""]
[{"$f":"IF('Clearing Calculations'!A1177=\"\",\"\",'Clearing Calculations'!A1177)","v":""},{"$f":"IF('Clearing Calculations'!A1177,'Clearing Calculations'!B1177,\"\")","v":""},{"$f":"IF('Clearing Calculations'!B1177,'Clearing Calculations'!C1177,\"\")","v":""},"","","",""]
[{"$f":"IF('Clearing Calculations'!A1178=\"\",\"\",'Clearing Calculations'!A1178)","v":""},{"$f":"IF('Clearing Calculations'!A1178,'Clearing Calculations'!B1178,\"\")","v":""},{"$f":"IF('Clearing Calculations'!B1178,'Clearing Calculations'!C1178,\"\")","v":""},"","","",""]
[{"$f":"IF('Clearing Calculations'!A1179=\"\",\"\",'Clearing Calculations'!A1179)","v":""},{"$f":"IF('Clearing Calculations'!A1179,'Clearing Calculations'!B1179,\"\")","v":""},{"$f":"IF('Clearing Calculations'!B1179,'Clearing Calculations'!C1179,\"\")","v":""},"","","",""]
[{"$f":"IF('Clearing Calculations'!A1180=\"\",\"\",'Clearing Calculations'!A1180)","v":""},{"$f":"IF('Clearing Calculations'!A1180,'Clearing Calculations'!B1180,\"\")","v":""},{"$f":"IF('Clearing Calculations'!B1180,'Clearing Calculations'!C1180,\"\")","v":""},"","","",""]
[{"$f":"IF('Clearing Calculations'!A1181=\"\",\"\",'Clearing Calculations'!A1181)","v":""},{"$f":"IF('Clearing Calculations'!A1181,'Clearing Calculations'!B1181,\"\")","v":""},{"$f":"IF('Clearing Calculations'!B1181,'Clearing Calculations'!C1181,\"\")","v":""},"","","",""]
[{"$f":"IF('Clearing Calculations'!A1182=\"\",\"\",'Clearing Calculations'!A1182)","v":""},{"$f":"IF('Clearing Calculations'!A1182,'Clearing Calculations'!B1182,\"\")","v":""},{"$f":"IF('Clearing Calculations'!B1182,'Clearing Calculations'!C1182,\"\")","v":""},"","","",""]
[{"$f":"IF('Clearing Calculations'!A1183=\"\",\"\",'Clearing Calculations'!A1183)","v":""},{"$f":"IF('Clearing Calculations'!A1183,'Clearing Calculations'!B1183,\"\")","v":""},{"$f":"IF('Clearing Calculations'!B1183,'Clearing Calculations'!C1183,\"\")","v":""},"","","",""]
[{"$f":"IF('Clearing Calculations'!A1184=\"\",\"\",'Clearing Calculations'!A1184)","v":""},{"$f":"IF('Clearing Calculations'!A1184,'Clearing Calculations'!B1184,\"\")","v":""},{"$f":"IF('Clearing Calculations'!B1184,'Clearing Calculations'!C1184,\"\")","v":""},"","","",""]
[{"$f":"IF('Clearing Calculations'!A1185=\"\",\"\",'Clearing Calculations'!A1185)","v":""},{"$f":"IF('Clearing Calculations'!A1185,'Clearing Calculations'!B1185,\"\")","v":""},{"$f":"IF('Clearing Calculations'!B1185,'Clearing Calculations'!C1185,\"\")","v":""},"","","",""]
[{"$f":"IF('Clearing Calculations'!A1186=\"\",\"\",'Clearing Calculations'!A1186)","v":""},{"$f":"IF('Clearing Calculations'!A1186,'Clearing Calculations'!B1186,\"\")","v":""},{"$f":"IF('Clearing Calculations'!B1186,'Clearing Calculations'!C1186,\"\")","v":""},"","","",""]
[{"$f":"IF('Clearing Calculations'!A1187=\"\",\"\",'Clearing Calculations'!A1187)","v":""},{"$f":"IF('Clearing Calculations'!A1187,'Clearing Calculations'!B1187,\"\")","v":""},{"$f":"IF('Clearing Calculations'!B1187,'Clearing Calculations'!C1187,\"\")","v":""},"","","",""]
[{"$f":"IF('Clearing Calculations'!A1188=\"\",\"\",'Clearing Calculations'!A1188)","v":""},{"$f":"IF('Clearing Calculations'!A1188,'Clearing Calculations'!B1188,\"\")","v":""},{"$f":"IF('Clearing Calculations'!B1188,'Clearing Calculations'!C1188,\"\")","v":""},"","","",""]
[{"$f":"IF('Clearing Calculations'!A1189=\"\",\"\",'Clearing Calculations'!A1189)","v":""},{"$f":"IF('Clearing Calculations'!A1189,'Clearing Calculations'!B1189,\"\")","v":""},{"$f":"IF('Clearing Calculations'!B1189,'Clearing Calculations'!C1189,\"\")","v":""},"","","",""]
[{"$f":"IF('Clearing Calculations'!A1190=\"\",\"\",'Clearing Calculations'!A1190)","v":""},{"$f":"IF('Clearing Calculations'!A1190,'Clearing Calculations'!B1190,\"\")","v":""},{"$f":"IF('Clearing Calculations'!B1190,'Clearing Calculations'!C1190,\"\")","v":""},"","","",""]
[{"$f":"IF('Clearing Calculations'!A1191=\"\",\"\",'Clearing Calculations'!A1191)","v":""},{"$f":"IF('Clearing Calculations'!A1191,'Clearing Calculations'!B1191,\"\")","v":""},{"$f":"IF('Clearing Calculations'!B1191,'Clearing Calculations'!C1191,\"\")","v":""},"","","",""]
[{"$f":"IF('Clearing Calculations'!A1192=\"\",\"\",'Clearing Calculations'!A1192)","v":""},{"$f":"IF('Clearing Calculations'!A1192,'Clearing Calculations'!B1192,\"\")","v":""},{"$f":"IF('Clearing Calculations'!B1192,'Clearing Calculations'!C1192,\"\")","v":""},"","","",""]
[{"$f":"IF('Clearing Calculations'!A1193=\"\",\"\",'Clearing Calculations'!A1193)","v":""},{"$f":"IF('Clearing Calculations'!A1193,'Clearing Calculations'!B1193,\"\")","v":""},{"$f":"IF('Clearing Calculations'!B1193,'Clearing Calculations'!C1193,\"\")","v":""},"","","",""]
[{"$f":"IF('Clearing Calculations'!A1194=\"\",\"\",'Clearing Calculations'!A1194)","v":""},{"$f":"IF('Clearing Calculations'!A1194,'Clearing Calculations'!B1194,\"\")","v":""},{"$f":"IF('Clearing Calculations'!B1194,'Clearing Calculations'!C1194,\"\")","v":""},"","","",""]
[{"$f":"IF('Clearing Calculations'!A1195=\"\",\"\",'Clearing Calculations'!A1195)","v":""},{"$f":"IF('Clearing Calculations'!A1195,'Clearing Calculations'!B1195,\"\")","v":""},{"$f":"IF('Clearing Calculations'!B1195,'Clearing Calculations'!C1195,\"\")","v":""},"","","",""]
[{"$f":"IF('Clearing Calculations'!A1196=\"\",\"\",'Clearing Calculations'!A1196)","v":""},{"$f":"IF('Clearing Calculations'!A1196,'Clearing Calculations'!B1196,\"\")","v":""},{"$f":"IF('Clearing Calculations'!B1196,'Clearing Calculations'!C1196,\"\")","v":""},{"$f":"IF(A1202=\"\",\"\",$B1202+$C1202)","v":""},{"$f":"IF(A1202=\"\",\"\",(D1202+D1201)/2*(A1202-A1201))","v":""},{"$f":"IF(A1202=\"\",\"\",(E1202/9))","v":""},{"$f":"IF(A1202=\"\",\"\",E1202/$G$3)","v":""}]
[{"$f":"IF('Clearing Calculations'!A1197=\"\",\"\",'Clearing Calculations'!A1197)","v":""},{"$f":"IF('Clearing Calculations'!A1197,'Clearing Calculations'!B1197,\"\")","v":""},{"$f":"IF('Clearing Calculations'!B1197,'Clearing Calculations'!C1197,\"\")","v":""},"","","",""]
[{"$f":"IF('Clearing Calculations'!A1198=\"\",\"\",'Clearing Calculations'!A1198)","v":""},{"$f":"IF('Clearing Calculations'!A1198,'Clearing Calculations'!B1198,\"\")","v":""},{"$f":"IF('Clearing Calculations'!B1198,'Clearing Calculations'!C1198,\"\")","v":""},"","","",""]
[{"$f":"IF('Clearing Calculations'!A1199=\"\",\"\",'Clearing Calculations'!A1199)","v":""},{"$f":"IF('Clearing Calculations'!A1199,'Clearing Calculations'!B1199,\"\")","v":""},{"$f":"IF('Clearing Calculations'!B1199,'Clearing Calculations'!C1199,\"\")","v":""},"","","",""]
[{"$f":"IF('Clearing Calculations'!A1200=\"\",\"\",'Clearing Calculations'!A1200)","v":""},{"$f":"IF('Clearing Calculations'!A1200,'Clearing Calculations'!B1200,\"\")","v":""},{"$f":"IF('Clearing Calculations'!B1200,'Clearing Calculations'!C1200,\"\")","v":""},"","","",""]
[{"$f":"IF('Clearing Calculations'!A1201=\"\",\"\",'Clearing Calculations'!A1201)","v":""},{"$f":"IF('Clearing Calculations'!A1201,'Clearing Calculations'!B1201,\"\")","v":""},{"$f":"IF('Clearing Calculations'!B1201,'Clearing Calculations'!C1201,\"\")","v":""},"","","",""]
[{"$f":"IF('Clearing Calculations'!A1202=\"\",\"\",'Clearing Calculations'!A1202)","v":""},{"$f":"IF('Clearing Calculations'!A1202,'Clearing Calculations'!B1202,\"\")","v":""},{"$f":"IF('Clearing Calculations'!B1202,'Clearing Calculations'!C1202,\"\")","v":""},"","","",""]
[{"$f":"IF('Clearing Calculations'!A1203=\"\",\"\",'Clearing Calculations'!A1203)","v":""},{"$f":"IF('Clearing Calculations'!A1203,'Clearing Calculations'!B1203,\"\")","v":""},{"$f":"IF('Clearing Calculations'!B1203,'Clearing Calculations'!C1203,\"\")","v":""},"","","",""]
[{"$f":"IF('Clearing Calculations'!A1204=\"\",\"\",'Clearing Calculations'!A1204)","v":""},{"$f":"IF('Clearing Calculations'!A1204,'Clearing Calculations'!B1204,\"\")","v":""},{"$f":"IF('Clearing Calculations'!B1204,'Clearing Calculations'!C1204,\"\")","v":""},"","","",""]
[{"$f":"IF('Clearing Calculations'!A1205=\"\",\"\",'Clearing Calculations'!A1205)","v":""},{"$f":"IF('Clearing Calculations'!A1205,'Clearing Calculations'!B1205,\"\")","v":""},{"$f":"IF('Clearing Calculations'!B1205,'Clearing Calculations'!C1205,\"\")","v":""},"","","",""]
[{"$f":"IF('Clearing Calculations'!A1206=\"\",\"\",'Clearing Calculations'!A1206)","v":""},{"$f":"IF('Clearing Calculations'!A1206,'Clearing Calculations'!B1206,\"\")","v":""},{"$f":"IF('Clearing Calculations'!B1206,'Clearing Calculations'!C1206,\"\")","v":""},"","","",""]
[{"$f":"IF('Clearing Calculations'!A1207=\"\",\"\",'Clearing Calculations'!A1207)","v":""},{"$f":"IF('Clearing Calculations'!A1207,'Clearing Calculations'!B1207,\"\")","v":""},{"$f":"IF('Clearing Calculations'!B1207,'Clearing Calculations'!C1207,\"\")","v":""},"","","",""]
[{"$f":"IF('Clearing Calculations'!A1208=\"\",\"\",'Clearing Calculations'!A1208)","v":""},{"$f":"IF('Clearing Calculations'!A1208,'Clearing Calculations'!B1208,\"\")","v":""},{"$f":"IF('Clearing Calculations'!B1208,'Clearing Calculations'!C1208,\"\")","v":""},"","","",""]
[{"$f":"IF('Clearing Calculations'!A1209=\"\",\"\",'Clearing Calculations'!A1209)","v":""},{"$f":"IF('Clearing Calculations'!A1209,'Clearing Calculations'!B1209,\"\")","v":""},{"$f":"IF('Clearing Calculations'!B1209,'Clearing Calculations'!C1209,\"\")","v":""},"","","",""]
[{"$f":"IF('Clearing Calculations'!A1210=\"\",\"\",'Clearing Calculations'!A1210)","v":""},{"$f":"IF('Clearing Calculations'!A1210,'Clearing Calculations'!B1210,\"\")","v":""},{"$f":"IF('Clearing Calculations'!B1210,'Clearing Calculations'!C1210,\"\")","v":""},"","","",""]
[{"$f":"IF('Clearing Calculations'!A1211=\"\",\"\",'Clearing Calculations'!A1211)","v":""},{"$f":"IF('Clearing Calculations'!A1211,'Clearing Calculations'!B1211,\"\")","v":""},{"$f":"IF('Clearing Calculations'!B1211,'Clearing Calculations'!C1211,\"\")","v":""},"","","",""]
[{"$f":"IF('Clearing Calculations'!A1212=\"\",\"\",'Clearing Calculations'!A1212)","v":""},{"$f":"IF('Clearing Calculations'!A1212,'Clearing Calculations'!B1212,\"\")","v":""},{"$f":"IF('Clearing Calculations'!B1212,'Clearing Calculations'!C1212,\"\")","v":""},"","","",""]
[{"$f":"IF('Clearing Calculations'!A1213=\"\",\"\",'Clearing Calculations'!A1213)","v":""},{"$f":"IF('Clearing Calculations'!A1213,'Clearing Calculations'!B1213,\"\")","v":""},{"$f":"IF('Clearing Calculations'!B1213,'Clearing Calculations'!C1213,\"\")","v":""},"","","",""]
[{"$f":"IF('Clearing Calculations'!A1214=\"\",\"\",'Clearing Calculations'!A1214)","v":""},{"$f":"IF('Clearing Calculations'!A1214,'Clearing Calculations'!B1214,\"\")","v":""},{"$f":"IF('Clearing Calculations'!B1214,'Clearing Calculations'!C1214,\"\")","v":""},"","","",""]
[{"$f":"IF('Clearing Calculations'!A1215=\"\",\"\",'Clearing Calculations'!A1215)","v":""},{"$f":"IF('Clearing Calculations'!A1215,'Clearing Calculations'!B1215,\"\")","v":""},{"$f":"IF('Clearing Calculations'!B1215,'Clearing Calculations'!C1215,\"\")","v":""},"","","",""]
[{"$f":"IF('Clearing Calculations'!A1216=\"\",\"\",'Clearing Calculations'!A1216)","v":""},{"$f":"IF('Clearing Calculations'!A1216,'Clearing Calculations'!B1216,\"\")","v":""},{"$f":"IF('Clearing Calculations'!B1216,'Clearing Calculations'!C1216,\"\")","v":""},"","","",""]
[{"$f":"IF('Clearing Calculations'!A1217=\"\",\"\",'Clearing Calculations'!A1217)","v":""},{"$f":"IF('Clearing Calculations'!A1217,'Clearing Calculations'!B1217,\"\")","v":""},{"$f":"IF('Clearing Calculations'!B1217,'Clearing Calculations'!C1217,\"\")","v":""},"","","",""]
[{"$f":"IF('Clearing Calculations'!A1218=\"\",\"\",'Clearing Calculations'!A1218)","v":""},{"$f":"IF('Clearing Calculations'!A1218,'Clearing Calculations'!B1218,\"\")","v":""},{"$f":"IF('Clearing Calculations'!B1218,'Clearing Calculations'!C1218,\"\")","v":""},"","","",""]
[{"$f":"IF('Clearing Calculations'!A1219=\"\",\"\",'Clearing Calculations'!A1219)","v":""},{"$f":"IF('Clearing Calculations'!A1219,'Clearing Calculations'!B1219,\"\")","v":""},{"$f":"IF('Clearing Calculations'!B1219,'Clearing Calculations'!C1219,\"\")","v":""},"","","",""]
[{"$f":"IF('Clearing Calculations'!A1220=\"\",\"\",'Clearing Calculations'!A1220)","v":""},{"$f":"IF('Clearing Calculations'!A1220,'Clearing Calculations'!B1220,\"\")","v":""},{"$f":"IF('Clearing Calculations'!B1220,'Clearing Calculations'!C1220,\"\")","v":""},"","","",""]
[{"$f":"IF('Clearing Calculations'!A1221=\"\",\"\",'Clearing Calculations'!A1221)","v":""},{"$f":"IF('Clearing Calculations'!A1221,'Clearing Calculations'!B1221,\"\")","v":""},{"$f":"IF('Clearing Calculations'!B1221,'Clearing Calculations'!C1221,\"\")","v":""},"","","",""]
[{"$f":"IF('Clearing Calculations'!A1222=\"\",\"\",'Clearing Calculations'!A1222)","v":""},{"$f":"IF('Clearing Calculations'!A1222,'Clearing Calculations'!B1222,\"\")","v":""},{"$f":"IF('Clearing Calculations'!B1222,'Clearing Calculations'!C1222,\"\")","v":""},"","","",""]
[{"$f":"IF('Clearing Calculations'!A1223=\"\",\"\",'Clearing Calculations'!A1223)","v":""},{"$f":"IF('Clearing Calculations'!A1223,'Clearing Calculations'!B1223,\"\")","v":""},{"$f":"IF('Clearing Calculations'!B1223,'Clearing Calculations'!C1223,\"\")","v":""},"","","",""]
[{"$f":"IF('Clearing Calculations'!A1224=\"\",\"\",'Clearing Calculations'!A1224)","v":""},{"$f":"IF('Clearing Calculations'!A1224,'Clearing Calculations'!B1224,\"\")","v":""},{"$f":"IF('Clearing Calculations'!B1224,'Clearing Calculations'!C1224,\"\")","v":""},"","","",""]
[{"$f":"IF('Clearing Calculations'!A1225=\"\",\"\",'Clearing Calculations'!A1225)","v":""},{"$f":"IF('Clearing Calculations'!A1225,'Clearing Calculations'!B1225,\"\")","v":""},{"$f":"IF('Clearing Calculations'!B1225,'Clearing Calculations'!C1225,\"\")","v":""},"","","",""]
[{"$f":"IF('Clearing Calculations'!A1226=\"\",\"\",'Clearing Calculations'!A1226)","v":""},{"$f":"IF('Clearing Calculations'!A1226,'Clearing Calculations'!B1226,\"\")","v":""},{"$f":"IF('Clearing Calculations'!B1226,'Clearing Calculations'!C1226,\"\")","v":""},"","","",""]
[{"$f":"IF('Clearing Calculations'!A1227=\"\",\"\",'Clearing Calculations'!A1227)","v":""},{"$f":"IF('Clearing Calculations'!A1227,'Clearing Calculations'!B1227,\"\")","v":""},{"$f":"IF('Clearing Calculations'!B1227,'Clearing Calculations'!C1227,\"\")","v":""},"","","",""]
[{"$f":"IF('Clearing Calculations'!A1228=\"\",\"\",'Clearing Calculations'!A1228)","v":""},{"$f":"IF('Clearing Calculations'!A1228,'Clearing Calculations'!B1228,\"\")","v":""},{"$f":"IF('Clearing Calculations'!B1228,'Clearing Calculations'!C1228,\"\")","v":""},"","","",""]
[{"$f":"IF('Clearing Calculations'!A1229=\"\",\"\",'Clearing Calculations'!A1229)","v":""},{"$f":"IF('Clearing Calculations'!A1229,'Clearing Calculations'!B1229,\"\")","v":""},{"$f":"IF('Clearing Calculations'!B1229,'Clearing Calculations'!C1229,\"\")","v":""},"","","",""]
[{"$f":"IF('Clearing Calculations'!A1230=\"\",\"\",'Clearing Calculations'!A1230)","v":""},{"$f":"IF('Clearing Calculations'!A1230,'Clearing Calculations'!B1230,\"\")","v":""},{"$f":"IF('Clearing Calculations'!B1230,'Clearing Calculations'!C1230,\"\")","v":""},"","","",""]
[{"$f":"IF('Clearing Calculations'!A1231=\"\",\"\",'Clearing Calculations'!A1231)","v":""},{"$f":"IF('Clearing Calculations'!A1231,'Clearing Calculations'!B1231,\"\")","v":""},{"$f":"IF('Clearing Calculations'!B1231,'Clearing Calculations'!C1231,\"\")","v":""},"","","",""]
[{"$f":"IF('Clearing Calculations'!A1232=\"\",\"\",'Clearing Calculations'!A1232)","v":""},{"$f":"IF('Clearing Calculations'!A1232,'Clearing Calculations'!B1232,\"\")","v":""},{"$f":"IF('Clearing Calculations'!B1232,'Clearing Calculations'!C1232,\"\")","v":""},"","","",""]
[{"$f":"IF('Clearing Calculations'!A1233=\"\",\"\",'Clearing Calculations'!A1233)","v":""},{"$f":"IF('Clearing Calculations'!A1233,'Clearing Calculations'!B1233,\"\")","v":""},{"$f":"IF('Clearing Calculations'!B1233,'Clearing Calculations'!C1233,\"\")","v":""},"","","",""]
[{"$f":"IF('Clearing Calculations'!A1234=\"\",\"\",'Clearing Calculations'!A1234)","v":""},{"$f":"IF('Clearing Calculations'!A1234,'Clearing Calculations'!B1234,\"\")","v":""},{"$f":"IF('Clearing Calculations'!B1234,'Clearing Calculations'!C1234,\"\")","v":""},"","","",""]
[{"$f":"IF('Clearing Calculations'!A1235=\"\",\"\",'Clearing Calculations'!A1235)","v":""},{"$f":"IF('Clearing Calculations'!A1235,'Clearing Calculations'!B1235,\"\")","v":""},{"$f":"IF('Clearing Calculations'!B1235,'Clearing Calculations'!C1235,\"\")","v":""},"","","",""]
[{"$f":"IF('Clearing Calculations'!A1236=\"\",\"\",'Clearing Calculations'!A1236)","v":""},{"$f":"IF('Clearing Calculations'!A1236,'Clearing Calculations'!B1236,\"\")","v":""},{"$f":"IF('Clearing Calculations'!B1236,'Clearing Calculations'!C1236,\"\")","v":""},"","","",""]
[{"$f":"IF('Clearing Calculations'!A1237=\"\",\"\",'Clearing Calculations'!A1237)","v":""},{"$f":"IF('Clearing Calculations'!A1237,'Clearing Calculations'!B1237,\"\")","v":""},{"$f":"IF('Clearing Calculations'!B1237,'Clearing Calculations'!C1237,\"\")","v":""},"","","",""]
[{"$f":"IF('Clearing Calculations'!A1238=\"\",\"\",'Clearing Calculations'!A1238)","v":""},{"$f":"IF('Clearing Calculations'!A1238,'Clearing Calculations'!B1238,\"\")","v":""},{"$f":"IF('Clearing Calculations'!B1238,'Clearing Calculations'!C1238,\"\")","v":""},"","","",""]
[{"$f":"IF('Clearing Calculations'!A1239=\"\",\"\",'Clearing Calculations'!A1239)","v":""},{"$f":"IF('Clearing Calculations'!A1239,'Clearing Calculations'!B1239,\"\")","v":""},{"$f":"IF('Clearing Calculations'!B1239,'Clearing Calculations'!C1239,\"\")","v":""},"","","",""]
[{"$f":"IF('Clearing Calculations'!A1240=\"\",\"\",'Clearing Calculations'!A1240)","v":""},{"$f":"IF('Clearing Calculations'!A1240,'Clearing Calculations'!B1240,\"\")","v":""},{"$f":"IF('Clearing Calculations'!B1240,'Clearing Calculations'!C1240,\"\")","v":""},"","","",""]
[{"$f":"IF('Clearing Calculations'!A1241=\"\",\"\",'Clearing Calculations'!A1241)","v":""},{"$f":"IF('Clearing Calculations'!A1241,'Clearing Calculations'!B1241,\"\")","v":""},{"$f":"IF('Clearing Calculations'!B1241,'Clearing Calculations'!C1241,\"\")","v":""},"","","",""]
[{"$f":"IF('Clearing Calculations'!A1242=\"\",\"\",'Clearing Calculations'!A1242)","v":""},{"$f":"IF('Clearing Calculations'!A1242,'Clearing Calculations'!B1242,\"\")","v":""},{"$f":"IF('Clearing Calculations'!B1242,'Clearing Calculations'!C1242,\"\")","v":""},"","","",""]
[{"$f":"IF('Clearing Calculations'!A1243=\"\",\"\",'Clearing Calculations'!A1243)","v":""},{"$f":"IF('Clearing Calculations'!A1243,'Clearing Calculations'!B1243,\"\")","v":""},{"$f":"IF('Clearing Calculations'!B1243,'Clearing Calculations'!C1243,\"\")","v":""},"","","",""]
[{"$f":"IF('Clearing Calculations'!A1244=\"\",\"\",'Clearing Calculations'!A1244)","v":""},{"$f":"IF('Clearing Calculations'!A1244,'Clearing Calculations'!B1244,\"\")","v":""},{"$f":"IF('Clearing Calculations'!B1244,'Clearing Calculations'!C1244,\"\")","v":""},"","","",""]
[{"$f":"IF('Clearing Calculations'!A1245=\"\",\"\",'Clearing Calculations'!A1245)","v":""},{"$f":"IF('Clearing Calculations'!A1245,'Clearing Calculations'!B1245,\"\")","v":""},{"$f":"IF('Clearing Calculations'!B1245,'Clearing Calculations'!C1245,\"\")","v":""},"","","",""]
[{"$f":"IF('Clearing Calculations'!A1246=\"\",\"\",'Clearing Calculations'!A1246)","v":""},{"$f":"IF('Clearing Calculations'!A1246,'Clearing Calculations'!B1246,\"\")","v":""},{"$f":"IF('Clearing Calculations'!B1246,'Clearing Calculations'!C1246,\"\")","v":""},"","","",""]
[{"$f":"IF('Clearing Calculations'!A1247=\"\",\"\",'Clearing Calculations'!A1247)","v":""},{"$f":"IF('Clearing Calculations'!A1247,'Clearing Calculations'!B1247,\"\")","v":""},{"$f":"IF('Clearing Calculations'!B1247,'Clearing Calculations'!C1247,\"\")","v":""},"","","",""]
[{"$f":"IF('Clearing Calculations'!A1248=\"\",\"\",'Clearing Calculations'!A1248)","v":""},{"$f":"IF('Clearing Calculations'!A1248,'Clearing Calculations'!B1248,\"\")","v":""},{"$f":"IF('Clearing Calculations'!B1248,'Clearing Calculations'!C1248,\"\")","v":""},"","","",""]
[{"$f":"IF('Clearing Calculations'!A1249=\"\",\"\",'Clearing Calculations'!A1249)","v":""},{"$f":"IF('Clearing Calculations'!A1249,'Clearing Calculations'!B1249,\"\")","v":""},{"$f":"IF('Clearing Calculations'!B1249,'Clearing Calculations'!C1249,\"\")","v":""},"","","",""]
[{"$f":"IF('Clearing Calculations'!A1250=\"\",\"\",'Clearing Calculations'!A1250)","v":""},{"$f":"IF('Clearing Calculations'!A1250,'Clearing Calculations'!B1250,\"\")","v":""},{"$f":"IF('Clearing Calculations'!B1250,'Clearing Calculations'!C1250,\"\")","v":""},"","","",""]
[{"$f":"IF('Clearing Calculations'!A1251=\"\",\"\",'Clearing Calculations'!A1251)","v":""},{"$f":"IF('Clearing Calculations'!A1251,'Clearing Calculations'!B1251,\"\")","v":""},{"$f":"IF('Clearing Calculations'!B1251,'Clearing Calculations'!C1251,\"\")","v":""},"","","",""]
[{"$f":"IF('Clearing Calculations'!A1252=\"\",\"\",'Clearing Calculations'!A1252)","v":""},{"$f":"IF('Clearing Calculations'!A1252,'Clearing Calculations'!B1252,\"\")","v":""},{"$f":"IF('Clearing Calculations'!B1252,'Clearing Calculations'!C1252,\"\")","v":""},"","","",""]
[{"$f":"IF('Clearing Calculations'!A1253=\"\",\"\",'Clearing Calculations'!A1253)","v":""},{"$f":"IF('Clearing Calculations'!A1253,'Clearing Calculations'!B1253,\"\")","v":""},{"$f":"IF('Clearing Calculations'!B1253,'Clearing Calculations'!C1253,\"\")","v":""},"","","",""]
[{"$f":"IF('Clearing Calculations'!A1254=\"\",\"\",'Clearing Calculations'!A1254)","v":""},{"$f":"IF('Clearing Calculations'!A1254,'Clearing Calculations'!B1254,\"\")","v":""},{"$f":"IF('Clearing Calculations'!B1254,'Clearing Calculations'!C1254,\"\")","v":""},"","","",""]
[{"$f":"IF('Clearing Calculations'!A1255=\"\",\"\",'Clearing Calculations'!A1255)","v":""},{"$f":"IF('Clearing Calculations'!A1255,'Clearing Calculations'!B1255,\"\")","v":""},{"$f":"IF('Clearing Calculations'!B1255,'Clearing Calculations'!C1255,\"\")","v":""},"","","",""]
[{"$f":"IF('Clearing Calculations'!A1256=\"\",\"\",'Clearing Calculations'!A1256)","v":""},{"$f":"IF('Clearing Calculations'!A1256,'Clearing Calculations'!B1256,\"\")","v":""},{"$f":"IF('Clearing Calculations'!B1256,'Clearing Calculations'!C1256,\"\")","v":""},"","","",""]
[{"$f":"IF('Clearing Calculations'!A1257=\"\",\"\",'Clearing Calculations'!A1257)","v":""},{"$f":"IF('Clearing Calculations'!A1257,'Clearing Calculations'!B1257,\"\")","v":""},{"$f":"IF('Clearing Calculations'!B1257,'Clearing Calculations'!C1257,\"\")","v":""},"","","",""]
[{"$f":"IF('Clearing Calculations'!A1258=\"\",\"\",'Clearing Calculations'!A1258)","v":""},{"$f":"IF('Clearing Calculations'!A1258,'Clearing Calculations'!B1258,\"\")","v":""},{"$f":"IF('Clearing Calculations'!B1258,'Clearing Calculations'!C1258,\"\")","v":""},"","","",""]
[{"$f":"IF('Clearing Calculations'!A1259=\"\",\"\",'Clearing Calculations'!A1259)","v":""},{"$f":"IF('Clearing Calculations'!A1259,'Clearing Calculations'!B1259,\"\")","v":""},{"$f":"IF('Clearing Calculations'!B1259,'Clearing Calculations'!C1259,\"\")","v":""},"","","",""]
[{"$f":"IF('Clearing Calculations'!A1260=\"\",\"\",'Clearing Calculations'!A1260)","v":""},{"$f":"IF('Clearing Calculations'!A1260,'Clearing Calculations'!B1260,\"\")","v":""},{"$f":"IF('Clearing Calculations'!B1260,'Clearing Calculations'!C1260,\"\")","v":""},{"$f":"IF(A1266=\"\",\"\",$B1266+$C1266)","v":""},{"$f":"IF(A1266=\"\",\"\",(D1266+D1265)/2*(A1266-A1265))","v":""},{"$f":"IF(A1266=\"\",\"\",(E1266/9))","v":""},{"$f":"IF(A1266=\"\",\"\",E1266/$G$3)","v":""}]
[{"$f":"IF('Clearing Calculations'!A1261=\"\",\"\",'Clearing Calculations'!A1261)","v":""},{"$f":"IF('Clearing Calculations'!A1261,'Clearing Calculations'!B1261,\"\")","v":""},{"$f":"IF('Clearing Calculations'!B1261,'Clearing Calculations'!C1261,\"\")","v":""},"","","",""]
[{"$f":"IF('Clearing Calculations'!A1262=\"\",\"\",'Clearing Calculations'!A1262)","v":""},{"$f":"IF('Clearing Calculations'!A1262,'Clearing Calculations'!B1262,\"\")","v":""},{"$f":"IF('Clearing Calculations'!B1262,'Clearing Calculations'!C1262,\"\")","v":""},"","","",""]
[{"$f":"IF('Clearing Calculations'!A1263=\"\",\"\",'Clearing Calculations'!A1263)","v":""},{"$f":"IF('Clearing Calculations'!A1263,'Clearing Calculations'!B1263,\"\")","v":""},{"$f":"IF('Clearing Calculations'!B1263,'Clearing Calculations'!C1263,\"\")","v":""},"","","",""]
[{"$f":"IF('Clearing Calculations'!A1264=\"\",\"\",'Clearing Calculations'!A1264)","v":""},{"$f":"IF('Clearing Calculations'!A1264,'Clearing Calculations'!B1264,\"\")","v":""},{"$f":"IF('Clearing Calculations'!B1264,'Clearing Calculations'!C1264,\"\")","v":""},"","","",""]
[{"$f":"IF('Clearing Calculations'!A1265=\"\",\"\",'Clearing Calculations'!A1265)","v":""},{"$f":"IF('Clearing Calculations'!A1265,'Clearing Calculations'!B1265,\"\")","v":""},{"$f":"IF('Clearing Calculations'!B1265,'Clearing Calculations'!C1265,\"\")","v":""},"","","",""]
[{"$f":"IF('Clearing Calculations'!A1266=\"\",\"\",'Clearing Calculations'!A1266)","v":""},{"$f":"IF('Clearing Calculations'!A1266,'Clearing Calculations'!B1266,\"\")","v":""},{"$f":"IF('Clearing Calculations'!B1266,'Clearing Calculations'!C1266,\"\")","v":""},"","","",""]
[{"$f":"IF('Clearing Calculations'!A1267=\"\",\"\",'Clearing Calculations'!A1267)","v":""},{"$f":"IF('Clearing Calculations'!A1267,'Clearing Calculations'!B1267,\"\")","v":""},{"$f":"IF('Clearing Calculations'!B1267,'Clearing Calculations'!C1267,\"\")","v":""},"","","",""]
[{"$f":"IF('Clearing Calculations'!A1268=\"\",\"\",'Clearing Calculations'!A1268)","v":""},{"$f":"IF('Clearing Calculations'!A1268,'Clearing Calculations'!B1268,\"\")","v":""},{"$f":"IF('Clearing Calculations'!B1268,'Clearing Calculations'!C1268,\"\")","v":""},"","","",""]
[{"$f":"IF('Clearing Calculations'!A1269=\"\",\"\",'Clearing Calculations'!A1269)","v":""},{"$f":"IF('Clearing Calculations'!A1269,'Clearing Calculations'!B1269,\"\")","v":""},{"$f":"IF('Clearing Calculations'!B1269,'Clearing Calculations'!C1269,\"\")","v":""},"","","",""]
[{"$f":"IF('Clearing Calculations'!A1270=\"\",\"\",'Clearing Calculations'!A1270)","v":""},{"$f":"IF('Clearing Calculations'!A1270,'Clearing Calculations'!B1270,\"\")","v":""},{"$f":"IF('Clearing Calculations'!B1270,'Clearing Calculations'!C1270,\"\")","v":""},"","","",""]
[{"$f":"IF('Clearing Calculations'!A1271=\"\",\"\",'Clearing Calculations'!A1271)","v":""},{"$f":"IF('Clearing Calculations'!A1271,'Clearing Calculations'!B1271,\"\")","v":""},{"$f":"IF('Clearing Calculations'!B1271,'Clearing Calculations'!C1271,\"\")","v":""},"","","",""]
[{"$f":"IF('Clearing Calculations'!A1272=\"\",\"\",'Clearing Calculations'!A1272)","v":""},{"$f":"IF('Clearing Calculations'!A1272,'Clearing Calculations'!B1272,\"\")","v":""},{"$f":"IF('Clearing Calculations'!B1272,'Clearing Calculations'!C1272,\"\")","v":""},"","","",""]
[{"$f":"IF('Clearing Calculations'!A1273=\"\",\"\",'Clearing Calculations'!A1273)","v":""},{"$f":"IF('Clearing Calculations'!A1273,'Clearing Calculations'!B1273,\"\")","v":""},{"$f":"IF('Clearing Calculations'!B1273,'Clearing Calculations'!C1273,\"\")","v":""},"","","",""]
[{"$f":"IF('Clearing Calculations'!A1274=\"\",\"\",'Clearing Calculations'!A1274)","v":""},{"$f":"IF('Clearing Calculations'!A1274,'Clearing Calculations'!B1274,\"\")","v":""},{"$f":"IF('Clearing Calculations'!B1274,'Clearing Calculations'!C1274,\"\")","v":""},"","","",""]
[{"$f":"IF('Clearing Calculations'!A1275=\"\",\"\",'Clearing Calculations'!A1275)","v":""},{"$f":"IF('Clearing Calculations'!A1275,'Clearing Calculations'!B1275,\"\")","v":""},{"$f":"IF('Clearing Calculations'!B1275,'Clearing Calculations'!C1275,\"\")","v":""},"","","",""]
[{"$f":"IF('Clearing Calculations'!A1276=\"\",\"\",'Clearing Calculations'!A1276)","v":""},{"$f":"IF('Clearing Calculations'!A1276,'Clearing Calculations'!B1276,\"\")","v":""},{"$f":"IF('Clearing Calculations'!B1276,'Clearing Calculations'!C1276,\"\")","v":""},"","","",""]
[{"$f":"IF('Clearing Calculations'!A1277=\"\",\"\",'Clearing Calculations'!A1277)","v":""},{"$f":"IF('Clearing Calculations'!A1277,'Clearing Calculations'!B1277,\"\")","v":""},{"$f":"IF('Clearing Calculations'!B1277,'Clearing Calculations'!C1277,\"\")","v":""},"","","",""]
[{"$f":"IF('Clearing Calculations'!A1278=\"\",\"\",'Clearing Calculations'!A1278)","v":""},{"$f":"IF('Clearing Calculations'!A1278,'Clearing Calculations'!B1278,\"\")","v":""},{"$f":"IF('Clearing Calculations'!B1278,'Clearing Calculations'!C1278,\"\")","v":""},"","","",""]
[{"$f":"IF('Clearing Calculations'!A1279=\"\",\"\",'Clearing Calculations'!A1279)","v":""},{"$f":"IF('Clearing Calculations'!A1279,'Clearing Calculations'!B1279,\"\")","v":""},{"$f":"IF('Clearing Calculations'!B1279,'Clearing Calculations'!C1279,\"\")","v":""},"","","",""]
[{"$f":"IF('Clearing Calculations'!A1280=\"\",\"\",'Clearing Calculations'!A1280)","v":""},{"$f":"IF('Clearing Calculations'!A1280,'Clearing Calculations'!B1280,\"\")","v":""},{"$f":"IF('Clearing Calculations'!B1280,'Clearing Calculations'!C1280,\"\")","v":""},"","","",""]
[{"$f":"IF('Clearing Calculations'!A1281=\"\",\"\",'Clearing Calculations'!A1281)","v":""},{"$f":"IF('Clearing Calculations'!A1281,'Clearing Calculations'!B1281,\"\")","v":""},{"$f":"IF('Clearing Calculations'!B1281,'Clearing Calculations'!C1281,\"\")","v":""},"","","",""]
[{"$f":"IF('Clearing Calculations'!A1282=\"\",\"\",'Clearing Calculations'!A1282)","v":""},{"$f":"IF('Clearing Calculations'!A1282,'Clearing Calculations'!B1282,\"\")","v":""},{"$f":"IF('Clearing Calculations'!B1282,'Clearing Calculations'!C1282,\"\")","v":""},"","","",""]
[{"$f":"IF('Clearing Calculations'!A1283=\"\",\"\",'Clearing Calculations'!A1283)","v":""},{"$f":"IF('Clearing Calculations'!A1283,'Clearing Calculations'!B1283,\"\")","v":""},{"$f":"IF('Clearing Calculations'!B1283,'Clearing Calculations'!C1283,\"\")","v":""},"","","",""]
[{"$f":"IF('Clearing Calculations'!A1284=\"\",\"\",'Clearing Calculations'!A1284)","v":""},{"$f":"IF('Clearing Calculations'!A1284,'Clearing Calculations'!B1284,\"\")","v":""},{"$f":"IF('Clearing Calculations'!B1284,'Clearing Calculations'!C1284,\"\")","v":""},"","","",""]
[{"$f":"IF('Clearing Calculations'!A1285=\"\",\"\",'Clearing Calculations'!A1285)","v":""},{"$f":"IF('Clearing Calculations'!A1285,'Clearing Calculations'!B1285,\"\")","v":""},{"$f":"IF('Clearing Calculations'!B1285,'Clearing Calculations'!C1285,\"\")","v":""},"","","",""]
[{"$f":"IF('Clearing Calculations'!A1286=\"\",\"\",'Clearing Calculations'!A1286)","v":""},{"$f":"IF('Clearing Calculations'!A1286,'Clearing Calculations'!B1286,\"\")","v":""},{"$f":"IF('Clearing Calculations'!B1286,'Clearing Calculations'!C1286,\"\")","v":""},"","","",""]
[{"$f":"IF('Clearing Calculations'!A1287=\"\",\"\",'Clearing Calculations'!A1287)","v":""},{"$f":"IF('Clearing Calculations'!A1287,'Clearing Calculations'!B1287,\"\")","v":""},{"$f":"IF('Clearing Calculations'!B1287,'Clearing Calculations'!C1287,\"\")","v":""},"","","",""]
[{"$f":"IF('Clearing Calculations'!A1288=\"\",\"\",'Clearing Calculations'!A1288)","v":""},{"$f":"IF('Clearing Calculations'!A1288,'Clearing Calculations'!B1288,\"\")","v":""},{"$f":"IF('Clearing Calculations'!B1288,'Clearing Calculations'!C1288,\"\")","v":""},"","","",""]
[{"$f":"IF('Clearing Calculations'!A1289=\"\",\"\",'Clearing Calculations'!A1289)","v":""},{"$f":"IF('Clearing Calculations'!A1289,'Clearing Calculations'!B1289,\"\")","v":""},{"$f":"IF('Clearing Calculations'!B1289,'Clearing Calculations'!C1289,\"\")","v":""},"","","",""]
[{"$f":"IF('Clearing Calculations'!A1290=\"\",\"\",'Clearing Calculations'!A1290)","v":""},{"$f":"IF('Clearing Calculations'!A1290,'Clearing Calculations'!B1290,\"\")","v":""},{"$f":"IF('Clearing Calculations'!B1290,'Clearing Calculations'!C1290,\"\")","v":""},"","","",""]
[{"$f":"IF('Clearing Calculations'!A1291=\"\",\"\",'Clearing Calculations'!A1291)","v":""},{"$f":"IF('Clearing Calculations'!A1291,'Clearing Calculations'!B1291,\"\")","v":""},{"$f":"IF('Clearing Calculations'!B1291,'Clearing Calculations'!C1291,\"\")","v":""},"","","",""]
[{"$f":"IF('Clearing Calculations'!A1292=\"\",\"\",'Clearing Calculations'!A1292)","v":""},{"$f":"IF('Clearing Calculations'!A1292,'Clearing Calculations'!B1292,\"\")","v":""},{"$f":"IF('Clearing Calculations'!B1292,'Clearing Calculations'!C1292,\"\")","v":""},"","","",""]
[{"$f":"IF('Clearing Calculations'!A1293=\"\",\"\",'Clearing Calculations'!A1293)","v":""},{"$f":"IF('Clearing Calculations'!A1293,'Clearing Calculations'!B1293,\"\")","v":""},{"$f":"IF('Clearing Calculations'!B1293,'Clearing Calculations'!C1293,\"\")","v":""},"","","",""]
[{"$f":"IF('Clearing Calculations'!A1294=\"\",\"\",'Clearing Calculations'!A1294)","v":""},{"$f":"IF('Clearing Calculations'!A1294,'Clearing Calculations'!B1294,\"\")","v":""},{"$f":"IF('Clearing Calculations'!B1294,'Clearing Calculations'!C1294,\"\")","v":""},"","","",""]
[{"$f":"IF('Clearing Calculations'!A1295=\"\",\"\",'Clearing Calculations'!A1295)","v":""},{"$f":"IF('Clearing Calculations'!A1295,'Clearing Calculations'!B1295,\"\")","v":""},{"$f":"IF('Clearing Calculations'!B1295,'Clearing Calculations'!C1295,\"\")","v":""},"","","",""]
[{"$f":"IF('Clearing Calculations'!A1296=\"\",\"\",'Clearing Calculations'!A1296)","v":""},{"$f":"IF('Clearing Calculations'!A1296,'Clearing Calculations'!B1296,\"\")","v":""},{"$f":"IF('Clearing Calculations'!B1296,'Clearing Calculations'!C1296,\"\")","v":""},"","","",""]
[{"$f":"IF('Clearing Calculations'!A1297=\"\",\"\",'Clearing Calculations'!A1297)","v":""},{"$f":"IF('Clearing Calculations'!A1297,'Clearing Calculations'!B1297,\"\")","v":""},{"$f":"IF('Clearing Calculations'!B1297,'Clearing Calculations'!C1297,\"\")","v":""},"","","",""]
[{"$f":"IF('Clearing Calculations'!A1298=\"\",\"\",'Clearing Calculations'!A1298)","v":""},{"$f":"IF('Clearing Calculations'!A1298,'Clearing Calculations'!B1298,\"\")","v":""},{"$f":"IF('Clearing Calculations'!B1298,'Clearing Calculations'!C1298,\"\")","v":""},"","","",""]
[{"$f":"IF('Clearing Calculations'!A1299=\"\",\"\",'Clearing Calculations'!A1299)","v":""},{"$f":"IF('Clearing Calculations'!A1299,'Clearing Calculations'!B1299,\"\")","v":""},{"$f":"IF('Clearing Calculations'!B1299,'Clearing Calculations'!C1299,\"\")","v":""},"","","",""]
[{"$f":"IF('Clearing Calculations'!A1300=\"\",\"\",'Clearing Calculations'!A1300)","v":""},{"$f":"IF('Clearing Calculations'!A1300,'Clearing Calculations'!B1300,\"\")","v":""},{"$f":"IF('Clearing Calculations'!B1300,'Clearing Calculations'!C1300,\"\")","v":""},"","","",""]
[{"$f":"IF('Clearing Calculations'!A1301=\"\",\"\",'Clearing Calculations'!A1301)","v":""},{"$f":"IF('Clearing Calculations'!A1301,'Clearing Calculations'!B1301,\"\")","v":""},{"$f":"IF('Clearing Calculations'!B1301,'Clearing Calculations'!C1301,\"\")","v":""},"","","",""]
[{"$f":"IF('Clearing Calculations'!A1302=\"\",\"\",'Clearing Calculations'!A1302)","v":""},{"$f":"IF('Clearing Calculations'!A1302,'Clearing Calculations'!B1302,\"\")","v":""},{"$f":"IF('Clearing Calculations'!B1302,'Clearing Calculations'!C1302,\"\")","v":""},"","","",""]
[{"$f":"IF('Clearing Calculations'!A1303=\"\",\"\",'Clearing Calculations'!A1303)","v":""},{"$f":"IF('Clearing Calculations'!A1303,'Clearing Calculations'!B1303,\"\")","v":""},{"$f":"IF('Clearing Calculations'!B1303,'Clearing Calculations'!C1303,\"\")","v":""},"","","",""]
[{"$f":"IF('Clearing Calculations'!A1304=\"\",\"\",'Clearing Calculations'!A1304)","v":""},{"$f":"IF('Clearing Calculations'!A1304,'Clearing Calculations'!B1304,\"\")","v":""},{"$f":"IF('Clearing Calculations'!B1304,'Clearing Calculations'!C1304,\"\")","v":""},"","","",""]
[{"$f":"IF('Clearing Calculations'!A1305=\"\",\"\",'Clearing Calculations'!A1305)","v":""},{"$f":"IF('Clearing Calculations'!A1305,'Clearing Calculations'!B1305,\"\")","v":""},{"$f":"IF('Clearing Calculations'!B1305,'Clearing Calculations'!C1305,\"\")","v":""},"","","",""]
[{"$f":"IF('Clearing Calculations'!A1306=\"\",\"\",'Clearing Calculations'!A1306)","v":""},{"$f":"IF('Clearing Calculations'!A1306,'Clearing Calculations'!B1306,\"\")","v":""},{"$f":"IF('Clearing Calculations'!B1306,'Clearing Calculations'!C1306,\"\")","v":""},"","","",""]
[{"$f":"IF('Clearing Calculations'!A1307=\"\",\"\",'Clearing Calculations'!A1307)","v":""},{"$f":"IF('Clearing Calculations'!A1307,'Clearing Calculations'!B1307,\"\")","v":""},{"$f":"IF('Clearing Calculations'!B1307,'Clearing Calculations'!C1307,\"\")","v":""},"","","",""]
[{"$f":"IF('Clearing Calculations'!A1308=\"\",\"\",'Clearing Calculations'!A1308)","v":""},{"$f":"IF('Clearing Calculations'!A1308,'Clearing Calculations'!B1308,\"\")","v":""},{"$f":"IF('Clearing Calculations'!B1308,'Clearing Calculations'!C1308,\"\")","v":""},"","","",""]
[{"$f":"IF('Clearing Calculations'!A1309=\"\",\"\",'Clearing Calculations'!A1309)","v":""},{"$f":"IF('Clearing Calculations'!A1309,'Clearing Calculations'!B1309,\"\")","v":""},{"$f":"IF('Clearing Calculations'!B1309,'Clearing Calculations'!C1309,\"\")","v":""},"","","",""]
[{"$f":"IF('Clearing Calculations'!A1310=\"\",\"\",'Clearing Calculations'!A1310)","v":""},{"$f":"IF('Clearing Calculations'!A1310,'Clearing Calculations'!B1310,\"\")","v":""},{"$f":"IF('Clearing Calculations'!B1310,'Clearing Calculations'!C1310,\"\")","v":""},"","","",""]
[{"$f":"IF('Clearing Calculations'!A1311=\"\",\"\",'Clearing Calculations'!A1311)","v":""},{"$f":"IF('Clearing Calculations'!A1311,'Clearing Calculations'!B1311,\"\")","v":""},{"$f":"IF('Clearing Calculations'!B1311,'Clearing Calculations'!C1311,\"\")","v":""},"","","",""]
[{"$f":"IF('Clearing Calculations'!A1312=\"\",\"\",'Clearing Calculations'!A1312)","v":""},{"$f":"IF('Clearing Calculations'!A1312,'Clearing Calculations'!B1312,\"\")","v":""},{"$f":"IF('Clearing Calculations'!B1312,'Clearing Calculations'!C1312,\"\")","v":""},"","","",""]
[{"$f":"IF('Clearing Calculations'!A1313=\"\",\"\",'Clearing Calculations'!A1313)","v":""},{"$f":"IF('Clearing Calculations'!A1313,'Clearing Calculations'!B1313,\"\")","v":""},{"$f":"IF('Clearing Calculations'!B1313,'Clearing Calculations'!C1313,\"\")","v":""},"","","",""]
[{"$f":"IF('Clearing Calculations'!A1314=\"\",\"\",'Clearing Calculations'!A1314)","v":""},{"$f":"IF('Clearing Calculations'!A1314,'Clearing Calculations'!B1314,\"\")","v":""},{"$f":"IF('Clearing Calculations'!B1314,'Clearing Calculations'!C1314,\"\")","v":""},"","","",""]
[{"$f":"IF('Clearing Calculations'!A1315=\"\",\"\",'Clearing Calculations'!A1315)","v":""},{"$f":"IF('Clearing Calculations'!A1315,'Clearing Calculations'!B1315,\"\")","v":""},{"$f":"IF('Clearing Calculations'!B1315,'Clearing Calculations'!C1315,\"\")","v":""},"","","",""]
[{"$f":"IF('Clearing Calculations'!A1316=\"\",\"\",'Clearing Calculations'!A1316)","v":""},{"$f":"IF('Clearing Calculations'!A1316,'Clearing Calculations'!B1316,\"\")","v":""},{"$f":"IF('Clearing Calculations'!B1316,'Clearing Calculations'!C1316,\"\")","v":""},"","","",""]
[{"$f":"IF('Clearing Calculations'!A1317=\"\",\"\",'Clearing Calculations'!A1317)","v":""},{"$f":"IF('Clearing Calculations'!A1317,'Clearing Calculations'!B1317,\"\")","v":""},{"$f":"IF('Clearing Calculations'!B1317,'Clearing Calculations'!C1317,\"\")","v":""},"","","",""]
[{"$f":"IF('Clearing Calculations'!A1318=\"\",\"\",'Clearing Calculations'!A1318)","v":""},{"$f":"IF('Clearing Calculations'!A1318,'Clearing Calculations'!B1318,\"\")","v":""},{"$f":"IF('Clearing Calculations'!B1318,'Clearing Calculations'!C1318,\"\")","v":""},"","","",""]
[{"$f":"IF('Clearing Calculations'!A1319=\"\",\"\",'Clearing Calculations'!A1319)","v":""},{"$f":"IF('Clearing Calculations'!A1319,'Clearing Calculations'!B1319,\"\")","v":""},{"$f":"IF('Clearing Calculations'!B1319,'Clearing Calculations'!C1319,\"\")","v":""},"","","",""]
[{"$f":"IF('Clearing Calculations'!A1320=\"\",\"\",'Clearing Calculations'!A1320)","v":""},{"$f":"IF('Clearing Calculations'!A1320,'Clearing Calculations'!B1320,\"\")","v":""},{"$f":"IF('Clearing Calculations'!B1320,'Clearing Calculations'!C1320,\"\")","v":""},"","","",""]
[{"$f":"IF('Clearing Calculations'!A1321=\"\",\"\",'Clearing Calculations'!A1321)","v":""},{"$f":"IF('Clearing Calculations'!A1321,'Clearing Calculations'!B1321,\"\")","v":""},{"$f":"IF('Clearing Calculations'!B1321,'Clearing Calculations'!C1321,\"\")","v":""},"","","",""]
[{"$f":"IF('Clearing Calculations'!A1322=\"\",\"\",'Clearing Calculations'!A1322)","v":""},{"$f":"IF('Clearing Calculations'!A1322,'Clearing Calculations'!B1322,\"\")","v":""},{"$f":"IF('Clearing Calculations'!B1322,'Clearing Calculations'!C1322,\"\")","v":""},"","","",""]
[{"$f":"IF('Clearing Calculations'!A1323=\"\",\"\",'Clearing Calculations'!A1323)","v":""},{"$f":"IF('Clearing Calculations'!A1323,'Clearing Calculations'!B1323,\"\")","v":""},{"$f":"IF('Clearing Calculations'!B1323,'Clearing Calculations'!C1323,\"\")","v":""},"","","",""]
[{"$f":"IF('Clearing Calculations'!A1324=\"\",\"\",'Clearing Calculations'!A1324)","v":""},{"$f":"IF('Clearing Calculations'!A1324,'Clearing Calculations'!B1324,\"\")","v":""},{"$f":"IF('Clearing Calculations'!B1324,'Clearing Calculations'!C1324,\"\")","v":""},{"$f":"IF(A1330=\"\",\"\",$B1330+$C1330)","v":""},{"$f":"IF(A1330=\"\",\"\",(D1330+D1329)/2*(A1330-A1329))","v":""},{"$f":"IF(A1330=\"\",\"\",(E1330/9))","v":""},{"$f":"IF(A1330=\"\",\"\",E1330/$G$3)","v":""}]
[{"$f":"IF('Clearing Calculations'!A1325=\"\",\"\",'Clearing Calculations'!A1325)","v":""},{"$f":"IF('Clearing Calculations'!A1325,'Clearing Calculations'!B1325,\"\")","v":""},{"$f":"IF('Clearing Calculations'!B1325,'Clearing Calculations'!C1325,\"\")","v":""},"","","",""]
[{"$f":"IF('Clearing Calculations'!A1326=\"\",\"\",'Clearing Calculations'!A1326)","v":""},{"$f":"IF('Clearing Calculations'!A1326,'Clearing Calculations'!B1326,\"\")","v":""},{"$f":"IF('Clearing Calculations'!B1326,'Clearing Calculations'!C1326,\"\")","v":""},"","","",""]
[{"$f":"IF('Clearing Calculations'!A1327=\"\",\"\",'Clearing Calculations'!A1327)","v":""},{"$f":"IF('Clearing Calculations'!A1327,'Clearing Calculations'!B1327,\"\")","v":""},{"$f":"IF('Clearing Calculations'!B1327,'Clearing Calculations'!C1327,\"\")","v":""},"","","",""]
[{"$f":"IF('Clearing Calculations'!A1328=\"\",\"\",'Clearing Calculations'!A1328)","v":""},{"$f":"IF('Clearing Calculations'!A1328,'Clearing Calculations'!B1328,\"\")","v":""},{"$f":"IF('Clearing Calculations'!B1328,'Clearing Calculations'!C1328,\"\")","v":""},"","","",""]
[{"$f":"IF('Clearing Calculations'!A1329=\"\",\"\",'Clearing Calculations'!A1329)","v":""},{"$f":"IF('Clearing Calculations'!A1329,'Clearing Calculations'!B1329,\"\")","v":""},{"$f":"IF('Clearing Calculations'!B1329,'Clearing Calculations'!C1329,\"\")","v":""},"","","",""]
[{"$f":"IF('Clearing Calculations'!A1330=\"\",\"\",'Clearing Calculations'!A1330)","v":""},{"$f":"IF('Clearing Calculations'!A1330,'Clearing Calculations'!B1330,\"\")","v":""},{"$f":"IF('Clearing Calculations'!B1330,'Clearing Calculations'!C1330,\"\")","v":""},"","","",""]
[{"$f":"IF('Clearing Calculations'!A1331=\"\",\"\",'Clearing Calculations'!A1331)","v":""},{"$f":"IF('Clearing Calculations'!A1331,'Clearing Calculations'!B1331,\"\")","v":""},{"$f":"IF('Clearing Calculations'!B1331,'Clearing Calculations'!C1331,\"\")","v":""},"","","",""]
[{"$f":"IF('Clearing Calculations'!A1332=\"\",\"\",'Clearing Calculations'!A1332)","v":""},{"$f":"IF('Clearing Calculations'!A1332,'Clearing Calculations'!B1332,\"\")","v":""},{"$f":"IF('Clearing Calculations'!B1332,'Clearing Calculations'!C1332,\"\")","v":""},"","","",""]
[{"$f":"IF('Clearing Calculations'!A1333=\"\",\"\",'Clearing Calculations'!A1333)","v":""},{"$f":"IF('Clearing Calculations'!A1333,'Clearing Calculations'!B1333,\"\")","v":""},{"$f":"IF('Clearing Calculations'!B1333,'Clearing Calculations'!C1333,\"\")","v":""},"","","",""]
[{"$f":"IF('Clearing Calculations'!A1334=\"\",\"\",'Clearing Calculations'!A1334)","v":""},{"$f":"IF('Clearing Calculations'!A1334,'Clearing Calculations'!B1334,\"\")","v":""},{"$f":"IF('Clearing Calculations'!B1334,'Clearing Calculations'!C1334,\"\")","v":""},"","","",""]
[{"$f":"IF('Clearing Calculations'!A1335=\"\",\"\",'Clearing Calculations'!A1335)","v":""},{"$f":"IF('Clearing Calculations'!A1335,'Clearing Calculations'!B1335,\"\")","v":""},{"$f":"IF('Clearing Calculations'!B1335,'Clearing Calculations'!C1335,\"\")","v":""},"","","",""]
[{"$f":"IF('Clearing Calculations'!A1336=\"\",\"\",'Clearing Calculations'!A1336)","v":""},{"$f":"IF('Clearing Calculations'!A1336,'Clearing Calculations'!B1336,\"\")","v":""},{"$f":"IF('Clearing Calculations'!B1336,'Clearing Calculations'!C1336,\"\")","v":""},"","","",""]
[{"$f":"IF('Clearing Calculations'!A1337=\"\",\"\",'Clearing Calculations'!A1337)","v":""},{"$f":"IF('Clearing Calculations'!A1337,'Clearing Calculations'!B1337,\"\")","v":""},{"$f":"IF('Clearing Calculations'!B1337,'Clearing Calculations'!C1337,\"\")","v":""},"","","",""]
[{"$f":"IF('Clearing Calculations'!A1338=\"\",\"\",'Clearing Calculations'!A1338)","v":""},{"$f":"IF('Clearing Calculations'!A1338,'Clearing Calculations'!B1338,\"\")","v":""},{"$f":"IF('Clearing Calculations'!B1338,'Clearing Calculations'!C1338,\"\")","v":""},"","","",""]
[{"$f":"IF('Clearing Calculations'!A1339=\"\",\"\",'Clearing Calculations'!A1339)","v":""},{"$f":"IF('Clearing Calculations'!A1339,'Clearing Calculations'!B1339,\"\")","v":""},{"$f":"IF('Clearing Calculations'!B1339,'Clearing Calculations'!C1339,\"\")","v":""},"","","",""]
[{"$f":"IF('Clearing Calculations'!A1340=\"\",\"\",'Clearing Calculations'!A1340)","v":""},{"$f":"IF('Clearing Calculations'!A1340,'Clearing Calculations'!B1340,\"\")","v":""},{"$f":"IF('Clearing Calculations'!B1340,'Clearing Calculations'!C1340,\"\")","v":""},"","","",""]
[{"$f":"IF('Clearing Calculations'!A1341=\"\",\"\",'Clearing Calculations'!A1341)","v":""},{"$f":"IF('Clearing Calculations'!A1341,'Clearing Calculations'!B1341,\"\")","v":""},{"$f":"IF('Clearing Calculations'!B1341,'Clearing Calculations'!C1341,\"\")","v":""},"","","",""]
[{"$f":"IF('Clearing Calculations'!A1342=\"\",\"\",'Clearing Calculations'!A1342)","v":""},{"$f":"IF('Clearing Calculations'!A1342,'Clearing Calculations'!B1342,\"\")","v":""},{"$f":"IF('Clearing Calculations'!B1342,'Clearing Calculations'!C1342,\"\")","v":""},"","","",""]
[{"$f":"IF('Clearing Calculations'!A1343=\"\",\"\",'Clearing Calculations'!A1343)","v":""},{"$f":"IF('Clearing Calculations'!A1343,'Clearing Calculations'!B1343,\"\")","v":""},{"$f":"IF('Clearing Calculations'!B1343,'Clearing Calculations'!C1343,\"\")","v":""},"","","",""]
[{"$f":"IF('Clearing Calculations'!A1344=\"\",\"\",'Clearing Calculations'!A1344)","v":""},{"$f":"IF('Clearing Calculations'!A1344,'Clearing Calculations'!B1344,\"\")","v":""},{"$f":"IF('Clearing Calculations'!B1344,'Clearing Calculations'!C1344,\"\")","v":""},"","","",""]
[{"$f":"IF('Clearing Calculations'!A1345=\"\",\"\",'Clearing Calculations'!A1345)","v":""},{"$f":"IF('Clearing Calculations'!A1345,'Clearing Calculations'!B1345,\"\")","v":""},{"$f":"IF('Clearing Calculations'!B1345,'Clearing Calculations'!C1345,\"\")","v":""},"","","",""]
[{"$f":"IF('Clearing Calculations'!A1346=\"\",\"\",'Clearing Calculations'!A1346)","v":""},{"$f":"IF('Clearing Calculations'!A1346,'Clearing Calculations'!B1346,\"\")","v":""},{"$f":"IF('Clearing Calculations'!B1346,'Clearing Calculations'!C1346,\"\")","v":""},"","","",""]
[{"$f":"IF('Clearing Calculations'!A1347=\"\",\"\",'Clearing Calculations'!A1347)","v":""},{"$f":"IF('Clearing Calculations'!A1347,'Clearing Calculations'!B1347,\"\")","v":""},{"$f":"IF('Clearing Calculations'!B1347,'Clearing Calculations'!C1347,\"\")","v":""},"","","",""]
[{"$f":"IF('Clearing Calculations'!A1348=\"\",\"\",'Clearing Calculations'!A1348)","v":""},{"$f":"IF('Clearing Calculations'!A1348,'Clearing Calculations'!B1348,\"\")","v":""},{"$f":"IF('Clearing Calculations'!B1348,'Clearing Calculations'!C1348,\"\")","v":""},"","","",""]
[{"$f":"IF('Clearing Calculations'!A1349=\"\",\"\",'Clearing Calculations'!A1349)","v":""},{"$f":"IF('Clearing Calculations'!A1349,'Clearing Calculations'!B1349,\"\")","v":""},{"$f":"IF('Clearing Calculations'!B1349,'Clearing Calculations'!C1349,\"\")","v":""},"","","",""]
[{"$f":"IF('Clearing Calculations'!A1350=\"\",\"\",'Clearing Calculations'!A1350)","v":""},{"$f":"IF('Clearing Calculations'!A1350,'Clearing Calculations'!B1350,\"\")","v":""},{"$f":"IF('Clearing Calculations'!B1350,'Clearing Calculations'!C1350,\"\")","v":""},"","","",""]
[{"$f":"IF('Clearing Calculations'!A1351=\"\",\"\",'Clearing Calculations'!A1351)","v":""},{"$f":"IF('Clearing Calculations'!A1351,'Clearing Calculations'!B1351,\"\")","v":""},{"$f":"IF('Clearing Calculations'!B1351,'Clearing Calculations'!C1351,\"\")","v":""},"","","",""]
[{"$f":"IF('Clearing Calculations'!A1352=\"\",\"\",'Clearing Calculations'!A1352)","v":""},{"$f":"IF('Clearing Calculations'!A1352,'Clearing Calculations'!B1352,\"\")","v":""},{"$f":"IF('Clearing Calculations'!B1352,'Clearing Calculations'!C1352,\"\")","v":""},"","","",""]
[{"$f":"IF('Clearing Calculations'!A1353=\"\",\"\",'Clearing Calculations'!A1353)","v":""},{"$f":"IF('Clearing Calculations'!A1353,'Clearing Calculations'!B1353,\"\")","v":""},{"$f":"IF('Clearing Calculations'!B1353,'Clearing Calculations'!C1353,\"\")","v":""},"","","",""]
[{"$f":"IF('Clearing Calculations'!A1354=\"\",\"\",'Clearing Calculations'!A1354)","v":""},{"$f":"IF('Clearing Calculations'!A1354,'Clearing Calculations'!B1354,\"\")","v":""},{"$f":"IF('Clearing Calculations'!B1354,'Clearing Calculations'!C1354,\"\")","v":""},"","","",""]
[{"$f":"IF('Clearing Calculations'!A1355=\"\",\"\",'Clearing Calculations'!A1355)","v":""},{"$f":"IF('Clearing Calculations'!A1355,'Clearing Calculations'!B1355,\"\")","v":""},{"$f":"IF('Clearing Calculations'!B1355,'Clearing Calculations'!C1355,\"\")","v":""},"","","",""]
[{"$f":"IF('Clearing Calculations'!A1356=\"\",\"\",'Clearing Calculations'!A1356)","v":""},{"$f":"IF('Clearing Calculations'!A1356,'Clearing Calculations'!B1356,\"\")","v":""},{"$f":"IF('Clearing Calculations'!B1356,'Clearing Calculations'!C1356,\"\")","v":""},"","","",""]
[{"$f":"IF('Clearing Calculations'!A1357=\"\",\"\",'Clearing Calculations'!A1357)","v":""},{"$f":"IF('Clearing Calculations'!A1357,'Clearing Calculations'!B1357,\"\")","v":""},{"$f":"IF('Clearing Calculations'!B1357,'Clearing Calculations'!C1357,\"\")","v":""},"","","",""]
[{"$f":"IF('Clearing Calculations'!A1358=\"\",\"\",'Clearing Calculations'!A1358)","v":""},{"$f":"IF('Clearing Calculations'!A1358,'Clearing Calculations'!B1358,\"\")","v":""},{"$f":"IF('Clearing Calculations'!B1358,'Clearing Calculations'!C1358,\"\")","v":""},"","","",""]
[{"$f":"IF('Clearing Calculations'!A1359=\"\",\"\",'Clearing Calculations'!A1359)","v":""},{"$f":"IF('Clearing Calculations'!A1359,'Clearing Calculations'!B1359,\"\")","v":""},{"$f":"IF('Clearing Calculations'!B1359,'Clearing Calculations'!C1359,\"\")","v":""},"","","",""]
[{"$f":"IF('Clearing Calculations'!A1360=\"\",\"\",'Clearing Calculations'!A1360)","v":""},{"$f":"IF('Clearing Calculations'!A1360,'Clearing Calculations'!B1360,\"\")","v":""},{"$f":"IF('Clearing Calculations'!B1360,'Clearing Calculations'!C1360,\"\")","v":""},"","","",""]
[{"$f":"IF('Clearing Calculations'!A1361=\"\",\"\",'Clearing Calculations'!A1361)","v":""},{"$f":"IF('Clearing Calculations'!A1361,'Clearing Calculations'!B1361,\"\")","v":""},{"$f":"IF('Clearing Calculations'!B1361,'Clearing Calculations'!C1361,\"\")","v":""},"","","",""]
[{"$f":"IF('Clearing Calculations'!A1362=\"\",\"\",'Clearing Calculations'!A1362)","v":""},{"$f":"IF('Clearing Calculations'!A1362,'Clearing Calculations'!B1362,\"\")","v":""},{"$f":"IF('Clearing Calculations'!B1362,'Clearing Calculations'!C1362,\"\")","v":""},"","","",""]
[{"$f":"IF('Clearing Calculations'!A1363=\"\",\"\",'Clearing Calculations'!A1363)","v":""},{"$f":"IF('Clearing Calculations'!A1363,'Clearing Calculations'!B1363,\"\")","v":""},{"$f":"IF('Clearing Calculations'!B1363,'Clearing Calculations'!C1363,\"\")","v":""},"","","",""]
[{"$f":"IF('Clearing Calculations'!A1364=\"\",\"\",'Clearing Calculations'!A1364)","v":""},{"$f":"IF('Clearing Calculations'!A1364,'Clearing Calculations'!B1364,\"\")","v":""},{"$f":"IF('Clearing Calculations'!B1364,'Clearing Calculations'!C1364,\"\")","v":""},"","","",""]
[{"$f":"IF('Clearing Calculations'!A1365=\"\",\"\",'Clearing Calculations'!A1365)","v":""},{"$f":"IF('Clearing Calculations'!A1365,'Clearing Calculations'!B1365,\"\")","v":""},{"$f":"IF('Clearing Calculations'!B1365,'Clearing Calculations'!C1365,\"\")","v":""},"","","",""]
[{"$f":"IF('Clearing Calculations'!A1366=\"\",\"\",'Clearing Calculations'!A1366)","v":""},{"$f":"IF('Clearing Calculations'!A1366,'Clearing Calculations'!B1366,\"\")","v":""},{"$f":"IF('Clearing Calculations'!B1366,'Clearing Calculations'!C1366,\"\")","v":""},"","","",""]
[{"$f":"IF('Clearing Calculations'!A1367=\"\",\"\",'Clearing Calculations'!A1367)","v":""},{"$f":"IF('Clearing Calculations'!A1367,'Clearing Calculations'!B1367,\"\")","v":""},{"$f":"IF('Clearing Calculations'!B1367,'Clearing Calculations'!C1367,\"\")","v":""},"","","",""]
[{"$f":"IF('Clearing Calculations'!A1368=\"\",\"\",'Clearing Calculations'!A1368)","v":""},{"$f":"IF('Clearing Calculations'!A1368,'Clearing Calculations'!B1368,\"\")","v":""},{"$f":"IF('Clearing Calculations'!B1368,'Clearing Calculations'!C1368,\"\")","v":""},"","","",""]
[{"$f":"IF('Clearing Calculations'!A1369=\"\",\"\",'Clearing Calculations'!A1369)","v":""},{"$f":"IF('Clearing Calculations'!A1369,'Clearing Calculations'!B1369,\"\")","v":""},{"$f":"IF('Clearing Calculations'!B1369,'Clearing Calculations'!C1369,\"\")","v":""},"","","",""]
[{"$f":"IF('Clearing Calculations'!A1370=\"\",\"\",'Clearing Calculations'!A1370)","v":""},{"$f":"IF('Clearing Calculations'!A1370,'Clearing Calculations'!B1370,\"\")","v":""},{"$f":"IF('Clearing Calculations'!B1370,'Clearing Calculations'!C1370,\"\")","v":""},"","","",""]
[{"$f":"IF('Clearing Calculations'!A1371=\"\",\"\",'Clearing Calculations'!A1371)","v":""},{"$f":"IF('Clearing Calculations'!A1371,'Clearing Calculations'!B1371,\"\")","v":""},{"$f":"IF('Clearing Calculations'!B1371,'Clearing Calculations'!C1371,\"\")","v":""},"","","",""]
[{"$f":"IF('Clearing Calculations'!A1372=\"\",\"\",'Clearing Calculations'!A1372)","v":""},{"$f":"IF('Clearing Calculations'!A1372,'Clearing Calculations'!B1372,\"\")","v":""},{"$f":"IF('Clearing Calculations'!B1372,'Clearing Calculations'!C1372,\"\")","v":""},"","","",""]
[{"$f":"IF('Clearing Calculations'!A1373=\"\",\"\",'Clearing Calculations'!A1373)","v":""},{"$f":"IF('Clearing Calculations'!A1373,'Clearing Calculations'!B1373,\"\")","v":""},{"$f":"IF('Clearing Calculations'!B1373,'Clearing Calculations'!C1373,\"\")","v":""},"","","",""]
[{"$f":"IF('Clearing Calculations'!A1374=\"\",\"\",'Clearing Calculations'!A1374)","v":""},{"$f":"IF('Clearing Calculations'!A1374,'Clearing Calculations'!B1374,\"\")","v":""},{"$f":"IF('Clearing Calculations'!B1374,'Clearing Calculations'!C1374,\"\")","v":""},"","","",""]
[{"$f":"IF('Clearing Calculations'!A1375=\"\",\"\",'Clearing Calculations'!A1375)","v":""},{"$f":"IF('Clearing Calculations'!A1375,'Clearing Calculations'!B1375,\"\")","v":""},{"$f":"IF('Clearing Calculations'!B1375,'Clearing Calculations'!C1375,\"\")","v":""},"","","",""]
[{"$f":"IF('Clearing Calculations'!A1376=\"\",\"\",'Clearing Calculations'!A1376)","v":""},{"$f":"IF('Clearing Calculations'!A1376,'Clearing Calculations'!B1376,\"\")","v":""},{"$f":"IF('Clearing Calculations'!B1376,'Clearing Calculations'!C1376,\"\")","v":""},"","","",""]
[{"$f":"IF('Clearing Calculations'!A1377=\"\",\"\",'Clearing Calculations'!A1377)","v":""},{"$f":"IF('Clearing Calculations'!A1377,'Clearing Calculations'!B1377,\"\")","v":""},{"$f":"IF('Clearing Calculations'!B1377,'Clearing Calculations'!C1377,\"\")","v":""},"","","",""]
[{"$f":"IF('Clearing Calculations'!A1378=\"\",\"\",'Clearing Calculations'!A1378)","v":""},{"$f":"IF('Clearing Calculations'!A1378,'Clearing Calculations'!B1378,\"\")","v":""},{"$f":"IF('Clearing Calculations'!B1378,'Clearing Calculations'!C1378,\"\")","v":""},"","","",""]
[{"$f":"IF('Clearing Calculations'!A1379=\"\",\"\",'Clearing Calculations'!A1379)","v":""},{"$f":"IF('Clearing Calculations'!A1379,'Clearing Calculations'!B1379,\"\")","v":""},{"$f":"IF('Clearing Calculations'!B1379,'Clearing Calculations'!C1379,\"\")","v":""},"","","",""]
[{"$f":"IF('Clearing Calculations'!A1380=\"\",\"\",'Clearing Calculations'!A1380)","v":""},{"$f":"IF('Clearing Calculations'!A1380,'Clearing Calculations'!B1380,\"\")","v":""},{"$f":"IF('Clearing Calculations'!B1380,'Clearing Calculations'!C1380,\"\")","v":""},"","","",""]
[{"$f":"IF('Clearing Calculations'!A1381=\"\",\"\",'Clearing Calculations'!A1381)","v":""},{"$f":"IF('Clearing Calculations'!A1381,'Clearing Calculations'!B1381,\"\")","v":""},{"$f":"IF('Clearing Calculations'!B1381,'Clearing Calculations'!C1381,\"\")","v":""},"","","",""]
[{"$f":"IF('Clearing Calculations'!A1382=\"\",\"\",'Clearing Calculations'!A1382)","v":""},{"$f":"IF('Clearing Calculations'!A1382,'Clearing Calculations'!B1382,\"\")","v":""},{"$f":"IF('Clearing Calculations'!B1382,'Clearing Calculations'!C1382,\"\")","v":""},"","","",""]
[{"$f":"IF('Clearing Calculations'!A1383=\"\",\"\",'Clearing Calculations'!A1383)","v":""},{"$f":"IF('Clearing Calculations'!A1383,'Clearing Calculations'!B1383,\"\")","v":""},{"$f":"IF('Clearing Calculations'!B1383,'Clearing Calculations'!C1383,\"\")","v":""},"","","",""]
[{"$f":"IF('Clearing Calculations'!A1384=\"\",\"\",'Clearing Calculations'!A1384)","v":""},{"$f":"IF('Clearing Calculations'!A1384,'Clearing Calculations'!B1384,\"\")","v":""},{"$f":"IF('Clearing Calculations'!B1384,'Clearing Calculations'!C1384,\"\")","v":""},"","","",""]
[{"$f":"IF('Clearing Calculations'!A1385=\"\",\"\",'Clearing Calculations'!A1385)","v":""},{"$f":"IF('Clearing Calculations'!A1385,'Clearing Calculations'!B1385,\"\")","v":""},{"$f":"IF('Clearing Calculations'!B1385,'Clearing Calculations'!C1385,\"\")","v":""},"","","",""]
[{"$f":"IF('Clearing Calculations'!A1386=\"\",\"\",'Clearing Calculations'!A1386)","v":""},{"$f":"IF('Clearing Calculations'!A1386,'Clearing Calculations'!B1386,\"\")","v":""},{"$f":"IF('Clearing Calculations'!B1386,'Clearing Calculations'!C1386,\"\")","v":""},"","","",""]
[{"$f":"IF('Clearing Calculations'!A1387=\"\",\"\",'Clearing Calculations'!A1387)","v":""},{"$f":"IF('Clearing Calculations'!A1387,'Clearing Calculations'!B1387,\"\")","v":""},{"$f":"IF('Clearing Calculations'!B1387,'Clearing Calculations'!C1387,\"\")","v":""},"","","",""]
[{"$f":"IF('Clearing Calculations'!A1388=\"\",\"\",'Clearing Calculations'!A1388)","v":""},{"$f":"IF('Clearing Calculations'!A1388,'Clearing Calculations'!B1388,\"\")","v":""},{"$f":"IF('Clearing Calculations'!B1388,'Clearing Calculations'!C1388,\"\")","v":""},{"$f":"IF(A1394=\"\",\"\",$B1394+$C1394)","v":""},{"$f":"IF(A1394=\"\",\"\",(D1394+D1393)/2*(A1394-A1393))","v":""},{"$f":"IF(A1394=\"\",\"\",(E1394/9))","v":""},{"$f":"IF(A1394=\"\",\"\",E1394/$G$3)","v":""}]
[{"$f":"IF('Clearing Calculations'!A1389=\"\",\"\",'Clearing Calculations'!A1389)","v":""},{"$f":"IF('Clearing Calculations'!A1389,'Clearing Calculations'!B1389,\"\")","v":""},{"$f":"IF('Clearing Calculations'!B1389,'Clearing Calculations'!C1389,\"\")","v":""},"","","",""]
[{"$f":"IF('Clearing Calculations'!A1390=\"\",\"\",'Clearing Calculations'!A1390)","v":""},{"$f":"IF('Clearing Calculations'!A1390,'Clearing Calculations'!B1390,\"\")","v":""},{"$f":"IF('Clearing Calculations'!B1390,'Clearing Calculations'!C1390,\"\")","v":""},"","","",""]
[{"$f":"IF('Clearing Calculations'!A1391=\"\",\"\",'Clearing Calculations'!A1391)","v":""},{"$f":"IF('Clearing Calculations'!A1391,'Clearing Calculations'!B1391,\"\")","v":""},{"$f":"IF('Clearing Calculations'!B1391,'Clearing Calculations'!C1391,\"\")","v":""},"","","",""]
[{"$f":"IF('Clearing Calculations'!A1392=\"\",\"\",'Clearing Calculations'!A1392)","v":""},{"$f":"IF('Clearing Calculations'!A1392,'Clearing Calculations'!B1392,\"\")","v":""},{"$f":"IF('Clearing Calculations'!B1392,'Clearing Calculations'!C1392,\"\")","v":""},"","","",""]
[{"$f":"IF('Clearing Calculations'!A1393=\"\",\"\",'Clearing Calculations'!A1393)","v":""},{"$f":"IF('Clearing Calculations'!A1393,'Clearing Calculations'!B1393,\"\")","v":""},{"$f":"IF('Clearing Calculations'!B1393,'Clearing Calculations'!C1393,\"\")","v":""},"","","",""]
[{"$f":"IF('Clearing Calculations'!A1394=\"\",\"\",'Clearing Calculations'!A1394)","v":""},{"$f":"IF('Clearing Calculations'!A1394,'Clearing Calculations'!B1394,\"\")","v":""},{"$f":"IF('Clearing Calculations'!B1394,'Clearing Calculations'!C1394,\"\")","v":""},"","","",""]
[{"$f":"IF('Clearing Calculations'!A1395=\"\",\"\",'Clearing Calculations'!A1395)","v":""},{"$f":"IF('Clearing Calculations'!A1395,'Clearing Calculations'!B1395,\"\")","v":""},{"$f":"IF('Clearing Calculations'!B1395,'Clearing Calculations'!C1395,\"\")","v":""},"","","",""]
[{"$f":"IF('Clearing Calculations'!A1396=\"\",\"\",'Clearing Calculations'!A1396)","v":""},{"$f":"IF('Clearing Calculations'!A1396,'Clearing Calculations'!B1396,\"\")","v":""},{"$f":"IF('Clearing Calculations'!B1396,'Clearing Calculations'!C1396,\"\")","v":""},"","","",""]
[{"$f":"IF('Clearing Calculations'!A1397=\"\",\"\",'Clearing Calculations'!A1397)","v":""},{"$f":"IF('Clearing Calculations'!A1397,'Clearing Calculations'!B1397,\"\")","v":""},{"$f":"IF('Clearing Calculations'!B1397,'Clearing Calculations'!C1397,\"\")","v":""},"","","",""]
[{"$f":"IF('Clearing Calculations'!A1398=\"\",\"\",'Clearing Calculations'!A1398)","v":""},{"$f":"IF('Clearing Calculations'!A1398,'Clearing Calculations'!B1398,\"\")","v":""},{"$f":"IF('Clearing Calculations'!B1398,'Clearing Calculations'!C1398,\"\")","v":""},"","","",""]
[{"$f":"IF('Clearing Calculations'!A1399=\"\",\"\",'Clearing Calculations'!A1399)","v":""},{"$f":"IF('Clearing Calculations'!A1399,'Clearing Calculations'!B1399,\"\")","v":""},{"$f":"IF('Clearing Calculations'!B1399,'Clearing Calculations'!C1399,\"\")","v":""},"","","",""]
[{"$f":"IF('Clearing Calculations'!A1400=\"\",\"\",'Clearing Calculations'!A1400)","v":""},{"$f":"IF('Clearing Calculations'!A1400,'Clearing Calculations'!B1400,\"\")","v":""},{"$f":"IF('Clearing Calculations'!B1400,'Clearing Calculations'!C1400,\"\")","v":""},"","","",""]
[{"$f":"IF('Clearing Calculations'!A1401=\"\",\"\",'Clearing Calculations'!A1401)","v":""},{"$f":"IF('Clearing Calculations'!A1401,'Clearing Calculations'!B1401,\"\")","v":""},{"$f":"IF('Clearing Calculations'!B1401,'Clearing Calculations'!C1401,\"\")","v":""},"","","",""]
[{"$f":"IF('Clearing Calculations'!A1402=\"\",\"\",'Clearing Calculations'!A1402)","v":""},{"$f":"IF('Clearing Calculations'!A1402,'Clearing Calculations'!B1402,\"\")","v":""},{"$f":"IF('Clearing Calculations'!B1402,'Clearing Calculations'!C1402,\"\")","v":""},"","","",""]
[{"$f":"IF('Clearing Calculations'!A1403=\"\",\"\",'Clearing Calculations'!A1403)","v":""},{"$f":"IF('Clearing Calculations'!A1403,'Clearing Calculations'!B1403,\"\")","v":""},{"$f":"IF('Clearing Calculations'!B1403,'Clearing Calculations'!C1403,\"\")","v":""},"","","",""]
[{"$f":"IF('Clearing Calculations'!A1404=\"\",\"\",'Clearing Calculations'!A1404)","v":""},{"$f":"IF('Clearing Calculations'!A1404,'Clearing Calculations'!B1404,\"\")","v":""},{"$f":"IF('Clearing Calculations'!B1404,'Clearing Calculations'!C1404,\"\")","v":""},"","","",""]
[{"$f":"IF('Clearing Calculations'!A1405=\"\",\"\",'Clearing Calculations'!A1405)","v":""},{"$f":"IF('Clearing Calculations'!A1405,'Clearing Calculations'!B1405,\"\")","v":""},{"$f":"IF('Clearing Calculations'!B1405,'Clearing Calculations'!C1405,\"\")","v":""},"","","",""]
[{"$f":"IF('Clearing Calculations'!A1406=\"\",\"\",'Clearing Calculations'!A1406)","v":""},{"$f":"IF('Clearing Calculations'!A1406,'Clearing Calculations'!B1406,\"\")","v":""},{"$f":"IF('Clearing Calculations'!B1406,'Clearing Calculations'!C1406,\"\")","v":""},"","","",""]
[{"$f":"IF('Clearing Calculations'!A1407=\"\",\"\",'Clearing Calculations'!A1407)","v":""},{"$f":"IF('Clearing Calculations'!A1407,'Clearing Calculations'!B1407,\"\")","v":""},{"$f":"IF('Clearing Calculations'!B1407,'Clearing Calculations'!C1407,\"\")","v":""},"","","",""]
[{"$f":"IF('Clearing Calculations'!A1408=\"\",\"\",'Clearing Calculations'!A1408)","v":""},{"$f":"IF('Clearing Calculations'!A1408,'Clearing Calculations'!B1408,\"\")","v":""},{"$f":"IF('Clearing Calculations'!B1408,'Clearing Calculations'!C1408,\"\")","v":""},"","","",""]
[{"$f":"IF('Clearing Calculations'!A1409=\"\",\"\",'Clearing Calculations'!A1409)","v":""},{"$f":"IF('Clearing Calculations'!A1409,'Clearing Calculations'!B1409,\"\")","v":""},{"$f":"IF('Clearing Calculations'!B1409,'Clearing Calculations'!C1409,\"\")","v":""},"","","",""]
[{"$f":"IF('Clearing Calculations'!A1410=\"\",\"\",'Clearing Calculations'!A1410)","v":""},{"$f":"IF('Clearing Calculations'!A1410,'Clearing Calculations'!B1410,\"\")","v":""},{"$f":"IF('Clearing Calculations'!B1410,'Clearing Calculations'!C1410,\"\")","v":""},"","","",""]
[{"$f":"IF('Clearing Calculations'!A1411=\"\",\"\",'Clearing Calculations'!A1411)","v":""},{"$f":"IF('Clearing Calculations'!A1411,'Clearing Calculations'!B1411,\"\")","v":""},{"$f":"IF('Clearing Calculations'!B1411,'Clearing Calculations'!C1411,\"\")","v":""},"","","",""]
[{"$f":"IF('Clearing Calculations'!A1412=\"\",\"\",'Clearing Calculations'!A1412)","v":""},{"$f":"IF('Clearing Calculations'!A1412,'Clearing Calculations'!B1412,\"\")","v":""},{"$f":"IF('Clearing Calculations'!B1412,'Clearing Calculations'!C1412,\"\")","v":""},"","","",""]
[{"$f":"IF('Clearing Calculations'!A1413=\"\",\"\",'Clearing Calculations'!A1413)","v":""},{"$f":"IF('Clearing Calculations'!A1413,'Clearing Calculations'!B1413,\"\")","v":""},{"$f":"IF('Clearing Calculations'!B1413,'Clearing Calculations'!C1413,\"\")","v":""},"","","",""]
[{"$f":"IF('Clearing Calculations'!A1414=\"\",\"\",'Clearing Calculations'!A1414)","v":""},{"$f":"IF('Clearing Calculations'!A1414,'Clearing Calculations'!B1414,\"\")","v":""},{"$f":"IF('Clearing Calculations'!B1414,'Clearing Calculations'!C1414,\"\")","v":""},"","","",""]
[{"$f":"IF('Clearing Calculations'!A1415=\"\",\"\",'Clearing Calculations'!A1415)","v":""},{"$f":"IF('Clearing Calculations'!A1415,'Clearing Calculations'!B1415,\"\")","v":""},{"$f":"IF('Clearing Calculations'!B1415,'Clearing Calculations'!C1415,\"\")","v":""},"","","",""]
[{"$f":"IF('Clearing Calculations'!A1416=\"\",\"\",'Clearing Calculations'!A1416)","v":""},{"$f":"IF('Clearing Calculations'!A1416,'Clearing Calculations'!B1416,\"\")","v":""},{"$f":"IF('Clearing Calculations'!B1416,'Clearing Calculations'!C1416,\"\")","v":""},"","","",""]
[{"$f":"IF('Clearing Calculations'!A1417=\"\",\"\",'Clearing Calculations'!A1417)","v":""},{"$f":"IF('Clearing Calculations'!A1417,'Clearing Calculations'!B1417,\"\")","v":""},{"$f":"IF('Clearing Calculations'!B1417,'Clearing Calculations'!C1417,\"\")","v":""},"","","",""]
[{"$f":"IF('Clearing Calculations'!A1418=\"\",\"\",'Clearing Calculations'!A1418)","v":""},{"$f":"IF('Clearing Calculations'!A1418,'Clearing Calculations'!B1418,\"\")","v":""},{"$f":"IF('Clearing Calculations'!B1418,'Clearing Calculations'!C1418,\"\")","v":""},"","","",""]
[{"$f":"IF('Clearing Calculations'!A1419=\"\",\"\",'Clearing Calculations'!A1419)","v":""},{"$f":"IF('Clearing Calculations'!A1419,'Clearing Calculations'!B1419,\"\")","v":""},{"$f":"IF('Clearing Calculations'!B1419,'Clearing Calculations'!C1419,\"\")","v":""},"","","",""]
[{"$f":"IF('Clearing Calculations'!A1420=\"\",\"\",'Clearing Calculations'!A1420)","v":""},{"$f":"IF('Clearing Calculations'!A1420,'Clearing Calculations'!B1420,\"\")","v":""},{"$f":"IF('Clearing Calculations'!B1420,'Clearing Calculations'!C1420,\"\")","v":""},"","","",""]
[{"$f":"IF('Clearing Calculations'!A1421=\"\",\"\",'Clearing Calculations'!A1421)","v":""},{"$f":"IF('Clearing Calculations'!A1421,'Clearing Calculations'!B1421,\"\")","v":""},{"$f":"IF('Clearing Calculations'!B1421,'Clearing Calculations'!C1421,\"\")","v":""},"","","",""]
[{"$f":"IF('Clearing Calculations'!A1422=\"\",\"\",'Clearing Calculations'!A1422)","v":""},{"$f":"IF('Clearing Calculations'!A1422,'Clearing Calculations'!B1422,\"\")","v":""},{"$f":"IF('Clearing Calculations'!B1422,'Clearing Calculations'!C1422,\"\")","v":""},"","","",""]
[{"$f":"IF('Clearing Calculations'!A1423=\"\",\"\",'Clearing Calculations'!A1423)","v":""},{"$f":"IF('Clearing Calculations'!A1423,'Clearing Calculations'!B1423,\"\")","v":""},{"$f":"IF('Clearing Calculations'!B1423,'Clearing Calculations'!C1423,\"\")","v":""},"","","",""]
[{"$f":"IF('Clearing Calculations'!A1424=\"\",\"\",'Clearing Calculations'!A1424)","v":""},{"$f":"IF('Clearing Calculations'!A1424,'Clearing Calculations'!B1424,\"\")","v":""},{"$f":"IF('Clearing Calculations'!B1424,'Clearing Calculations'!C1424,\"\")","v":""},"","","",""]
[{"$f":"IF('Clearing Calculations'!A1425=\"\",\"\",'Clearing Calculations'!A1425)","v":""},{"$f":"IF('Clearing Calculations'!A1425,'Clearing Calculations'!B1425,\"\")","v":""},{"$f":"IF('Clearing Calculations'!B1425,'Clearing Calculations'!C1425,\"\")","v":""},"","","",""]
[{"$f":"IF('Clearing Calculations'!A1426=\"\",\"\",'Clearing Calculations'!A1426)","v":""},{"$f":"IF('Clearing Calculations'!A1426,'Clearing Calculations'!B1426,\"\")","v":""},{"$f":"IF('Clearing Calculations'!B1426,'Clearing Calculations'!C1426,\"\")","v":""},"","","",""]
[{"$f":"IF('Clearing Calculations'!A1427=\"\",\"\",'Clearing Calculations'!A1427)","v":""},{"$f":"IF('Clearing Calculations'!A1427,'Clearing Calculations'!B1427,\"\")","v":""},{"$f":"IF('Clearing Calculations'!B1427,'Clearing Calculations'!C1427,\"\")","v":""},"","","",""]
[{"$f":"IF('Clearing Calculations'!A1428=\"\",\"\",'Clearing Calculations'!A1428)","v":""},{"$f":"IF('Clearing Calculations'!A1428,'Clearing Calculations'!B1428,\"\")","v":""},{"$f":"IF('Clearing Calculations'!B1428,'Clearing Calculations'!C1428,\"\")","v":""},"","","",""]
[{"$f":"IF('Clearing Calculations'!A1429=\"\",\"\",'Clearing Calculations'!A1429)","v":""},{"$f":"IF('Clearing Calculations'!A1429,'Clearing Calculations'!B1429,\"\")","v":""},{"$f":"IF('Clearing Calculations'!B1429,'Clearing Calculations'!C1429,\"\")","v":""},"","","",""]
[{"$f":"IF('Clearing Calculations'!A1430=\"\",\"\",'Clearing Calculations'!A1430)","v":""},{"$f":"IF('Clearing Calculations'!A1430,'Clearing Calculations'!B1430,\"\")","v":""},{"$f":"IF('Clearing Calculations'!B1430,'Clearing Calculations'!C1430,\"\")","v":""},"","","",""]
[{"$f":"IF('Clearing Calculations'!A1431=\"\",\"\",'Clearing Calculations'!A1431)","v":""},{"$f":"IF('Clearing Calculations'!A1431,'Clearing Calculations'!B1431,\"\")","v":""},{"$f":"IF('Clearing Calculations'!B1431,'Clearing Calculations'!C1431,\"\")","v":""},"","","",""]
[{"$f":"IF('Clearing Calculations'!A1432=\"\",\"\",'Clearing Calculations'!A1432)","v":""},{"$f":"IF('Clearing Calculations'!A1432,'Clearing Calculations'!B1432,\"\")","v":""},{"$f":"IF('Clearing Calculations'!B1432,'Clearing Calculations'!C1432,\"\")","v":""},"","","",""]
[{"$f":"IF('Clearing Calculations'!A1433=\"\",\"\",'Clearing Calculations'!A1433)","v":""},{"$f":"IF('Clearing Calculations'!A1433,'Clearing Calculations'!B1433,\"\")","v":""},{"$f":"IF('Clearing Calculations'!B1433,'Clearing Calculations'!C1433,\"\")","v":""},"","","",""]
[{"$f":"IF('Clearing Calculations'!A1434=\"\",\"\",'Clearing Calculations'!A1434)","v":""},{"$f":"IF('Clearing Calculations'!A1434,'Clearing Calculations'!B1434,\"\")","v":""},{"$f":"IF('Clearing Calculations'!B1434,'Clearing Calculations'!C1434,\"\")","v":""},"","","",""]
[{"$f":"IF('Clearing Calculations'!A1435=\"\",\"\",'Clearing Calculations'!A1435)","v":""},{"$f":"IF('Clearing Calculations'!A1435,'Clearing Calculations'!B1435,\"\")","v":""},{"$f":"IF('Clearing Calculations'!B1435,'Clearing Calculations'!C1435,\"\")","v":""},"","","",""]
[{"$f":"IF('Clearing Calculations'!A1436=\"\",\"\",'Clearing Calculations'!A1436)","v":""},{"$f":"IF('Clearing Calculations'!A1436,'Clearing Calculations'!B1436,\"\")","v":""},{"$f":"IF('Clearing Calculations'!B1436,'Clearing Calculations'!C1436,\"\")","v":""},"","","",""]
[{"$f":"IF('Clearing Calculations'!A1437=\"\",\"\",'Clearing Calculations'!A1437)","v":""},{"$f":"IF('Clearing Calculations'!A1437,'Clearing Calculations'!B1437,\"\")","v":""},{"$f":"IF('Clearing Calculations'!B1437,'Clearing Calculations'!C1437,\"\")","v":""},"","","",""]
[{"$f":"IF('Clearing Calculations'!A1438=\"\",\"\",'Clearing Calculations'!A1438)","v":""},{"$f":"IF('Clearing Calculations'!A1438,'Clearing Calculations'!B1438,\"\")","v":""},{"$f":"IF('Clearing Calculations'!B1438,'Clearing Calculations'!C1438,\"\")","v":""},"","","",""]
[{"$f":"IF('Clearing Calculations'!A1439=\"\",\"\",'Clearing Calculations'!A1439)","v":""},{"$f":"IF('Clearing Calculations'!A1439,'Clearing Calculations'!B1439,\"\")","v":""},{"$f":"IF('Clearing Calculations'!B1439,'Clearing Calculations'!C1439,\"\")","v":""},"","","",""]
[{"$f":"IF('Clearing Calculations'!A1440=\"\",\"\",'Clearing Calculations'!A1440)","v":""},{"$f":"IF('Clearing Calculations'!A1440,'Clearing Calculations'!B1440,\"\")","v":""},{"$f":"IF('Clearing Calculations'!B1440,'Clearing Calculations'!C1440,\"\")","v":""},"","","",""]
[{"$f":"IF('Clearing Calculations'!A1441=\"\",\"\",'Clearing Calculations'!A1441)","v":""},{"$f":"IF('Clearing Calculations'!A1441,'Clearing Calculations'!B1441,\"\")","v":""},{"$f":"IF('Clearing Calculations'!B1441,'Clearing Calculations'!C1441,\"\")","v":""},"","","",""]
[{"$f":"IF('Clearing Calculations'!A1442=\"\",\"\",'Clearing Calculations'!A1442)","v":""},{"$f":"IF('Clearing Calculations'!A1442,'Clearing Calculations'!B1442,\"\")","v":""},{"$f":"IF('Clearing Calculations'!B1442,'Clearing Calculations'!C1442,\"\")","v":""},"","","",""]
[{"$f":"IF('Clearing Calculations'!A1443=\"\",\"\",'Clearing Calculations'!A1443)","v":""},{"$f":"IF('Clearing Calculations'!A1443,'Clearing Calculations'!B1443,\"\")","v":""},{"$f":"IF('Clearing Calculations'!B1443,'Clearing Calculations'!C1443,\"\")","v":""},"","","",""]
[{"$f":"IF('Clearing Calculations'!A1444=\"\",\"\",'Clearing Calculations'!A1444)","v":""},{"$f":"IF('Clearing Calculations'!A1444,'Clearing Calculations'!B1444,\"\")","v":""},{"$f":"IF('Clearing Calculations'!B1444,'Clearing Calculations'!C1444,\"\")","v":""},"","","",""]
[{"$f":"IF('Clearing Calculations'!A1445=\"\",\"\",'Clearing Calculations'!A1445)","v":""},{"$f":"IF('Clearing Calculations'!A1445,'Clearing Calculations'!B1445,\"\")","v":""},{"$f":"IF('Clearing Calculations'!B1445,'Clearing Calculations'!C1445,\"\")","v":""},"","","",""]
[{"$f":"IF('Clearing Calculations'!A1446=\"\",\"\",'Clearing Calculations'!A1446)","v":""},{"$f":"IF('Clearing Calculations'!A1446,'Clearing Calculations'!B1446,\"\")","v":""},{"$f":"IF('Clearing Calculations'!B1446,'Clearing Calculations'!C1446,\"\")","v":""},"","","",""]
[{"$f":"IF('Clearing Calculations'!A1447=\"\",\"\",'Clearing Calculations'!A1447)","v":""},{"$f":"IF('Clearing Calculations'!A1447,'Clearing Calculations'!B1447,\"\")","v":""},{"$f":"IF('Clearing Calculations'!B1447,'Clearing Calculations'!C1447,\"\")","v":""},"","","",""]
[{"$f":"IF('Clearing Calculations'!A1448=\"\",\"\",'Clearing Calculations'!A1448)","v":""},{"$f":"IF('Clearing Calculations'!A1448,'Clearing Calculations'!B1448,\"\")","v":""},{"$f":"IF('Clearing Calculations'!B1448,'Clearing Calculations'!C1448,\"\")","v":""},"","","",""]
[{"$f":"IF('Clearing Calculations'!A1449=\"\",\"\",'Clearing Calculations'!A1449)","v":""},{"$f":"IF('Clearing Calculations'!A1449,'Clearing Calculations'!B1449,\"\")","v":""},{"$f":"IF('Clearing Calculations'!B1449,'Clearing Calculations'!C1449,\"\")","v":""},"","","",""]
[{"$f":"IF('Clearing Calculations'!A1450=\"\",\"\",'Clearing Calculations'!A1450)","v":""},{"$f":"IF('Clearing Calculations'!A1450,'Clearing Calculations'!B1450,\"\")","v":""},{"$f":"IF('Clearing Calculations'!B1450,'Clearing Calculations'!C1450,\"\")","v":""},"","","",""]
[{"$f":"IF('Clearing Calculations'!A1451=\"\",\"\",'Clearing Calculations'!A1451)","v":""},{"$f":"IF('Clearing Calculations'!A1451,'Clearing Calculations'!B1451,\"\")","v":""},{"$f":"IF('Clearing Calculations'!B1451,'Clearing Calculations'!C1451,\"\")","v":""},"","","",""]
[{"$f":"IF('Clearing Calculations'!A1452=\"\",\"\",'Clearing Calculations'!A1452)","v":""},{"$f":"IF('Clearing Calculations'!A1452,'Clearing Calculations'!B1452,\"\")","v":""},{"$f":"IF('Clearing Calculations'!B1452,'Clearing Calculations'!C1452,\"\")","v":""},{"$f":"IF(A1458=\"\",\"\",$B1458+$C1458)","v":""},{"$f":"IF(A1458=\"\",\"\",(D1458+D1457)/2*(A1458-A1457))","v":""},{"$f":"IF(A1458=\"\",\"\",(E1458/9))","v":""},{"$f":"IF(A1458=\"\",\"\",E1458/$G$3)","v":""}]
[{"$f":"IF('Clearing Calculations'!A1453=\"\",\"\",'Clearing Calculations'!A1453)","v":""},{"$f":"IF('Clearing Calculations'!A1453,'Clearing Calculations'!B1453,\"\")","v":""},{"$f":"IF('Clearing Calculations'!B1453,'Clearing Calculations'!C1453,\"\")","v":""},"","","",""]
[{"$f":"IF('Clearing Calculations'!A1454=\"\",\"\",'Clearing Calculations'!A1454)","v":""},{"$f":"IF('Clearing Calculations'!A1454,'Clearing Calculations'!B1454,\"\")","v":""},{"$f":"IF('Clearing Calculations'!B1454,'Clearing Calculations'!C1454,\"\")","v":""},"","","",""]
[{"$f":"IF('Clearing Calculations'!A1455=\"\",\"\",'Clearing Calculations'!A1455)","v":""},{"$f":"IF('Clearing Calculations'!A1455,'Clearing Calculations'!B1455,\"\")","v":""},{"$f":"IF('Clearing Calculations'!B1455,'Clearing Calculations'!C1455,\"\")","v":""},"","","",""]
[{"$f":"IF('Clearing Calculations'!A1456=\"\",\"\",'Clearing Calculations'!A1456)","v":""},{"$f":"IF('Clearing Calculations'!A1456,'Clearing Calculations'!B1456,\"\")","v":""},{"$f":"IF('Clearing Calculations'!B1456,'Clearing Calculations'!C1456,\"\")","v":""},"","","",""]
[{"$f":"IF('Clearing Calculations'!A1457=\"\",\"\",'Clearing Calculations'!A1457)","v":""},{"$f":"IF('Clearing Calculations'!A1457,'Clearing Calculations'!B1457,\"\")","v":""},{"$f":"IF('Clearing Calculations'!B1457,'Clearing Calculations'!C1457,\"\")","v":""},"","","",""]
[{"$f":"IF('Clearing Calculations'!A1458=\"\",\"\",'Clearing Calculations'!A1458)","v":""},{"$f":"IF('Clearing Calculations'!A1458,'Clearing Calculations'!B1458,\"\")","v":""},{"$f":"IF('Clearing Calculations'!B1458,'Clearing Calculations'!C1458,\"\")","v":""},"","","",""]
[{"$f":"IF('Clearing Calculations'!A1459=\"\",\"\",'Clearing Calculations'!A1459)","v":""},{"$f":"IF('Clearing Calculations'!A1459,'Clearing Calculations'!B1459,\"\")","v":""},{"$f":"IF('Clearing Calculations'!B1459,'Clearing Calculations'!C1459,\"\")","v":""},"","","",""]
[{"$f":"IF('Clearing Calculations'!A1460=\"\",\"\",'Clearing Calculations'!A1460)","v":""},{"$f":"IF('Clearing Calculations'!A1460,'Clearing Calculations'!B1460,\"\")","v":""},{"$f":"IF('Clearing Calculations'!B1460,'Clearing Calculations'!C1460,\"\")","v":""},"","","",""]
[{"$f":"IF('Clearing Calculations'!A1461=\"\",\"\",'Clearing Calculations'!A1461)","v":""},{"$f":"IF('Clearing Calculations'!A1461,'Clearing Calculations'!B1461,\"\")","v":""},{"$f":"IF('Clearing Calculations'!B1461,'Clearing Calculations'!C1461,\"\")","v":""},"","","",""]
[{"$f":"IF('Clearing Calculations'!A1462=\"\",\"\",'Clearing Calculations'!A1462)","v":""},{"$f":"IF('Clearing Calculations'!A1462,'Clearing Calculations'!B1462,\"\")","v":""},{"$f":"IF('Clearing Calculations'!B1462,'Clearing Calculations'!C1462,\"\")","v":""},"","","",""]
[{"$f":"IF('Clearing Calculations'!A1463=\"\",\"\",'Clearing Calculations'!A1463)","v":""},{"$f":"IF('Clearing Calculations'!A1463,'Clearing Calculations'!B1463,\"\")","v":""},{"$f":"IF('Clearing Calculations'!B1463,'Clearing Calculations'!C1463,\"\")","v":""},"","","",""]
[{"$f":"IF('Clearing Calculations'!A1464=\"\",\"\",'Clearing Calculations'!A1464)","v":""},{"$f":"IF('Clearing Calculations'!A1464,'Clearing Calculations'!B1464,\"\")","v":""},{"$f":"IF('Clearing Calculations'!B1464,'Clearing Calculations'!C1464,\"\")","v":""},"","","",""]
[{"$f":"IF('Clearing Calculations'!A1465=\"\",\"\",'Clearing Calculations'!A1465)","v":""},{"$f":"IF('Clearing Calculations'!A1465,'Clearing Calculations'!B1465,\"\")","v":""},{"$f":"IF('Clearing Calculations'!B1465,'Clearing Calculations'!C1465,\"\")","v":""},"","","",""]
[{"$f":"IF('Clearing Calculations'!A1466=\"\",\"\",'Clearing Calculations'!A1466)","v":""},{"$f":"IF('Clearing Calculations'!A1466,'Clearing Calculations'!B1466,\"\")","v":""},{"$f":"IF('Clearing Calculations'!B1466,'Clearing Calculations'!C1466,\"\")","v":""},"","","",""]
[{"$f":"IF('Clearing Calculations'!A1467=\"\",\"\",'Clearing Calculations'!A1467)","v":""},{"$f":"IF('Clearing Calculations'!A1467,'Clearing Calculations'!B1467,\"\")","v":""},{"$f":"IF('Clearing Calculations'!B1467,'Clearing Calculations'!C1467,\"\")","v":""},"","","",""]
[{"$f":"IF('Clearing Calculations'!A1468=\"\",\"\",'Clearing Calculations'!A1468)","v":""},{"$f":"IF('Clearing Calculations'!A1468,'Clearing Calculations'!B1468,\"\")","v":""},{"$f":"IF('Clearing Calculations'!B1468,'Clearing Calculations'!C1468,\"\")","v":""},"","","",""]
[{"$f":"IF('Clearing Calculations'!A1469=\"\",\"\",'Clearing Calculations'!A1469)","v":""},{"$f":"IF('Clearing Calculations'!A1469,'Clearing Calculations'!B1469,\"\")","v":""},{"$f":"IF('Clearing Calculations'!B1469,'Clearing Calculations'!C1469,\"\")","v":""},"","","",""]
[{"$f":"IF('Clearing Calculations'!A1470=\"\",\"\",'Clearing Calculations'!A1470)","v":""},{"$f":"IF('Clearing Calculations'!A1470,'Clearing Calculations'!B1470,\"\")","v":""},{"$f":"IF('Clearing Calculations'!B1470,'Clearing Calculations'!C1470,\"\")","v":""},"","","",""]
[{"$f":"IF('Clearing Calculations'!A1471=\"\",\"\",'Clearing Calculations'!A1471)","v":""},{"$f":"IF('Clearing Calculations'!A1471,'Clearing Calculations'!B1471,\"\")","v":""},{"$f":"IF('Clearing Calculations'!B1471,'Clearing Calculations'!C1471,\"\")","v":""},"","","",""]
[{"$f":"IF('Clearing Calculations'!A1472=\"\",\"\",'Clearing Calculations'!A1472)","v":""},{"$f":"IF('Clearing Calculations'!A1472,'Clearing Calculations'!B1472,\"\")","v":""},{"$f":"IF('Clearing Calculations'!B1472,'Clearing Calculations'!C1472,\"\")","v":""},"","","",""]
[{"$f":"IF('Clearing Calculations'!A1473=\"\",\"\",'Clearing Calculations'!A1473)","v":""},{"$f":"IF('Clearing Calculations'!A1473,'Clearing Calculations'!B1473,\"\")","v":""},{"$f":"IF('Clearing Calculations'!B1473,'Clearing Calculations'!C1473,\"\")","v":""},"","","",""]
[{"$f":"IF('Clearing Calculations'!A1474=\"\",\"\",'Clearing Calculations'!A1474)","v":""},{"$f":"IF('Clearing Calculations'!A1474,'Clearing Calculations'!B1474,\"\")","v":""},{"$f":"IF('Clearing Calculations'!B1474,'Clearing Calculations'!C1474,\"\")","v":""},"","","",""]
[{"$f":"IF('Clearing Calculations'!A1475=\"\",\"\",'Clearing Calculations'!A1475)","v":""},{"$f":"IF('Clearing Calculations'!A1475,'Clearing Calculations'!B1475,\"\")","v":""},{"$f":"IF('Clearing Calculations'!B1475,'Clearing Calculations'!C1475,\"\")","v":""},"","","",""]
[{"$f":"IF('Clearing Calculations'!A1476=\"\",\"\",'Clearing Calculations'!A1476)","v":""},{"$f":"IF('Clearing Calculations'!A1476,'Clearing Calculations'!B1476,\"\")","v":""},{"$f":"IF('Clearing Calculations'!B1476,'Clearing Calculations'!C1476,\"\")","v":""},"","","",""]
[{"$f":"IF('Clearing Calculations'!A1477=\"\",\"\",'Clearing Calculations'!A1477)","v":""},{"$f":"IF('Clearing Calculations'!A1477,'Clearing Calculations'!B1477,\"\")","v":""},{"$f":"IF('Clearing Calculations'!B1477,'Clearing Calculations'!C1477,\"\")","v":""},"","","",""]
[{"$f":"IF('Clearing Calculations'!A1478=\"\",\"\",'Clearing Calculations'!A1478)","v":""},{"$f":"IF('Clearing Calculations'!A1478,'Clearing Calculations'!B1478,\"\")","v":""},{"$f":"IF('Clearing Calculations'!B1478,'Clearing Calculations'!C1478,\"\")","v":""},"","","",""]
[{"$f":"IF('Clearing Calculations'!A1479=\"\",\"\",'Clearing Calculations'!A1479)","v":""},{"$f":"IF('Clearing Calculations'!A1479,'Clearing Calculations'!B1479,\"\")","v":""},{"$f":"IF('Clearing Calculations'!B1479,'Clearing Calculations'!C1479,\"\")","v":""},"","","",""]
[{"$f":"IF('Clearing Calculations'!A1480=\"\",\"\",'Clearing Calculations'!A1480)","v":""},{"$f":"IF('Clearing Calculations'!A1480,'Clearing Calculations'!B1480,\"\")","v":""},{"$f":"IF('Clearing Calculations'!B1480,'Clearing Calculations'!C1480,\"\")","v":""},"","","",""]
[{"$f":"IF('Clearing Calculations'!A1481=\"\",\"\",'Clearing Calculations'!A1481)","v":""},{"$f":"IF('Clearing Calculations'!A1481,'Clearing Calculations'!B1481,\"\")","v":""},{"$f":"IF('Clearing Calculations'!B1481,'Clearing Calculations'!C1481,\"\")","v":""},"","","",""]
[{"$f":"IF('Clearing Calculations'!A1482=\"\",\"\",'Clearing Calculations'!A1482)","v":""},{"$f":"IF('Clearing Calculations'!A1482,'Clearing Calculations'!B1482,\"\")","v":""},{"$f":"IF('Clearing Calculations'!B1482,'Clearing Calculations'!C1482,\"\")","v":""},"","","",""]
[{"$f":"IF('Clearing Calculations'!A1483=\"\",\"\",'Clearing Calculations'!A1483)","v":""},{"$f":"IF('Clearing Calculations'!A1483,'Clearing Calculations'!B1483,\"\")","v":""},{"$f":"IF('Clearing Calculations'!B1483,'Clearing Calculations'!C1483,\"\")","v":""},"","","",""]
[{"$f":"IF('Clearing Calculations'!A1484=\"\",\"\",'Clearing Calculations'!A1484)","v":""},{"$f":"IF('Clearing Calculations'!A1484,'Clearing Calculations'!B1484,\"\")","v":""},{"$f":"IF('Clearing Calculations'!B1484,'Clearing Calculations'!C1484,\"\")","v":""},"","","",""]
[{"$f":"IF('Clearing Calculations'!A1485=\"\",\"\",'Clearing Calculations'!A1485)","v":""},{"$f":"IF('Clearing Calculations'!A1485,'Clearing Calculations'!B1485,\"\")","v":""},{"$f":"IF('Clearing Calculations'!B1485,'Clearing Calculations'!C1485,\"\")","v":""},"","","",""]
[{"$f":"IF('Clearing Calculations'!A1486=\"\",\"\",'Clearing Calculations'!A1486)","v":""},{"$f":"IF('Clearing Calculations'!A1486,'Clearing Calculations'!B1486,\"\")","v":""},{"$f":"IF('Clearing Calculations'!B1486,'Clearing Calculations'!C1486,\"\")","v":""},"","","",""]
[{"$f":"IF('Clearing Calculations'!A1487=\"\",\"\",'Clearing Calculations'!A1487)","v":""},{"$f":"IF('Clearing Calculations'!A1487,'Clearing Calculations'!B1487,\"\")","v":""},{"$f":"IF('Clearing Calculations'!B1487,'Clearing Calculations'!C1487,\"\")","v":""},"","","",""]
[{"$f":"IF('Clearing Calculations'!A1488=\"\",\"\",'Clearing Calculations'!A1488)","v":""},{"$f":"IF('Clearing Calculations'!A1488,'Clearing Calculations'!B1488,\"\")","v":""},{"$f":"IF('Clearing Calculations'!B1488,'Clearing Calculations'!C1488,\"\")","v":""},"","","",""]
[{"$f":"IF('Clearing Calculations'!A1489=\"\",\"\",'Clearing Calculations'!A1489)","v":""},{"$f":"IF('Clearing Calculations'!A1489,'Clearing Calculations'!B1489,\"\")","v":""},{"$f":"IF('Clearing Calculations'!B1489,'Clearing Calculations'!C1489,\"\")","v":""},"","","",""]
[{"$f":"IF('Clearing Calculations'!A1490=\"\",\"\",'Clearing Calculations'!A1490)","v":""},{"$f":"IF('Clearing Calculations'!A1490,'Clearing Calculations'!B1490,\"\")","v":""},{"$f":"IF('Clearing Calculations'!B1490,'Clearing Calculations'!C1490,\"\")","v":""},"","","",""]
[{"$f":"IF('Clearing Calculations'!A1491=\"\",\"\",'Clearing Calculations'!A1491)","v":""},{"$f":"IF('Clearing Calculations'!A1491,'Clearing Calculations'!B1491,\"\")","v":""},{"$f":"IF('Clearing Calculations'!B1491,'Clearing Calculations'!C1491,\"\")","v":""},"","","",""]
[{"$f":"IF('Clearing Calculations'!A1492=\"\",\"\",'Clearing Calculations'!A1492)","v":""},{"$f":"IF('Clearing Calculations'!A1492,'Clearing Calculations'!B1492,\"\")","v":""},{"$f":"IF('Clearing Calculations'!B1492,'Clearing Calculations'!C1492,\"\")","v":""},"","","",""]
[{"$f":"IF('Clearing Calculations'!A1493=\"\",\"\",'Clearing Calculations'!A1493)","v":""},{"$f":"IF('Clearing Calculations'!A1493,'Clearing Calculations'!B1493,\"\")","v":""},{"$f":"IF('Clearing Calculations'!B1493,'Clearing Calculations'!C1493,\"\")","v":""},"","","",""]
[{"$f":"IF('Clearing Calculations'!A1494=\"\",\"\",'Clearing Calculations'!A1494)","v":""},{"$f":"IF('Clearing Calculations'!A1494,'Clearing Calculations'!B1494,\"\")","v":""},{"$f":"IF('Clearing Calculations'!B1494,'Clearing Calculations'!C1494,\"\")","v":""},"","","",""]
[{"$f":"IF('Clearing Calculations'!A1495=\"\",\"\",'Clearing Calculations'!A1495)","v":""},{"$f":"IF('Clearing Calculations'!A1495,'Clearing Calculations'!B1495,\"\")","v":""},{"$f":"IF('Clearing Calculations'!B1495,'Clearing Calculations'!C1495,\"\")","v":""},"","","",""]
[{"$f":"IF('Clearing Calculations'!A1496=\"\",\"\",'Clearing Calculations'!A1496)","v":""},{"$f":"IF('Clearing Calculations'!A1496,'Clearing Calculations'!B1496,\"\")","v":""},{"$f":"IF('Clearing Calculations'!B1496,'Clearing Calculations'!C1496,\"\")","v":""},"","","",""]
[{"$f":"IF('Clearing Calculations'!A1497=\"\",\"\",'Clearing Calculations'!A1497)","v":""},{"$f":"IF('Clearing Calculations'!A1497,'Clearing Calculations'!B1497,\"\")","v":""},{"$f":"IF('Clearing Calculations'!B1497,'Clearing Calculations'!C1497,\"\")","v":""},"","","",""]
[{"$f":"IF('Clearing Calculations'!A1498=\"\",\"\",'Clearing Calculations'!A1498)","v":""},{"$f":"IF('Clearing Calculations'!A1498,'Clearing Calculations'!B1498,\"\")","v":""},{"$f":"IF('Clearing Calculations'!B1498,'Clearing Calculations'!C1498,\"\")","v":""},"","","",""]
[{"$f":"IF('Clearing Calculations'!A1499=\"\",\"\",'Clearing Calculations'!A1499)","v":""},{"$f":"IF('Clearing Calculations'!A1499,'Clearing Calculations'!B1499,\"\")","v":""},{"$f":"IF('Clearing Calculations'!B1499,'Clearing Calculations'!C1499,\"\")","v":""},"","","",""]
[{"$f":"IF('Clearing Calculations'!A1500=\"\",\"\",'Clearing Calculations'!A1500)","v":""},{"$f":"IF('Clearing Calculations'!A1500,'Clearing Calculations'!B1500,\"\")","v":""},{"$f":"IF('Clearing Calculations'!B1500,'Clearing Calculations'!C1500,\"\")","v":""},"","","",""]
[{"$f":"IF('Clearing Calculations'!A1501=\"\",\"\",'Clearing Calculations'!A1501)","v":""},{"$f":"IF('Clearing Calculations'!A1501,'Clearing Calculations'!B1501,\"\")","v":""},{"$f":"IF('Clearing Calculations'!B1501,'Clearing Calculations'!C1501,\"\")","v":""},"","","",""]
[{"$f":"IF('Clearing Calculations'!A1502=\"\",\"\",'Clearing Calculations'!A1502)","v":""},{"$f":"IF('Clearing Calculations'!A1502,'Clearing Calculations'!B1502,\"\")","v":""},{"$f":"IF('Clearing Calculations'!B1502,'Clearing Calculations'!C1502,\"\")","v":""},"","","",""]
[{"$f":"IF('Clearing Calculations'!A1503=\"\",\"\",'Clearing Calculations'!A1503)","v":""},{"$f":"IF('Clearing Calculations'!A1503,'Clearing Calculations'!B1503,\"\")","v":""},{"$f":"IF('Clearing Calculations'!B1503,'Clearing Calculations'!C1503,\"\")","v":""},"","","",""]
[{"$f":"IF('Clearing Calculations'!A1504=\"\",\"\",'Clearing Calculations'!A1504)","v":""},{"$f":"IF('Clearing Calculations'!A1504,'Clearing Calculations'!B1504,\"\")","v":""},{"$f":"IF('Clearing Calculations'!B1504,'Clearing Calculations'!C1504,\"\")","v":""},"","","",""]
[{"$f":"IF('Clearing Calculations'!A1505=\"\",\"\",'Clearing Calculations'!A1505)","v":""},{"$f":"IF('Clearing Calculations'!A1505,'Clearing Calculations'!B1505,\"\")","v":""},{"$f":"IF('Clearing Calculations'!B1505,'Clearing Calculations'!C1505,\"\")","v":""},"","","",""]
[{"$f":"IF('Clearing Calculations'!A1506=\"\",\"\",'Clearing Calculations'!A1506)","v":""},{"$f":"IF('Clearing Calculations'!A1506,'Clearing Calculations'!B1506,\"\")","v":""},{"$f":"IF('Clearing Calculations'!B1506,'Clearing Calculations'!C1506,\"\")","v":""},"","","",""]
[{"$f":"IF('Clearing Calculations'!A1507=\"\",\"\",'Clearing Calculations'!A1507)","v":""},{"$f":"IF('Clearing Calculations'!A1507,'Clearing Calculations'!B1507,\"\")","v":""},{"$f":"IF('Clearing Calculations'!B1507,'Clearing Calculations'!C1507,\"\")","v":""},"","","",""]
[{"$f":"IF('Clearing Calculations'!A1508=\"\",\"\",'Clearing Calculations'!A1508)","v":""},{"$f":"IF('Clearing Calculations'!A1508,'Clearing Calculations'!B1508,\"\")","v":""},{"$f":"IF('Clearing Calculations'!B1508,'Clearing Calculations'!C1508,\"\")","v":""},"","","",""]
[{"$f":"IF('Clearing Calculations'!A1509=\"\",\"\",'Clearing Calculations'!A1509)","v":""},{"$f":"IF('Clearing Calculations'!A1509,'Clearing Calculations'!B1509,\"\")","v":""},{"$f":"IF('Clearing Calculations'!B1509,'Clearing Calculations'!C1509,\"\")","v":""},"","","",""]
[{"$f":"IF('Clearing Calculations'!A1510=\"\",\"\",'Clearing Calculations'!A1510)","v":""},{"$f":"IF('Clearing Calculations'!A1510,'Clearing Calculations'!B1510,\"\")","v":""},{"$f":"IF('Clearing Calculations'!B1510,'Clearing Calculations'!C1510,\"\")","v":""},"","","",""]
[{"$f":"IF('Clearing Calculations'!A1511=\"\",\"\",'Clearing Calculations'!A1511)","v":""},{"$f":"IF('Clearing Calculations'!A1511,'Clearing Calculations'!B1511,\"\")","v":""},{"$f":"IF('Clearing Calculations'!B1511,'Clearing Calculations'!C1511,\"\")","v":""},"","","",""]
[{"$f":"IF('Clearing Calculations'!A1512=\"\",\"\",'Clearing Calculations'!A1512)","v":""},{"$f":"IF('Clearing Calculations'!A1512,'Clearing Calculations'!B1512,\"\")","v":""},{"$f":"IF('Clearing Calculations'!B1512,'Clearing Calculations'!C1512,\"\")","v":""},"","","",""]
[{"$f":"IF('Clearing Calculations'!A1513=\"\",\"\",'Clearing Calculations'!A1513)","v":""},{"$f":"IF('Clearing Calculations'!A1513,'Clearing Calculations'!B1513,\"\")","v":""},{"$f":"IF('Clearing Calculations'!B1513,'Clearing Calculations'!C1513,\"\")","v":""},"","","",""]
[{"$f":"IF('Clearing Calculations'!A1514=\"\",\"\",'Clearing Calculations'!A1514)","v":""},{"$f":"IF('Clearing Calculations'!A1514,'Clearing Calculations'!B1514,\"\")","v":""},{"$f":"IF('Clearing Calculations'!B1514,'Clearing Calculations'!C1514,\"\")","v":""},"","","",""]
[{"$f":"IF('Clearing Calculations'!A1515=\"\",\"\",'Clearing Calculations'!A1515)","v":""},{"$f":"IF('Clearing Calculations'!A1515,'Clearing Calculations'!B1515,\"\")","v":""},{"$f":"IF('Clearing Calculations'!B1515,'Clearing Calculations'!C1515,\"\")","v":""},"","","",""]
[{"$f":"IF('Clearing Calculations'!A1516=\"\",\"\",'Clearing Calculations'!A1516)","v":""},{"$f":"IF('Clearing Calculations'!A1516,'Clearing Calculations'!B1516,\"\")","v":""},{"$f":"IF('Clearing Calculations'!B1516,'Clearing Calculations'!C1516,\"\")","v":""},{"$f":"IF(A1522=\"\",\"\",$B1522+$C1522)","v":""},{"$f":"IF(A1522=\"\",\"\",(D1522+D1521)/2*(A1522-A1521))","v":""},{"$f":"IF(A1522=\"\",\"\",(E1522/9))","v":""},{"$f":"IF(A1522=\"\",\"\",E1522/$G$3)","v":""}]
[{"$f":"IF('Clearing Calculations'!A1517=\"\",\"\",'Clearing Calculations'!A1517)","v":""},{"$f":"IF('Clearing Calculations'!A1517,'Clearing Calculations'!B1517,\"\")","v":""},{"$f":"IF('Clearing Calculations'!B1517,'Clearing Calculations'!C1517,\"\")","v":""},"","","",""]
[{"$f":"IF('Clearing Calculations'!A1518=\"\",\"\",'Clearing Calculations'!A1518)","v":""},{"$f":"IF('Clearing Calculations'!A1518,'Clearing Calculations'!B1518,\"\")","v":""},{"$f":"IF('Clearing Calculations'!B1518,'Clearing Calculations'!C1518,\"\")","v":""},"","","",""]
[{"$f":"IF('Clearing Calculations'!A1519=\"\",\"\",'Clearing Calculations'!A1519)","v":""},{"$f":"IF('Clearing Calculations'!A1519,'Clearing Calculations'!B1519,\"\")","v":""},{"$f":"IF('Clearing Calculations'!B1519,'Clearing Calculations'!C1519,\"\")","v":""},"","","",""]
[{"$f":"IF('Clearing Calculations'!A1520=\"\",\"\",'Clearing Calculations'!A1520)","v":""},{"$f":"IF('Clearing Calculations'!A1520,'Clearing Calculations'!B1520,\"\")","v":""},{"$f":"IF('Clearing Calculations'!B1520,'Clearing Calculations'!C1520,\"\")","v":""},"","","",""]
[{"$f":"IF('Clearing Calculations'!A1521=\"\",\"\",'Clearing Calculations'!A1521)","v":""},{"$f":"IF('Clearing Calculations'!A1521,'Clearing Calculations'!B1521,\"\")","v":""},{"$f":"IF('Clearing Calculations'!B1521,'Clearing Calculations'!C1521,\"\")","v":""},"","","",""]
[{"$f":"IF('Clearing Calculations'!A1522=\"\",\"\",'Clearing Calculations'!A1522)","v":""},{"$f":"IF('Clearing Calculations'!A1522,'Clearing Calculations'!B1522,\"\")","v":""},{"$f":"IF('Clearing Calculations'!B1522,'Clearing Calculations'!C1522,\"\")","v":""},"","","",""]
[{"$f":"IF('Clearing Calculations'!A1523=\"\",\"\",'Clearing Calculations'!A1523)","v":""},{"$f":"IF('Clearing Calculations'!A1523,'Clearing Calculations'!B1523,\"\")","v":""},{"$f":"IF('Clearing Calculations'!B1523,'Clearing Calculations'!C1523,\"\")","v":""},"","","",""]
[{"$f":"IF('Clearing Calculations'!A1524=\"\",\"\",'Clearing Calculations'!A1524)","v":""},{"$f":"IF('Clearing Calculations'!A1524,'Clearing Calculations'!B1524,\"\")","v":""},{"$f":"IF('Clearing Calculations'!B1524,'Clearing Calculations'!C1524,\"\")","v":""},"","","",""]
[{"$f":"IF('Clearing Calculations'!A1525=\"\",\"\",'Clearing Calculations'!A1525)","v":""},{"$f":"IF('Clearing Calculations'!A1525,'Clearing Calculations'!B1525,\"\")","v":""},{"$f":"IF('Clearing Calculations'!B1525,'Clearing Calculations'!C1525,\"\")","v":""},"","","",""]
[{"$f":"IF('Clearing Calculations'!A1526=\"\",\"\",'Clearing Calculations'!A1526)","v":""},{"$f":"IF('Clearing Calculations'!A1526,'Clearing Calculations'!B1526,\"\")","v":""},{"$f":"IF('Clearing Calculations'!B1526,'Clearing Calculations'!C1526,\"\")","v":""},"","","",""]
[{"$f":"IF('Clearing Calculations'!A1527=\"\",\"\",'Clearing Calculations'!A1527)","v":""},{"$f":"IF('Clearing Calculations'!A1527,'Clearing Calculations'!B1527,\"\")","v":""},{"$f":"IF('Clearing Calculations'!B1527,'Clearing Calculations'!C1527,\"\")","v":""},"","","",""]
[{"$f":"IF('Clearing Calculations'!A1528=\"\",\"\",'Clearing Calculations'!A1528)","v":""},{"$f":"IF('Clearing Calculations'!A1528,'Clearing Calculations'!B1528,\"\")","v":""},{"$f":"IF('Clearing Calculations'!B1528,'Clearing Calculations'!C1528,\"\")","v":""},"","","",""]
[{"$f":"IF('Clearing Calculations'!A1529=\"\",\"\",'Clearing Calculations'!A1529)","v":""},{"$f":"IF('Clearing Calculations'!A1529,'Clearing Calculations'!B1529,\"\")","v":""},{"$f":"IF('Clearing Calculations'!B1529,'Clearing Calculations'!C1529,\"\")","v":""},"","","",""]
[{"$f":"IF('Clearing Calculations'!A1530=\"\",\"\",'Clearing Calculations'!A1530)","v":""},{"$f":"IF('Clearing Calculations'!A1530,'Clearing Calculations'!B1530,\"\")","v":""},{"$f":"IF('Clearing Calculations'!B1530,'Clearing Calculations'!C1530,\"\")","v":""},"","","",""]
[{"$f":"IF('Clearing Calculations'!A1531=\"\",\"\",'Clearing Calculations'!A1531)","v":""},{"$f":"IF('Clearing Calculations'!A1531,'Clearing Calculations'!B1531,\"\")","v":""},{"$f":"IF('Clearing Calculations'!B1531,'Clearing Calculations'!C1531,\"\")","v":""},"","","",""]
[{"$f":"IF('Clearing Calculations'!A1532=\"\",\"\",'Clearing Calculations'!A1532)","v":""},{"$f":"IF('Clearing Calculations'!A1532,'Clearing Calculations'!B1532,\"\")","v":""},{"$f":"IF('Clearing Calculations'!B1532,'Clearing Calculations'!C1532,\"\")","v":""},"","","",""]
[{"$f":"IF('Clearing Calculations'!A1533=\"\",\"\",'Clearing Calculations'!A1533)","v":""},{"$f":"IF('Clearing Calculations'!A1533,'Clearing Calculations'!B1533,\"\")","v":""},{"$f":"IF('Clearing Calculations'!B1533,'Clearing Calculations'!C1533,\"\")","v":""},"","","",""]
[{"$f":"IF('Clearing Calculations'!A1534=\"\",\"\",'Clearing Calculations'!A1534)","v":""},{"$f":"IF('Clearing Calculations'!A1534,'Clearing Calculations'!B1534,\"\")","v":""},{"$f":"IF('Clearing Calculations'!B1534,'Clearing Calculations'!C1534,\"\")","v":""},"","","",""]
[{"$f":"IF('Clearing Calculations'!A1535=\"\",\"\",'Clearing Calculations'!A1535)","v":""},{"$f":"IF('Clearing Calculations'!A1535,'Clearing Calculations'!B1535,\"\")","v":""},{"$f":"IF('Clearing Calculations'!B1535,'Clearing Calculations'!C1535,\"\")","v":""},"","","",""]
[{"$f":"IF('Clearing Calculations'!A1536=\"\",\"\",'Clearing Calculations'!A1536)","v":""},{"$f":"IF('Clearing Calculations'!A1536,'Clearing Calculations'!B1536,\"\")","v":""},{"$f":"IF('Clearing Calculations'!B1536,'Clearing Calculations'!C1536,\"\")","v":""},"","","",""]
[{"$f":"IF('Clearing Calculations'!A1537=\"\",\"\",'Clearing Calculations'!A1537)","v":""},{"$f":"IF('Clearing Calculations'!A1537,'Clearing Calculations'!B1537,\"\")","v":""},{"$f":"IF('Clearing Calculations'!B1537,'Clearing Calculations'!C1537,\"\")","v":""},"","","",""]
[{"$f":"IF('Clearing Calculations'!A1538=\"\",\"\",'Clearing Calculations'!A1538)","v":""},{"$f":"IF('Clearing Calculations'!A1538,'Clearing Calculations'!B1538,\"\")","v":""},{"$f":"IF('Clearing Calculations'!B1538,'Clearing Calculations'!C1538,\"\")","v":""},"","","",""]
[{"$f":"IF('Clearing Calculations'!A1539=\"\",\"\",'Clearing Calculations'!A1539)","v":""},{"$f":"IF('Clearing Calculations'!A1539,'Clearing Calculations'!B1539,\"\")","v":""},{"$f":"IF('Clearing Calculations'!B1539,'Clearing Calculations'!C1539,\"\")","v":""},"","","",""]
[{"$f":"IF('Clearing Calculations'!A1540=\"\",\"\",'Clearing Calculations'!A1540)","v":""},{"$f":"IF('Clearing Calculations'!A1540,'Clearing Calculations'!B1540,\"\")","v":""},{"$f":"IF('Clearing Calculations'!B1540,'Clearing Calculations'!C1540,\"\")","v":""},"","","",""]
[{"$f":"IF('Clearing Calculations'!A1541=\"\",\"\",'Clearing Calculations'!A1541)","v":""},{"$f":"IF('Clearing Calculations'!A1541,'Clearing Calculations'!B1541,\"\")","v":""},{"$f":"IF('Clearing Calculations'!B1541,'Clearing Calculations'!C1541,\"\")","v":""},"","","",""]
[{"$f":"IF('Clearing Calculations'!A1542=\"\",\"\",'Clearing Calculations'!A1542)","v":""},{"$f":"IF('Clearing Calculations'!A1542,'Clearing Calculations'!B1542,\"\")","v":""},{"$f":"IF('Clearing Calculations'!B1542,'Clearing Calculations'!C1542,\"\")","v":""},"","","",""]
[{"$f":"IF('Clearing Calculations'!A1543=\"\",\"\",'Clearing Calculations'!A1543)","v":""},{"$f":"IF('Clearing Calculations'!A1543,'Clearing Calculations'!B1543,\"\")","v":""},{"$f":"IF('Clearing Calculations'!B1543,'Clearing Calculations'!C1543,\"\")","v":""},"","","",""]
[{"$f":"IF('Clearing Calculations'!A1544=\"\",\"\",'Clearing Calculations'!A1544)","v":""},{"$f":"IF('Clearing Calculations'!A1544,'Clearing Calculations'!B1544,\"\")","v":""},{"$f":"IF('Clearing Calculations'!B1544,'Clearing Calculations'!C1544,\"\")","v":""},"","","",""]
[{"$f":"IF('Clearing Calculations'!A1545=\"\",\"\",'Clearing Calculations'!A1545)","v":""},{"$f":"IF('Clearing Calculations'!A1545,'Clearing Calculations'!B1545,\"\")","v":""},{"$f":"IF('Clearing Calculations'!B1545,'Clearing Calculations'!C1545,\"\")","v":""},"","","",""]
[{"$f":"IF('Clearing Calculations'!A1546=\"\",\"\",'Clearing Calculations'!A1546)","v":""},{"$f":"IF('Clearing Calculations'!A1546,'Clearing Calculations'!B1546,\"\")","v":""},{"$f":"IF('Clearing Calculations'!B1546,'Clearing Calculations'!C1546,\"\")","v":""},"","","",""]
[{"$f":"IF('Clearing Calculations'!A1547=\"\",\"\",'Clearing Calculations'!A1547)","v":""},{"$f":"IF('Clearing Calculations'!A1547,'Clearing Calculations'!B1547,\"\")","v":""},{"$f":"IF('Clearing Calculations'!B1547,'Clearing Calculations'!C1547,\"\")","v":""},"","","",""]
[{"$f":"IF('Clearing Calculations'!A1548=\"\",\"\",'Clearing Calculations'!A1548)","v":""},{"$f":"IF('Clearing Calculations'!A1548,'Clearing Calculations'!B1548,\"\")","v":""},{"$f":"IF('Clearing Calculations'!B1548,'Clearing Calculations'!C1548,\"\")","v":""},"","","",""]
[{"$f":"IF('Clearing Calculations'!A1549=\"\",\"\",'Clearing Calculations'!A1549)","v":""},{"$f":"IF('Clearing Calculations'!A1549,'Clearing Calculations'!B1549,\"\")","v":""},{"$f":"IF('Clearing Calculations'!B1549,'Clearing Calculations'!C1549,\"\")","v":""},"","","",""]
[{"$f":"IF('Clearing Calculations'!A1550=\"\",\"\",'Clearing Calculations'!A1550)","v":""},{"$f":"IF('Clearing Calculations'!A1550,'Clearing Calculations'!B1550,\"\")","v":""},{"$f":"IF('Clearing Calculations'!B1550,'Clearing Calculations'!C1550,\"\")","v":""},"","","",""]
[{"$f":"IF('Clearing Calculations'!A1551=\"\",\"\",'Clearing Calculations'!A1551)","v":""},{"$f":"IF('Clearing Calculations'!A1551,'Clearing Calculations'!B1551,\"\")","v":""},{"$f":"IF('Clearing Calculations'!B1551,'Clearing Calculations'!C1551,\"\")","v":""},"","","",""]
[{"$f":"IF('Clearing Calculations'!A1552=\"\",\"\",'Clearing Calculations'!A1552)","v":""},{"$f":"IF('Clearing Calculations'!A1552,'Clearing Calculations'!B1552,\"\")","v":""},{"$f":"IF('Clearing Calculations'!B1552,'Clearing Calculations'!C1552,\"\")","v":""},"","","",""]
[{"$f":"IF('Clearing Calculations'!A1553=\"\",\"\",'Clearing Calculations'!A1553)","v":""},{"$f":"IF('Clearing Calculations'!A1553,'Clearing Calculations'!B1553,\"\")","v":""},{"$f":"IF('Clearing Calculations'!B1553,'Clearing Calculations'!C1553,\"\")","v":""},"","","",""]
[{"$f":"IF('Clearing Calculations'!A1554=\"\",\"\",'Clearing Calculations'!A1554)","v":""},{"$f":"IF('Clearing Calculations'!A1554,'Clearing Calculations'!B1554,\"\")","v":""},{"$f":"IF('Clearing Calculations'!B1554,'Clearing Calculations'!C1554,\"\")","v":""},"","","",""]
[{"$f":"IF('Clearing Calculations'!A1555=\"\",\"\",'Clearing Calculations'!A1555)","v":""},{"$f":"IF('Clearing Calculations'!A1555,'Clearing Calculations'!B1555,\"\")","v":""},{"$f":"IF('Clearing Calculations'!B1555,'Clearing Calculations'!C1555,\"\")","v":""},"","","",""]
[{"$f":"IF('Clearing Calculations'!A1556=\"\",\"\",'Clearing Calculations'!A1556)","v":""},{"$f":"IF('Clearing Calculations'!A1556,'Clearing Calculations'!B1556,\"\")","v":""},{"$f":"IF('Clearing Calculations'!B1556,'Clearing Calculations'!C1556,\"\")","v":""},"","","",""]
[{"$f":"IF('Clearing Calculations'!A1557=\"\",\"\",'Clearing Calculations'!A1557)","v":""},{"$f":"IF('Clearing Calculations'!A1557,'Clearing Calculations'!B1557,\"\")","v":""},{"$f":"IF('Clearing Calculations'!B1557,'Clearing Calculations'!C1557,\"\")","v":""},"","","",""]
[{"$f":"IF('Clearing Calculations'!A1558=\"\",\"\",'Clearing Calculations'!A1558)","v":""},{"$f":"IF('Clearing Calculations'!A1558,'Clearing Calculations'!B1558,\"\")","v":""},{"$f":"IF('Clearing Calculations'!B1558,'Clearing Calculations'!C1558,\"\")","v":""},"","","",""]
[{"$f":"IF('Clearing Calculations'!A1559=\"\",\"\",'Clearing Calculations'!A1559)","v":""},{"$f":"IF('Clearing Calculations'!A1559,'Clearing Calculations'!B1559,\"\")","v":""},{"$f":"IF('Clearing Calculations'!B1559,'Clearing Calculations'!C1559,\"\")","v":""},"","","",""]
[{"$f":"IF('Clearing Calculations'!A1560=\"\",\"\",'Clearing Calculations'!A1560)","v":""},{"$f":"IF('Clearing Calculations'!A1560,'Clearing Calculations'!B1560,\"\")","v":""},{"$f":"IF('Clearing Calculations'!B1560,'Clearing Calculations'!C1560,\"\")","v":""},"","","",""]
[{"$f":"IF('Clearing Calculations'!A1561=\"\",\"\",'Clearing Calculations'!A1561)","v":""},{"$f":"IF('Clearing Calculations'!A1561,'Clearing Calculations'!B1561,\"\")","v":""},{"$f":"IF('Clearing Calculations'!B1561,'Clearing Calculations'!C1561,\"\")","v":""},"","","",""]
[{"$f":"IF('Clearing Calculations'!A1562=\"\",\"\",'Clearing Calculations'!A1562)","v":""},{"$f":"IF('Clearing Calculations'!A1562,'Clearing Calculations'!B1562,\"\")","v":""},{"$f":"IF('Clearing Calculations'!B1562,'Clearing Calculations'!C1562,\"\")","v":""},"","","",""]
[{"$f":"IF('Clearing Calculations'!A1563=\"\",\"\",'Clearing Calculations'!A1563)","v":""},{"$f":"IF('Clearing Calculations'!A1563,'Clearing Calculations'!B1563,\"\")","v":""},{"$f":"IF('Clearing Calculations'!B1563,'Clearing Calculations'!C1563,\"\")","v":""},"","","",""]
[{"$f":"IF('Clearing Calculations'!A1564=\"\",\"\",'Clearing Calculations'!A1564)","v":""},{"$f":"IF('Clearing Calculations'!A1564,'Clearing Calculations'!B1564,\"\")","v":""},{"$f":"IF('Clearing Calculations'!B1564,'Clearing Calculations'!C1564,\"\")","v":""},"","","",""]
[{"$f":"IF('Clearing Calculations'!A1565=\"\",\"\",'Clearing Calculations'!A1565)","v":""},{"$f":"IF('Clearing Calculations'!A1565,'Clearing Calculations'!B1565,\"\")","v":""},{"$f":"IF('Clearing Calculations'!B1565,'Clearing Calculations'!C1565,\"\")","v":""},"","","",""]
[{"$f":"IF('Clearing Calculations'!A1566=\"\",\"\",'Clearing Calculations'!A1566)","v":""},{"$f":"IF('Clearing Calculations'!A1566,'Clearing Calculations'!B1566,\"\")","v":""},{"$f":"IF('Clearing Calculations'!B1566,'Clearing Calculations'!C1566,\"\")","v":""},"","","",""]
[{"$f":"IF('Clearing Calculations'!A1567=\"\",\"\",'Clearing Calculations'!A1567)","v":""},{"$f":"IF('Clearing Calculations'!A1567,'Clearing Calculations'!B1567,\"\")","v":""},{"$f":"IF('Clearing Calculations'!B1567,'Clearing Calculations'!C1567,\"\")","v":""},"","","",""]
[{"$f":"IF('Clearing Calculations'!A1568=\"\",\"\",'Clearing Calculations'!A1568)","v":""},{"$f":"IF('Clearing Calculations'!A1568,'Clearing Calculations'!B1568,\"\")","v":""},{"$f":"IF('Clearing Calculations'!B1568,'Clearing Calculations'!C1568,\"\")","v":""},"","","",""]
[{"$f":"IF('Clearing Calculations'!A1569=\"\",\"\",'Clearing Calculations'!A1569)","v":""},{"$f":"IF('Clearing Calculations'!A1569,'Clearing Calculations'!B1569,\"\")","v":""},{"$f":"IF('Clearing Calculations'!B1569,'Clearing Calculations'!C1569,\"\")","v":""},"","","",""]
[{"$f":"IF('Clearing Calculations'!A1570=\"\",\"\",'Clearing Calculations'!A1570)","v":""},{"$f":"IF('Clearing Calculations'!A1570,'Clearing Calculations'!B1570,\"\")","v":""},{"$f":"IF('Clearing Calculations'!B1570,'Clearing Calculations'!C1570,\"\")","v":""},"","","",""]
[{"$f":"IF('Clearing Calculations'!A1571=\"\",\"\",'Clearing Calculations'!A1571)","v":""},{"$f":"IF('Clearing Calculations'!A1571,'Clearing Calculations'!B1571,\"\")","v":""},{"$f":"IF('Clearing Calculations'!B1571,'Clearing Calculations'!C1571,\"\")","v":""},"","","",""]
[{"$f":"IF('Clearing Calculations'!A1572=\"\",\"\",'Clearing Calculations'!A1572)","v":""},{"$f":"IF('Clearing Calculations'!A1572,'Clearing Calculations'!B1572,\"\")","v":""},{"$f":"IF('Clearing Calculations'!B1572,'Clearing Calculations'!C1572,\"\")","v":""},"","","",""]
[{"$f":"IF('Clearing Calculations'!A1573=\"\",\"\",'Clearing Calculations'!A1573)","v":""},{"$f":"IF('Clearing Calculations'!A1573,'Clearing Calculations'!B1573,\"\")","v":""},{"$f":"IF('Clearing Calculations'!B1573,'Clearing Calculations'!C1573,\"\")","v":""},"","","",""]
[{"$f":"IF('Clearing Calculations'!A1574=\"\",\"\",'Clearing Calculations'!A1574)","v":""},{"$f":"IF('Clearing Calculations'!A1574,'Clearing Calculations'!B1574,\"\")","v":""},{"$f":"IF('Clearing Calculations'!B1574,'Clearing Calculations'!C1574,\"\")","v":""},"","","",""]
[{"$f":"IF('Clearing Calculations'!A1575=\"\",\"\",'Clearing Calculations'!A1575)","v":""},{"$f":"IF('Clearing Calculations'!A1575,'Clearing Calculations'!B1575,\"\")","v":""},{"$f":"IF('Clearing Calculations'!B1575,'Clearing Calculations'!C1575,\"\")","v":""},"","","",""]
[{"$f":"IF('Clearing Calculations'!A1576=\"\",\"\",'Clearing Calculations'!A1576)","v":""},{"$f":"IF('Clearing Calculations'!A1576,'Clearing Calculations'!B1576,\"\")","v":""},{"$f":"IF('Clearing Calculations'!B1576,'Clearing Calculations'!C1576,\"\")","v":""},"","","",""]
[{"$f":"IF('Clearing Calculations'!A1577=\"\",\"\",'Clearing Calculations'!A1577)","v":""},{"$f":"IF('Clearing Calculations'!A1577,'Clearing Calculations'!B1577,\"\")","v":""},{"$f":"IF('Clearing Calculations'!B1577,'Clearing Calculations'!C1577,\"\")","v":""},"","","",""]
[{"$f":"IF('Clearing Calculations'!A1578=\"\",\"\",'Clearing Calculations'!A1578)","v":""},{"$f":"IF('Clearing Calculations'!A1578,'Clearing Calculations'!B1578,\"\")","v":""},{"$f":"IF('Clearing Calculations'!B1578,'Clearing Calculations'!C1578,\"\")","v":""},"","","",""]
[{"$f":"IF('Clearing Calculations'!A1579=\"\",\"\",'Clearing Calculations'!A1579)","v":""},{"$f":"IF('Clearing Calculations'!A1579,'Clearing Calculations'!B1579,\"\")","v":""},{"$f":"IF('Clearing Calculations'!B1579,'Clearing Calculations'!C1579,\"\")","v":""},"","","",""]
[{"$f":"IF('Clearing Calculations'!A1580=\"\",\"\",'Clearing Calculations'!A1580)","v":""},{"$f":"IF('Clearing Calculations'!A1580,'Clearing Calculations'!B1580,\"\")","v":""},{"$f":"IF('Clearing Calculations'!B1580,'Clearing Calculations'!C1580,\"\")","v":""},{"$f":"IF(A1586=\"\",\"\",$B1586+$C1586)","v":""},{"$f":"IF(A1586=\"\",\"\",(D1586+D1585)/2*(A1586-A1585))","v":""},{"$f":"IF(A1586=\"\",\"\",(E1586/9))","v":""},{"$f":"IF(A1586=\"\",\"\",E1586/$G$3)","v":""}]
[{"$f":"IF('Clearing Calculations'!A1581=\"\",\"\",'Clearing Calculations'!A1581)","v":""},{"$f":"IF('Clearing Calculations'!A1581,'Clearing Calculations'!B1581,\"\")","v":""},{"$f":"IF('Clearing Calculations'!B1581,'Clearing Calculations'!C1581,\"\")","v":""},"","","",""]
[{"$f":"IF('Clearing Calculations'!A1582=\"\",\"\",'Clearing Calculations'!A1582)","v":""},{"$f":"IF('Clearing Calculations'!A1582,'Clearing Calculations'!B1582,\"\")","v":""},{"$f":"IF('Clearing Calculations'!B1582,'Clearing Calculations'!C1582,\"\")","v":""},"","","",""]
[{"$f":"IF('Clearing Calculations'!A1583=\"\",\"\",'Clearing Calculations'!A1583)","v":""},{"$f":"IF('Clearing Calculations'!A1583,'Clearing Calculations'!B1583,\"\")","v":""},{"$f":"IF('Clearing Calculations'!B1583,'Clearing Calculations'!C1583,\"\")","v":""},"","","",""]
[{"$f":"IF('Clearing Calculations'!A1584=\"\",\"\",'Clearing Calculations'!A1584)","v":""},{"$f":"IF('Clearing Calculations'!A1584,'Clearing Calculations'!B1584,\"\")","v":""},{"$f":"IF('Clearing Calculations'!B1584,'Clearing Calculations'!C1584,\"\")","v":""},"","","",""]
[{"$f":"IF('Clearing Calculations'!A1585=\"\",\"\",'Clearing Calculations'!A1585)","v":""},{"$f":"IF('Clearing Calculations'!A1585,'Clearing Calculations'!B1585,\"\")","v":""},{"$f":"IF('Clearing Calculations'!B1585,'Clearing Calculations'!C1585,\"\")","v":""},"","","",""]
[{"$f":"IF('Clearing Calculations'!A1586=\"\",\"\",'Clearing Calculations'!A1586)","v":""},{"$f":"IF('Clearing Calculations'!A1586,'Clearing Calculations'!B1586,\"\")","v":""},{"$f":"IF('Clearing Calculations'!B1586,'Clearing Calculations'!C1586,\"\")","v":""},"","","",""]
[{"$f":"IF('Clearing Calculations'!A1587=\"\",\"\",'Clearing Calculations'!A1587)","v":""},{"$f":"IF('Clearing Calculations'!A1587,'Clearing Calculations'!B1587,\"\")","v":""},{"$f":"IF('Clearing Calculations'!B1587,'Clearing Calculations'!C1587,\"\")","v":""},"","","",""]
[{"$f":"IF('Clearing Calculations'!A1588=\"\",\"\",'Clearing Calculations'!A1588)","v":""},{"$f":"IF('Clearing Calculations'!A1588,'Clearing Calculations'!B1588,\"\")","v":""},{"$f":"IF('Clearing Calculations'!B1588,'Clearing Calculations'!C1588,\"\")","v":""},"","","",""]
[{"$f":"IF('Clearing Calculations'!A1589=\"\",\"\",'Clearing Calculations'!A1589)","v":""},{"$f":"IF('Clearing Calculations'!A1589,'Clearing Calculations'!B1589,\"\")","v":""},{"$f":"IF('Clearing Calculations'!B1589,'Clearing Calculations'!C1589,\"\")","v":""},"","","",""]
[{"$f":"IF('Clearing Calculations'!A1590=\"\",\"\",'Clearing Calculations'!A1590)","v":""},{"$f":"IF('Clearing Calculations'!A1590,'Clearing Calculations'!B1590,\"\")","v":""},{"$f":"IF('Clearing Calculations'!B1590,'Clearing Calculations'!C1590,\"\")","v":""},"","","",""]
[{"$f":"IF('Clearing Calculations'!A1591=\"\",\"\",'Clearing Calculations'!A1591)","v":""},{"$f":"IF('Clearing Calculations'!A1591,'Clearing Calculations'!B1591,\"\")","v":""},{"$f":"IF('Clearing Calculations'!B1591,'Clearing Calculations'!C1591,\"\")","v":""},"","","",""]
[{"$f":"IF('Clearing Calculations'!A1592=\"\",\"\",'Clearing Calculations'!A1592)","v":""},{"$f":"IF('Clearing Calculations'!A1592,'Clearing Calculations'!B1592,\"\")","v":""},{"$f":"IF('Clearing Calculations'!B1592,'Clearing Calculations'!C1592,\"\")","v":""},"","","",""]
[{"$f":"IF('Clearing Calculations'!A1593=\"\",\"\",'Clearing Calculations'!A1593)","v":""},{"$f":"IF('Clearing Calculations'!A1593,'Clearing Calculations'!B1593,\"\")","v":""},{"$f":"IF('Clearing Calculations'!B1593,'Clearing Calculations'!C1593,\"\")","v":""},"","","",""]
[{"$f":"IF('Clearing Calculations'!A1594=\"\",\"\",'Clearing Calculations'!A1594)","v":""},{"$f":"IF('Clearing Calculations'!A1594,'Clearing Calculations'!B1594,\"\")","v":""},{"$f":"IF('Clearing Calculations'!B1594,'Clearing Calculations'!C1594,\"\")","v":""},"","","",""]
[{"$f":"IF('Clearing Calculations'!A1595=\"\",\"\",'Clearing Calculations'!A1595)","v":""},{"$f":"IF('Clearing Calculations'!A1595,'Clearing Calculations'!B1595,\"\")","v":""},{"$f":"IF('Clearing Calculations'!B1595,'Clearing Calculations'!C1595,\"\")","v":""},"","","",""]
[{"$f":"IF('Clearing Calculations'!A1596=\"\",\"\",'Clearing Calculations'!A1596)","v":""},{"$f":"IF('Clearing Calculations'!A1596,'Clearing Calculations'!B1596,\"\")","v":""},{"$f":"IF('Clearing Calculations'!B1596,'Clearing Calculations'!C1596,\"\")","v":""},"","","",""]
[{"$f":"IF('Clearing Calculations'!A1597=\"\",\"\",'Clearing Calculations'!A1597)","v":""},{"$f":"IF('Clearing Calculations'!A1597,'Clearing Calculations'!B1597,\"\")","v":""},{"$f":"IF('Clearing Calculations'!B1597,'Clearing Calculations'!C1597,\"\")","v":""},"","","",""]
[{"$f":"IF('Clearing Calculations'!A1598=\"\",\"\",'Clearing Calculations'!A1598)","v":""},{"$f":"IF('Clearing Calculations'!A1598,'Clearing Calculations'!B1598,\"\")","v":""},{"$f":"IF('Clearing Calculations'!B1598,'Clearing Calculations'!C1598,\"\")","v":""},"","","",""]
[{"$f":"IF('Clearing Calculations'!A1599=\"\",\"\",'Clearing Calculations'!A1599)","v":""},{"$f":"IF('Clearing Calculations'!A1599,'Clearing Calculations'!B1599,\"\")","v":""},{"$f":"IF('Clearing Calculations'!B1599,'Clearing Calculations'!C1599,\"\")","v":""},"","","",""]
[{"$f":"IF('Clearing Calculations'!A1600=\"\",\"\",'Clearing Calculations'!A1600)","v":""},{"$f":"IF('Clearing Calculations'!A1600,'Clearing Calculations'!B1600,\"\")","v":""},{"$f":"IF('Clearing Calculations'!B1600,'Clearing Calculations'!C1600,\"\")","v":""},"","","",""]
[{"$f":"IF('Clearing Calculations'!A1601=\"\",\"\",'Clearing Calculations'!A1601)","v":""},{"$f":"IF('Clearing Calculations'!A1601,'Clearing Calculations'!B1601,\"\")","v":""},{"$f":"IF('Clearing Calculations'!B1601,'Clearing Calculations'!C1601,\"\")","v":""},"","","",""]
[{"$f":"IF('Clearing Calculations'!A1602=\"\",\"\",'Clearing Calculations'!A1602)","v":""},{"$f":"IF('Clearing Calculations'!A1602,'Clearing Calculations'!B1602,\"\")","v":""},{"$f":"IF('Clearing Calculations'!B1602,'Clearing Calculations'!C1602,\"\")","v":""},"","","",""]
[{"$f":"IF('Clearing Calculations'!A1603=\"\",\"\",'Clearing Calculations'!A1603)","v":""},{"$f":"IF('Clearing Calculations'!A1603,'Clearing Calculations'!B1603,\"\")","v":""},{"$f":"IF('Clearing Calculations'!B1603,'Clearing Calculations'!C1603,\"\")","v":""},"","","",""]
[{"$f":"IF('Clearing Calculations'!A1604=\"\",\"\",'Clearing Calculations'!A1604)","v":""},{"$f":"IF('Clearing Calculations'!A1604,'Clearing Calculations'!B1604,\"\")","v":""},{"$f":"IF('Clearing Calculations'!B1604,'Clearing Calculations'!C1604,\"\")","v":""},"","","",""]
[{"$f":"IF('Clearing Calculations'!A1605=\"\",\"\",'Clearing Calculations'!A1605)","v":""},{"$f":"IF('Clearing Calculations'!A1605,'Clearing Calculations'!B1605,\"\")","v":""},{"$f":"IF('Clearing Calculations'!B1605,'Clearing Calculations'!C1605,\"\")","v":""},"","","",""]
[{"$f":"IF('Clearing Calculations'!A1606=\"\",\"\",'Clearing Calculations'!A1606)","v":""},{"$f":"IF('Clearing Calculations'!A1606,'Clearing Calculations'!B1606,\"\")","v":""},{"$f":"IF('Clearing Calculations'!B1606,'Clearing Calculations'!C1606,\"\")","v":""},"","","",""]
[{"$f":"IF('Clearing Calculations'!A1607=\"\",\"\",'Clearing Calculations'!A1607)","v":""},{"$f":"IF('Clearing Calculations'!A1607,'Clearing Calculations'!B1607,\"\")","v":""},{"$f":"IF('Clearing Calculations'!B1607,'Clearing Calculations'!C1607,\"\")","v":""},"","","",""]
[{"$f":"IF('Clearing Calculations'!A1608=\"\",\"\",'Clearing Calculations'!A1608)","v":""},{"$f":"IF('Clearing Calculations'!A1608,'Clearing Calculations'!B1608,\"\")","v":""},{"$f":"IF('Clearing Calculations'!B1608,'Clearing Calculations'!C1608,\"\")","v":""},"","","",""]
[{"$f":"IF('Clearing Calculations'!A1609=\"\",\"\",'Clearing Calculations'!A1609)","v":""},{"$f":"IF('Clearing Calculations'!A1609,'Clearing Calculations'!B1609,\"\")","v":""},{"$f":"IF('Clearing Calculations'!B1609,'Clearing Calculations'!C1609,\"\")","v":""},"","","",""]
[{"$f":"IF('Clearing Calculations'!A1610=\"\",\"\",'Clearing Calculations'!A1610)","v":""},{"$f":"IF('Clearing Calculations'!A1610,'Clearing Calculations'!B1610,\"\")","v":""},{"$f":"IF('Clearing Calculations'!B1610,'Clearing Calculations'!C1610,\"\")","v":""},"","","",""]
[{"$f":"IF('Clearing Calculations'!A1611=\"\",\"\",'Clearing Calculations'!A1611)","v":""},{"$f":"IF('Clearing Calculations'!A1611,'Clearing Calculations'!B1611,\"\")","v":""},{"$f":"IF('Clearing Calculations'!B1611,'Clearing Calculations'!C1611,\"\")","v":""},"","","",""]
[{"$f":"IF('Clearing Calculations'!A1612=\"\",\"\",'Clearing Calculations'!A1612)","v":""},{"$f":"IF('Clearing Calculations'!A1612,'Clearing Calculations'!B1612,\"\")","v":""},{"$f":"IF('Clearing Calculations'!B1612,'Clearing Calculations'!C1612,\"\")","v":""},"","","",""]
[{"$f":"IF('Clearing Calculations'!A1613=\"\",\"\",'Clearing Calculations'!A1613)","v":""},{"$f":"IF('Clearing Calculations'!A1613,'Clearing Calculations'!B1613,\"\")","v":""},{"$f":"IF('Clearing Calculations'!B1613,'Clearing Calculations'!C1613,\"\")","v":""},"","","",""]
[{"$f":"IF('Clearing Calculations'!A1614=\"\",\"\",'Clearing Calculations'!A1614)","v":""},{"$f":"IF('Clearing Calculations'!A1614,'Clearing Calculations'!B1614,\"\")","v":""},{"$f":"IF('Clearing Calculations'!B1614,'Clearing Calculations'!C1614,\"\")","v":""},"","","",""]
[{"$f":"IF('Clearing Calculations'!A1615=\"\",\"\",'Clearing Calculations'!A1615)","v":""},{"$f":"IF('Clearing Calculations'!A1615,'Clearing Calculations'!B1615,\"\")","v":""},{"$f":"IF('Clearing Calculations'!B1615,'Clearing Calculations'!C1615,\"\")","v":""},"","","",""]
[{"$f":"IF('Clearing Calculations'!A1616=\"\",\"\",'Clearing Calculations'!A1616)","v":""},{"$f":"IF('Clearing Calculations'!A1616,'Clearing Calculations'!B1616,\"\")","v":""},{"$f":"IF('Clearing Calculations'!B1616,'Clearing Calculations'!C1616,\"\")","v":""},"","","",""]
[{"$f":"IF('Clearing Calculations'!A1617=\"\",\"\",'Clearing Calculations'!A1617)","v":""},{"$f":"IF('Clearing Calculations'!A1617,'Clearing Calculations'!B1617,\"\")","v":""},{"$f":"IF('Clearing Calculations'!B1617,'Clearing Calculations'!C1617,\"\")","v":""},"","","",""]
[{"$f":"IF('Clearing Calculations'!A1618=\"\",\"\",'Clearing Calculations'!A1618)","v":""},{"$f":"IF('Clearing Calculations'!A1618,'Clearing Calculations'!B1618,\"\")","v":""},{"$f":"IF('Clearing Calculations'!B1618,'Clearing Calculations'!C1618,\"\")","v":""},"","","",""]
[{"$f":"IF('Clearing Calculations'!A1619=\"\",\"\",'Clearing Calculations'!A1619)","v":""},{"$f":"IF('Clearing Calculations'!A1619,'Clearing Calculations'!B1619,\"\")","v":""},{"$f":"IF('Clearing Calculations'!B1619,'Clearing Calculations'!C1619,\"\")","v":""},"","","",""]
[{"$f":"IF('Clearing Calculations'!A1620=\"\",\"\",'Clearing Calculations'!A1620)","v":""},{"$f":"IF('Clearing Calculations'!A1620,'Clearing Calculations'!B1620,\"\")","v":""},{"$f":"IF('Clearing Calculations'!B1620,'Clearing Calculations'!C1620,\"\")","v":""},"","","",""]
[{"$f":"IF('Clearing Calculations'!A1621=\"\",\"\",'Clearing Calculations'!A1621)","v":""},{"$f":"IF('Clearing Calculations'!A1621,'Clearing Calculations'!B1621,\"\")","v":""},{"$f":"IF('Clearing Calculations'!B1621,'Clearing Calculations'!C1621,\"\")","v":""},"","","",""]
[{"$f":"IF('Clearing Calculations'!A1622=\"\",\"\",'Clearing Calculations'!A1622)","v":""},{"$f":"IF('Clearing Calculations'!A1622,'Clearing Calculations'!B1622,\"\")","v":""},{"$f":"IF('Clearing Calculations'!B1622,'Clearing Calculations'!C1622,\"\")","v":""},"","","",""]
[{"$f":"IF('Clearing Calculations'!A1623=\"\",\"\",'Clearing Calculations'!A1623)","v":""},{"$f":"IF('Clearing Calculations'!A1623,'Clearing Calculations'!B1623,\"\")","v":""},{"$f":"IF('Clearing Calculations'!B1623,'Clearing Calculations'!C1623,\"\")","v":""},"","","",""]
[{"$f":"IF('Clearing Calculations'!A1624=\"\",\"\",'Clearing Calculations'!A1624)","v":""},{"$f":"IF('Clearing Calculations'!A1624,'Clearing Calculations'!B1624,\"\")","v":""},{"$f":"IF('Clearing Calculations'!B1624,'Clearing Calculations'!C1624,\"\")","v":""},"","","",""]
[{"$f":"IF('Clearing Calculations'!A1625=\"\",\"\",'Clearing Calculations'!A1625)","v":""},{"$f":"IF('Clearing Calculations'!A1625,'Clearing Calculations'!B1625,\"\")","v":""},{"$f":"IF('Clearing Calculations'!B1625,'Clearing Calculations'!C1625,\"\")","v":""},"","","",""]
[{"$f":"IF('Clearing Calculations'!A1626=\"\",\"\",'Clearing Calculations'!A1626)","v":""},{"$f":"IF('Clearing Calculations'!A1626,'Clearing Calculations'!B1626,\"\")","v":""},{"$f":"IF('Clearing Calculations'!B1626,'Clearing Calculations'!C1626,\"\")","v":""},"","","",""]
[{"$f":"IF('Clearing Calculations'!A1627=\"\",\"\",'Clearing Calculations'!A1627)","v":""},{"$f":"IF('Clearing Calculations'!A1627,'Clearing Calculations'!B1627,\"\")","v":""},{"$f":"IF('Clearing Calculations'!B1627,'Clearing Calculations'!C1627,\"\")","v":""},"","","",""]
[{"$f":"IF('Clearing Calculations'!A1628=\"\",\"\",'Clearing Calculations'!A1628)","v":""},{"$f":"IF('Clearing Calculations'!A1628,'Clearing Calculations'!B1628,\"\")","v":""},{"$f":"IF('Clearing Calculations'!B1628,'Clearing Calculations'!C1628,\"\")","v":""},"","","",""]
[{"$f":"IF('Clearing Calculations'!A1629=\"\",\"\",'Clearing Calculations'!A1629)","v":""},{"$f":"IF('Clearing Calculations'!A1629,'Clearing Calculations'!B1629,\"\")","v":""},{"$f":"IF('Clearing Calculations'!B1629,'Clearing Calculations'!C1629,\"\")","v":""},"","","",""]
[{"$f":"IF('Clearing Calculations'!A1630=\"\",\"\",'Clearing Calculations'!A1630)","v":""},{"$f":"IF('Clearing Calculations'!A1630,'Clearing Calculations'!B1630,\"\")","v":""},{"$f":"IF('Clearing Calculations'!B1630,'Clearing Calculations'!C1630,\"\")","v":""},"","","",""]
[{"$f":"IF('Clearing Calculations'!A1631=\"\",\"\",'Clearing Calculations'!A1631)","v":""},{"$f":"IF('Clearing Calculations'!A1631,'Clearing Calculations'!B1631,\"\")","v":""},{"$f":"IF('Clearing Calculations'!B1631,'Clearing Calculations'!C1631,\"\")","v":""},"","","",""]
[{"$f":"IF('Clearing Calculations'!A1632=\"\",\"\",'Clearing Calculations'!A1632)","v":""},{"$f":"IF('Clearing Calculations'!A1632,'Clearing Calculations'!B1632,\"\")","v":""},{"$f":"IF('Clearing Calculations'!B1632,'Clearing Calculations'!C1632,\"\")","v":""},"","","",""]
[{"$f":"IF('Clearing Calculations'!A1633=\"\",\"\",'Clearing Calculations'!A1633)","v":""},{"$f":"IF('Clearing Calculations'!A1633,'Clearing Calculations'!B1633,\"\")","v":""},{"$f":"IF('Clearing Calculations'!B1633,'Clearing Calculations'!C1633,\"\")","v":""},"","","",""]
[{"$f":"IF('Clearing Calculations'!A1634=\"\",\"\",'Clearing Calculations'!A1634)","v":""},{"$f":"IF('Clearing Calculations'!A1634,'Clearing Calculations'!B1634,\"\")","v":""},{"$f":"IF('Clearing Calculations'!B1634,'Clearing Calculations'!C1634,\"\")","v":""},"","","",""]
[{"$f":"IF('Clearing Calculations'!A1635=\"\",\"\",'Clearing Calculations'!A1635)","v":""},{"$f":"IF('Clearing Calculations'!A1635,'Clearing Calculations'!B1635,\"\")","v":""},{"$f":"IF('Clearing Calculations'!B1635,'Clearing Calculations'!C1635,\"\")","v":""},"","","",""]
[{"$f":"IF('Clearing Calculations'!A1636=\"\",\"\",'Clearing Calculations'!A1636)","v":""},{"$f":"IF('Clearing Calculations'!A1636,'Clearing Calculations'!B1636,\"\")","v":""},{"$f":"IF('Clearing Calculations'!B1636,'Clearing Calculations'!C1636,\"\")","v":""},"","","",""]
[{"$f":"IF('Clearing Calculations'!A1637=\"\",\"\",'Clearing Calculations'!A1637)","v":""},{"$f":"IF('Clearing Calculations'!A1637,'Clearing Calculations'!B1637,\"\")","v":""},{"$f":"IF('Clearing Calculations'!B1637,'Clearing Calculations'!C1637,\"\")","v":""},"","","",""]
[{"$f":"IF('Clearing Calculations'!A1638=\"\",\"\",'Clearing Calculations'!A1638)","v":""},{"$f":"IF('Clearing Calculations'!A1638,'Clearing Calculations'!B1638,\"\")","v":""},{"$f":"IF('Clearing Calculations'!B1638,'Clearing Calculations'!C1638,\"\")","v":""},"","","",""]
[{"$f":"IF('Clearing Calculations'!A1639=\"\",\"\",'Clearing Calculations'!A1639)","v":""},{"$f":"IF('Clearing Calculations'!A1639,'Clearing Calculations'!B1639,\"\")","v":""},{"$f":"IF('Clearing Calculations'!B1639,'Clearing Calculations'!C1639,\"\")","v":""},"","","",""]
[{"$f":"IF('Clearing Calculations'!A1640=\"\",\"\",'Clearing Calculations'!A1640)","v":""},{"$f":"IF('Clearing Calculations'!A1640,'Clearing Calculations'!B1640,\"\")","v":""},{"$f":"IF('Clearing Calculations'!B1640,'Clearing Calculations'!C1640,\"\")","v":""},"","","",""]
[{"$f":"IF('Clearing Calculations'!A1641=\"\",\"\",'Clearing Calculations'!A1641)","v":""},{"$f":"IF('Clearing Calculations'!A1641,'Clearing Calculations'!B1641,\"\")","v":""},{"$f":"IF('Clearing Calculations'!B1641,'Clearing Calculations'!C1641,\"\")","v":""},"","","",""]
[{"$f":"IF('Clearing Calculations'!A1642=\"\",\"\",'Clearing Calculations'!A1642)","v":""},{"$f":"IF('Clearing Calculations'!A1642,'Clearing Calculations'!B1642,\"\")","v":""},{"$f":"IF('Clearing Calculations'!B1642,'Clearing Calculations'!C1642,\"\")","v":""},"","","",""]
[{"$f":"IF('Clearing Calculations'!A1643=\"\",\"\",'Clearing Calculations'!A1643)","v":""},{"$f":"IF('Clearing Calculations'!A1643,'Clearing Calculations'!B1643,\"\")","v":""},{"$f":"IF('Clearing Calculations'!B1643,'Clearing Calculations'!C1643,\"\")","v":""},"","","",""]
[{"$f":"IF('Clearing Calculations'!A1644=\"\",\"\",'Clearing Calculations'!A1644)","v":""},{"$f":"IF('Clearing Calculations'!A1644,'Clearing Calculations'!B1644,\"\")","v":""},{"$f":"IF('Clearing Calculations'!B1644,'Clearing Calculations'!C1644,\"\")","v":""},{"$f":"IF(A1650=\"\",\"\",$B1650+$C1650)","v":""},{"$f":"IF(A1650=\"\",\"\",(D1650+D1649)/2*(A1650-A1649))","v":""},{"$f":"IF(A1650=\"\",\"\",(E1650/9))","v":""},{"$f":"IF(A1650=\"\",\"\",E1650/$G$3)","v":""}]
[{"$f":"IF('Clearing Calculations'!A1645=\"\",\"\",'Clearing Calculations'!A1645)","v":""},{"$f":"IF('Clearing Calculations'!A1645,'Clearing Calculations'!B1645,\"\")","v":""},{"$f":"IF('Clearing Calculations'!B1645,'Clearing Calculations'!C1645,\"\")","v":""},"","","",""]
[{"$f":"IF('Clearing Calculations'!A1646=\"\",\"\",'Clearing Calculations'!A1646)","v":""},{"$f":"IF('Clearing Calculations'!A1646,'Clearing Calculations'!B1646,\"\")","v":""},{"$f":"IF('Clearing Calculations'!B1646,'Clearing Calculations'!C1646,\"\")","v":""},"","","",""]
[{"$f":"IF('Clearing Calculations'!A1647=\"\",\"\",'Clearing Calculations'!A1647)","v":""},{"$f":"IF('Clearing Calculations'!A1647,'Clearing Calculations'!B1647,\"\")","v":""},{"$f":"IF('Clearing Calculations'!B1647,'Clearing Calculations'!C1647,\"\")","v":""},"","","",""]
[{"$f":"IF('Clearing Calculations'!A1648=\"\",\"\",'Clearing Calculations'!A1648)","v":""},{"$f":"IF('Clearing Calculations'!A1648,'Clearing Calculations'!B1648,\"\")","v":""},{"$f":"IF('Clearing Calculations'!B1648,'Clearing Calculations'!C1648,\"\")","v":""},"","","",""]
[{"$f":"IF('Clearing Calculations'!A1649=\"\",\"\",'Clearing Calculations'!A1649)","v":""},{"$f":"IF('Clearing Calculations'!A1649,'Clearing Calculations'!B1649,\"\")","v":""},{"$f":"IF('Clearing Calculations'!B1649,'Clearing Calculations'!C1649,\"\")","v":""},"","","",""]
[{"$f":"IF('Clearing Calculations'!A1650=\"\",\"\",'Clearing Calculations'!A1650)","v":""},{"$f":"IF('Clearing Calculations'!A1650,'Clearing Calculations'!B1650,\"\")","v":""},{"$f":"IF('Clearing Calculations'!B1650,'Clearing Calculations'!C1650,\"\")","v":""},"","","",""]
[{"$f":"IF('Clearing Calculations'!A1651=\"\",\"\",'Clearing Calculations'!A1651)","v":""},{"$f":"IF('Clearing Calculations'!A1651,'Clearing Calculations'!B1651,\"\")","v":""},{"$f":"IF('Clearing Calculations'!B1651,'Clearing Calculations'!C1651,\"\")","v":""},"","","",""]
[{"$f":"IF('Clearing Calculations'!A1652=\"\",\"\",'Clearing Calculations'!A1652)","v":""},{"$f":"IF('Clearing Calculations'!A1652,'Clearing Calculations'!B1652,\"\")","v":""},{"$f":"IF('Clearing Calculations'!B1652,'Clearing Calculations'!C1652,\"\")","v":""},"","","",""]
[{"$f":"IF('Clearing Calculations'!A1653=\"\",\"\",'Clearing Calculations'!A1653)","v":""},{"$f":"IF('Clearing Calculations'!A1653,'Clearing Calculations'!B1653,\"\")","v":""},{"$f":"IF('Clearing Calculations'!B1653,'Clearing Calculations'!C1653,\"\")","v":""},"","","",""]
[{"$f":"IF('Clearing Calculations'!A1654=\"\",\"\",'Clearing Calculations'!A1654)","v":""},{"$f":"IF('Clearing Calculations'!A1654,'Clearing Calculations'!B1654,\"\")","v":""},{"$f":"IF('Clearing Calculations'!B1654,'Clearing Calculations'!C1654,\"\")","v":""},"","","",""]
[{"$f":"IF('Clearing Calculations'!A1655=\"\",\"\",'Clearing Calculations'!A1655)","v":""},{"$f":"IF('Clearing Calculations'!A1655,'Clearing Calculations'!B1655,\"\")","v":""},{"$f":"IF('Clearing Calculations'!B1655,'Clearing Calculations'!C1655,\"\")","v":""},"","","",""]
[{"$f":"IF('Clearing Calculations'!A1656=\"\",\"\",'Clearing Calculations'!A1656)","v":""},{"$f":"IF('Clearing Calculations'!A1656,'Clearing Calculations'!B1656,\"\")","v":""},{"$f":"IF('Clearing Calculations'!B1656,'Clearing Calculations'!C1656,\"\")","v":""},"","","",""]
[{"$f":"IF('Clearing Calculations'!A1657=\"\",\"\",'Clearing Calculations'!A1657)","v":""},{"$f":"IF('Clearing Calculations'!A1657,'Clearing Calculations'!B1657,\"\")","v":""},{"$f":"IF('Clearing Calculations'!B1657,'Clearing Calculations'!C1657,\"\")","v":""},"","","",""]
[{"$f":"IF('Clearing Calculations'!A1658=\"\",\"\",'Clearing Calculations'!A1658)","v":""},{"$f":"IF('Clearing Calculations'!A1658,'Clearing Calculations'!B1658,\"\")","v":""},{"$f":"IF('Clearing Calculations'!B1658,'Clearing Calculations'!C1658,\"\")","v":""},"","","",""]
[{"$f":"IF('Clearing Calculations'!A1659=\"\",\"\",'Clearing Calculations'!A1659)","v":""},{"$f":"IF('Clearing Calculations'!A1659,'Clearing Calculations'!B1659,\"\")","v":""},{"$f":"IF('Clearing Calculations'!B1659,'Clearing Calculations'!C1659,\"\")","v":""},"","","",""]
[{"$f":"IF('Clearing Calculations'!A1660=\"\",\"\",'Clearing Calculations'!A1660)","v":""},{"$f":"IF('Clearing Calculations'!A1660,'Clearing Calculations'!B1660,\"\")","v":""},{"$f":"IF('Clearing Calculations'!B1660,'Clearing Calculations'!C1660,\"\")","v":""},"","","",""]
[{"$f":"IF('Clearing Calculations'!A1661=\"\",\"\",'Clearing Calculations'!A1661)","v":""},{"$f":"IF('Clearing Calculations'!A1661,'Clearing Calculations'!B1661,\"\")","v":""},{"$f":"IF('Clearing Calculations'!B1661,'Clearing Calculations'!C1661,\"\")","v":""},"","","",""]
[{"$f":"IF('Clearing Calculations'!A1662=\"\",\"\",'Clearing Calculations'!A1662)","v":""},{"$f":"IF('Clearing Calculations'!A1662,'Clearing Calculations'!B1662,\"\")","v":""},{"$f":"IF('Clearing Calculations'!B1662,'Clearing Calculations'!C1662,\"\")","v":""},"","","",""]
[{"$f":"IF('Clearing Calculations'!A1663=\"\",\"\",'Clearing Calculations'!A1663)","v":""},{"$f":"IF('Clearing Calculations'!A1663,'Clearing Calculations'!B1663,\"\")","v":""},{"$f":"IF('Clearing Calculations'!B1663,'Clearing Calculations'!C1663,\"\")","v":""},"","","",""]
[{"$f":"IF('Clearing Calculations'!A1664=\"\",\"\",'Clearing Calculations'!A1664)","v":""},{"$f":"IF('Clearing Calculations'!A1664,'Clearing Calculations'!B1664,\"\")","v":""},{"$f":"IF('Clearing Calculations'!B1664,'Clearing Calculations'!C1664,\"\")","v":""},"","","",""]
[{"$f":"IF('Clearing Calculations'!A1665=\"\",\"\",'Clearing Calculations'!A1665)","v":""},{"$f":"IF('Clearing Calculations'!A1665,'Clearing Calculations'!B1665,\"\")","v":""},{"$f":"IF('Clearing Calculations'!B1665,'Clearing Calculations'!C1665,\"\")","v":""},"","","",""]
[{"$f":"IF('Clearing Calculations'!A1666=\"\",\"\",'Clearing Calculations'!A1666)","v":""},{"$f":"IF('Clearing Calculations'!A1666,'Clearing Calculations'!B1666,\"\")","v":""},{"$f":"IF('Clearing Calculations'!B1666,'Clearing Calculations'!C1666,\"\")","v":""},"","","",""]
[{"$f":"IF('Clearing Calculations'!A1667=\"\",\"\",'Clearing Calculations'!A1667)","v":""},{"$f":"IF('Clearing Calculations'!A1667,'Clearing Calculations'!B1667,\"\")","v":""},{"$f":"IF('Clearing Calculations'!B1667,'Clearing Calculations'!C1667,\"\")","v":""},"","","",""]
[{"$f":"IF('Clearing Calculations'!A1668=\"\",\"\",'Clearing Calculations'!A1668)","v":""},{"$f":"IF('Clearing Calculations'!A1668,'Clearing Calculations'!B1668,\"\")","v":""},{"$f":"IF('Clearing Calculations'!B1668,'Clearing Calculations'!C1668,\"\")","v":""},"","","",""]
[{"$f":"IF('Clearing Calculations'!A1669=\"\",\"\",'Clearing Calculations'!A1669)","v":""},{"$f":"IF('Clearing Calculations'!A1669,'Clearing Calculations'!B1669,\"\")","v":""},{"$f":"IF('Clearing Calculations'!B1669,'Clearing Calculations'!C1669,\"\")","v":""},"","","",""]
[{"$f":"IF('Clearing Calculations'!A1670=\"\",\"\",'Clearing Calculations'!A1670)","v":""},{"$f":"IF('Clearing Calculations'!A1670,'Clearing Calculations'!B1670,\"\")","v":""},{"$f":"IF('Clearing Calculations'!B1670,'Clearing Calculations'!C1670,\"\")","v":""},"","","",""]
[{"$f":"IF('Clearing Calculations'!A1671=\"\",\"\",'Clearing Calculations'!A1671)","v":""},{"$f":"IF('Clearing Calculations'!A1671,'Clearing Calculations'!B1671,\"\")","v":""},{"$f":"IF('Clearing Calculations'!B1671,'Clearing Calculations'!C1671,\"\")","v":""},"","","",""]
[{"$f":"IF('Clearing Calculations'!A1672=\"\",\"\",'Clearing Calculations'!A1672)","v":""},{"$f":"IF('Clearing Calculations'!A1672,'Clearing Calculations'!B1672,\"\")","v":""},{"$f":"IF('Clearing Calculations'!B1672,'Clearing Calculations'!C1672,\"\")","v":""},"","","",""]
[{"$f":"IF('Clearing Calculations'!A1673=\"\",\"\",'Clearing Calculations'!A1673)","v":""},{"$f":"IF('Clearing Calculations'!A1673,'Clearing Calculations'!B1673,\"\")","v":""},{"$f":"IF('Clearing Calculations'!B1673,'Clearing Calculations'!C1673,\"\")","v":""},"","","",""]
[{"$f":"IF('Clearing Calculations'!A1674=\"\",\"\",'Clearing Calculations'!A1674)","v":""},{"$f":"IF('Clearing Calculations'!A1674,'Clearing Calculations'!B1674,\"\")","v":""},{"$f":"IF('Clearing Calculations'!B1674,'Clearing Calculations'!C1674,\"\")","v":""},"","","",""]
[{"$f":"IF('Clearing Calculations'!A1675=\"\",\"\",'Clearing Calculations'!A1675)","v":""},{"$f":"IF('Clearing Calculations'!A1675,'Clearing Calculations'!B1675,\"\")","v":""},{"$f":"IF('Clearing Calculations'!B1675,'Clearing Calculations'!C1675,\"\")","v":""},"","","",""]
[{"$f":"IF('Clearing Calculations'!A1676=\"\",\"\",'Clearing Calculations'!A1676)","v":""},{"$f":"IF('Clearing Calculations'!A1676,'Clearing Calculations'!B1676,\"\")","v":""},{"$f":"IF('Clearing Calculations'!B1676,'Clearing Calculations'!C1676,\"\")","v":""},"","","",""]
[{"$f":"IF('Clearing Calculations'!A1677=\"\",\"\",'Clearing Calculations'!A1677)","v":""},{"$f":"IF('Clearing Calculations'!A1677,'Clearing Calculations'!B1677,\"\")","v":""},{"$f":"IF('Clearing Calculations'!B1677,'Clearing Calculations'!C1677,\"\")","v":""},"","","",""]
[{"$f":"IF('Clearing Calculations'!A1678=\"\",\"\",'Clearing Calculations'!A1678)","v":""},{"$f":"IF('Clearing Calculations'!A1678,'Clearing Calculations'!B1678,\"\")","v":""},{"$f":"IF('Clearing Calculations'!B1678,'Clearing Calculations'!C1678,\"\")","v":""},"","","",""]
[{"$f":"IF('Clearing Calculations'!A1679=\"\",\"\",'Clearing Calculations'!A1679)","v":""},{"$f":"IF('Clearing Calculations'!A1679,'Clearing Calculations'!B1679,\"\")","v":""},{"$f":"IF('Clearing Calculations'!B1679,'Clearing Calculations'!C1679,\"\")","v":""},"","","",""]
[{"$f":"IF('Clearing Calculations'!A1680=\"\",\"\",'Clearing Calculations'!A1680)","v":""},{"$f":"IF('Clearing Calculations'!A1680,'Clearing Calculations'!B1680,\"\")","v":""},{"$f":"IF('Clearing Calculations'!B1680,'Clearing Calculations'!C1680,\"\")","v":""},"","","",""]
[{"$f":"IF('Clearing Calculations'!A1681=\"\",\"\",'Clearing Calculations'!A1681)","v":""},{"$f":"IF('Clearing Calculations'!A1681,'Clearing Calculations'!B1681,\"\")","v":""},{"$f":"IF('Clearing Calculations'!B1681,'Clearing Calculations'!C1681,\"\")","v":""},"","","",""]
[{"$f":"IF('Clearing Calculations'!A1682=\"\",\"\",'Clearing Calculations'!A1682)","v":""},{"$f":"IF('Clearing Calculations'!A1682,'Clearing Calculations'!B1682,\"\")","v":""},{"$f":"IF('Clearing Calculations'!B1682,'Clearing Calculations'!C1682,\"\")","v":""},"","","",""]
[{"$f":"IF('Clearing Calculations'!A1683=\"\",\"\",'Clearing Calculations'!A1683)","v":""},{"$f":"IF('Clearing Calculations'!A1683,'Clearing Calculations'!B1683,\"\")","v":""},{"$f":"IF('Clearing Calculations'!B1683,'Clearing Calculations'!C1683,\"\")","v":""},"","","",""]
[{"$f":"IF('Clearing Calculations'!A1684=\"\",\"\",'Clearing Calculations'!A1684)","v":""},{"$f":"IF('Clearing Calculations'!A1684,'Clearing Calculations'!B1684,\"\")","v":""},{"$f":"IF('Clearing Calculations'!B1684,'Clearing Calculations'!C1684,\"\")","v":""},"","","",""]
[{"$f":"IF('Clearing Calculations'!A1685=\"\",\"\",'Clearing Calculations'!A1685)","v":""},{"$f":"IF('Clearing Calculations'!A1685,'Clearing Calculations'!B1685,\"\")","v":""},{"$f":"IF('Clearing Calculations'!B1685,'Clearing Calculations'!C1685,\"\")","v":""},"","","",""]
[{"$f":"IF('Clearing Calculations'!A1686=\"\",\"\",'Clearing Calculations'!A1686)","v":""},{"$f":"IF('Clearing Calculations'!A1686,'Clearing Calculations'!B1686,\"\")","v":""},{"$f":"IF('Clearing Calculations'!B1686,'Clearing Calculations'!C1686,\"\")","v":""},"","","",""]
[{"$f":"IF('Clearing Calculations'!A1687=\"\",\"\",'Clearing Calculations'!A1687)","v":""},{"$f":"IF('Clearing Calculations'!A1687,'Clearing Calculations'!B1687,\"\")","v":""},{"$f":"IF('Clearing Calculations'!B1687,'Clearing Calculations'!C1687,\"\")","v":""},"","","",""]
[{"$f":"IF('Clearing Calculations'!A1688=\"\",\"\",'Clearing Calculations'!A1688)","v":""},{"$f":"IF('Clearing Calculations'!A1688,'Clearing Calculations'!B1688,\"\")","v":""},{"$f":"IF('Clearing Calculations'!B1688,'Clearing Calculations'!C1688,\"\")","v":""},"","","",""]
[{"$f":"IF('Clearing Calculations'!A1689=\"\",\"\",'Clearing Calculations'!A1689)","v":""},{"$f":"IF('Clearing Calculations'!A1689,'Clearing Calculations'!B1689,\"\")","v":""},{"$f":"IF('Clearing Calculations'!B1689,'Clearing Calculations'!C1689,\"\")","v":""},"","","",""]
[{"$f":"IF('Clearing Calculations'!A1690=\"\",\"\",'Clearing Calculations'!A1690)","v":""},{"$f":"IF('Clearing Calculations'!A1690,'Clearing Calculations'!B1690,\"\")","v":""},{"$f":"IF('Clearing Calculations'!B1690,'Clearing Calculations'!C1690,\"\")","v":""},"","","",""]
[{"$f":"IF('Clearing Calculations'!A1691=\"\",\"\",'Clearing Calculations'!A1691)","v":""},{"$f":"IF('Clearing Calculations'!A1691,'Clearing Calculations'!B1691,\"\")","v":""},{"$f":"IF('Clearing Calculations'!B1691,'Clearing Calculations'!C1691,\"\")","v":""},"","","",""]
[{"$f":"IF('Clearing Calculations'!A1692=\"\",\"\",'Clearing Calculations'!A1692)","v":""},{"$f":"IF('Clearing Calculations'!A1692,'Clearing Calculations'!B1692,\"\")","v":""},{"$f":"IF('Clearing Calculations'!B1692,'Clearing Calculations'!C1692,\"\")","v":""},"","","",""]
[{"$f":"IF('Clearing Calculations'!A1693=\"\",\"\",'Clearing Calculations'!A1693)","v":""},{"$f":"IF('Clearing Calculations'!A1693,'Clearing Calculations'!B1693,\"\")","v":""},{"$f":"IF('Clearing Calculations'!B1693,'Clearing Calculations'!C1693,\"\")","v":""},"","","",""]
[{"$f":"IF('Clearing Calculations'!A1694=\"\",\"\",'Clearing Calculations'!A1694)","v":""},{"$f":"IF('Clearing Calculations'!A1694,'Clearing Calculations'!B1694,\"\")","v":""},{"$f":"IF('Clearing Calculations'!B1694,'Clearing Calculations'!C1694,\"\")","v":""},"","","",""]
[{"$f":"IF('Clearing Calculations'!A1695=\"\",\"\",'Clearing Calculations'!A1695)","v":""},{"$f":"IF('Clearing Calculations'!A1695,'Clearing Calculations'!B1695,\"\")","v":""},{"$f":"IF('Clearing Calculations'!B1695,'Clearing Calculations'!C1695,\"\")","v":""},"","","",""]
[{"$f":"IF('Clearing Calculations'!A1696=\"\",\"\",'Clearing Calculations'!A1696)","v":""},{"$f":"IF('Clearing Calculations'!A1696,'Clearing Calculations'!B1696,\"\")","v":""},{"$f":"IF('Clearing Calculations'!B1696,'Clearing Calculations'!C1696,\"\")","v":""},"","","",""]
[{"$f":"IF('Clearing Calculations'!A1697=\"\",\"\",'Clearing Calculations'!A1697)","v":""},{"$f":"IF('Clearing Calculations'!A1697,'Clearing Calculations'!B1697,\"\")","v":""},{"$f":"IF('Clearing Calculations'!B1697,'Clearing Calculations'!C1697,\"\")","v":""},"","","",""]
[{"$f":"IF('Clearing Calculations'!A1698=\"\",\"\",'Clearing Calculations'!A1698)","v":""},{"$f":"IF('Clearing Calculations'!A1698,'Clearing Calculations'!B1698,\"\")","v":""},{"$f":"IF('Clearing Calculations'!B1698,'Clearing Calculations'!C1698,\"\")","v":""},"","","",""]
[{"$f":"IF('Clearing Calculations'!A1699=\"\",\"\",'Clearing Calculations'!A1699)","v":""},{"$f":"IF('Clearing Calculations'!A1699,'Clearing Calculations'!B1699,\"\")","v":""},{"$f":"IF('Clearing Calculations'!B1699,'Clearing Calculations'!C1699,\"\")","v":""},"","","",""]
[{"$f":"IF('Clearing Calculations'!A1700=\"\",\"\",'Clearing Calculations'!A1700)","v":""},{"$f":"IF('Clearing Calculations'!A1700,'Clearing Calculations'!B1700,\"\")","v":""},{"$f":"IF('Clearing Calculations'!B1700,'Clearing Calculations'!C1700,\"\")","v":""},"","","",""]
[{"$f":"IF('Clearing Calculations'!A1701=\"\",\"\",'Clearing Calculations'!A1701)","v":""},{"$f":"IF('Clearing Calculations'!A1701,'Clearing Calculations'!B1701,\"\")","v":""},{"$f":"IF('Clearing Calculations'!B1701,'Clearing Calculations'!C1701,\"\")","v":""},"","","",""]
[{"$f":"IF('Clearing Calculations'!A1702=\"\",\"\",'Clearing Calculations'!A1702)","v":""},{"$f":"IF('Clearing Calculations'!A1702,'Clearing Calculations'!B1702,\"\")","v":""},{"$f":"IF('Clearing Calculations'!B1702,'Clearing Calculations'!C1702,\"\")","v":""},"","","",""]
[{"$f":"IF('Clearing Calculations'!A1703=\"\",\"\",'Clearing Calculations'!A1703)","v":""},{"$f":"IF('Clearing Calculations'!A1703,'Clearing Calculations'!B1703,\"\")","v":""},{"$f":"IF('Clearing Calculations'!B1703,'Clearing Calculations'!C1703,\"\")","v":""},"","","",""]
[{"$f":"IF('Clearing Calculations'!A1704=\"\",\"\",'Clearing Calculations'!A1704)","v":""},{"$f":"IF('Clearing Calculations'!A1704,'Clearing Calculations'!B1704,\"\")","v":""},{"$f":"IF('Clearing Calculations'!B1704,'Clearing Calculations'!C1704,\"\")","v":""},"","","",""]
[{"$f":"IF('Clearing Calculations'!A1705=\"\",\"\",'Clearing Calculations'!A1705)","v":""},{"$f":"IF('Clearing Calculations'!A1705,'Clearing Calculations'!B1705,\"\")","v":""},{"$f":"IF('Clearing Calculations'!B1705,'Clearing Calculations'!C1705,\"\")","v":""},"","","",""]
[{"$f":"IF('Clearing Calculations'!A1706=\"\",\"\",'Clearing Calculations'!A1706)","v":""},{"$f":"IF('Clearing Calculations'!A1706,'Clearing Calculations'!B1706,\"\")","v":""},{"$f":"IF('Clearing Calculations'!B1706,'Clearing Calculations'!C1706,\"\")","v":""},"","","",""]
[{"$f":"IF('Clearing Calculations'!A1707=\"\",\"\",'Clearing Calculations'!A1707)","v":""},{"$f":"IF('Clearing Calculations'!A1707,'Clearing Calculations'!B1707,\"\")","v":""},{"$f":"IF('Clearing Calculations'!B1707,'Clearing Calculations'!C1707,\"\")","v":""},"","","",""]
[{"$f":"IF('Clearing Calculations'!A1708=\"\",\"\",'Clearing Calculations'!A1708)","v":""},{"$f":"IF('Clearing Calculations'!A1708,'Clearing Calculations'!B1708,\"\")","v":""},{"$f":"IF('Clearing Calculations'!B1708,'Clearing Calculations'!C1708,\"\")","v":""},{"$f":"IF(A1714=\"\",\"\",$B1714+$C1714)","v":""},{"$f":"IF(A1714=\"\",\"\",(D1714+D1713)/2*(A1714-A1713))","v":""},{"$f":"IF(A1714=\"\",\"\",(E1714/9))","v":""},{"$f":"IF(A1714=\"\",\"\",E1714/$G$3)","v":""}]
[{"$f":"IF('Clearing Calculations'!A1709=\"\",\"\",'Clearing Calculations'!A1709)","v":""},{"$f":"IF('Clearing Calculations'!A1709,'Clearing Calculations'!B1709,\"\")","v":""},{"$f":"IF('Clearing Calculations'!B1709,'Clearing Calculations'!C1709,\"\")","v":""},"","","",""]
[{"$f":"IF('Clearing Calculations'!A1710=\"\",\"\",'Clearing Calculations'!A1710)","v":""},{"$f":"IF('Clearing Calculations'!A1710,'Clearing Calculations'!B1710,\"\")","v":""},{"$f":"IF('Clearing Calculations'!B1710,'Clearing Calculations'!C1710,\"\")","v":""},"","","",""]
[{"$f":"IF('Clearing Calculations'!A1711=\"\",\"\",'Clearing Calculations'!A1711)","v":""},{"$f":"IF('Clearing Calculations'!A1711,'Clearing Calculations'!B1711,\"\")","v":""},{"$f":"IF('Clearing Calculations'!B1711,'Clearing Calculations'!C1711,\"\")","v":""},"","","",""]
[{"$f":"IF('Clearing Calculations'!A1712=\"\",\"\",'Clearing Calculations'!A1712)","v":""},{"$f":"IF('Clearing Calculations'!A1712,'Clearing Calculations'!B1712,\"\")","v":""},{"$f":"IF('Clearing Calculations'!B1712,'Clearing Calculations'!C1712,\"\")","v":""},"","","",""]
[{"$f":"IF('Clearing Calculations'!A1713=\"\",\"\",'Clearing Calculations'!A1713)","v":""},{"$f":"IF('Clearing Calculations'!A1713,'Clearing Calculations'!B1713,\"\")","v":""},{"$f":"IF('Clearing Calculations'!B1713,'Clearing Calculations'!C1713,\"\")","v":""},"","","",""]
[{"$f":"IF('Clearing Calculations'!A1714=\"\",\"\",'Clearing Calculations'!A1714)","v":""},{"$f":"IF('Clearing Calculations'!A1714,'Clearing Calculations'!B1714,\"\")","v":""},{"$f":"IF('Clearing Calculations'!B1714,'Clearing Calculations'!C1714,\"\")","v":""},"","","",""]
[{"$f":"IF('Clearing Calculations'!A1715=\"\",\"\",'Clearing Calculations'!A1715)","v":""},{"$f":"IF('Clearing Calculations'!A1715,'Clearing Calculations'!B1715,\"\")","v":""},{"$f":"IF('Clearing Calculations'!B1715,'Clearing Calculations'!C1715,\"\")","v":""},"","","",""]
[{"$f":"IF('Clearing Calculations'!A1716=\"\",\"\",'Clearing Calculations'!A1716)","v":""},{"$f":"IF('Clearing Calculations'!A1716,'Clearing Calculations'!B1716,\"\")","v":""},{"$f":"IF('Clearing Calculations'!B1716,'Clearing Calculations'!C1716,\"\")","v":""},"","","",""]
[{"$f":"IF('Clearing Calculations'!A1717=\"\",\"\",'Clearing Calculations'!A1717)","v":""},{"$f":"IF('Clearing Calculations'!A1717,'Clearing Calculations'!B1717,\"\")","v":""},{"$f":"IF('Clearing Calculations'!B1717,'Clearing Calculations'!C1717,\"\")","v":""},"","","",""]
[{"$f":"IF('Clearing Calculations'!A1718=\"\",\"\",'Clearing Calculations'!A1718)","v":""},{"$f":"IF('Clearing Calculations'!A1718,'Clearing Calculations'!B1718,\"\")","v":""},{"$f":"IF('Clearing Calculations'!B1718,'Clearing Calculations'!C1718,\"\")","v":""},"","","",""]
[{"$f":"IF('Clearing Calculations'!A1719=\"\",\"\",'Clearing Calculations'!A1719)","v":""},{"$f":"IF('Clearing Calculations'!A1719,'Clearing Calculations'!B1719,\"\")","v":""},{"$f":"IF('Clearing Calculations'!B1719,'Clearing Calculations'!C1719,\"\")","v":""},"","","",""]
[{"$f":"IF('Clearing Calculations'!A1720=\"\",\"\",'Clearing Calculations'!A1720)","v":""},{"$f":"IF('Clearing Calculations'!A1720,'Clearing Calculations'!B1720,\"\")","v":""},{"$f":"IF('Clearing Calculations'!B1720,'Clearing Calculations'!C1720,\"\")","v":""},"","","",""]
[{"$f":"IF('Clearing Calculations'!A1721=\"\",\"\",'Clearing Calculations'!A1721)","v":""},{"$f":"IF('Clearing Calculations'!A1721,'Clearing Calculations'!B1721,\"\")","v":""},{"$f":"IF('Clearing Calculations'!B1721,'Clearing Calculations'!C1721,\"\")","v":""},"","","",""]
[{"$f":"IF('Clearing Calculations'!A1722=\"\",\"\",'Clearing Calculations'!A1722)","v":""},{"$f":"IF('Clearing Calculations'!A1722,'Clearing Calculations'!B1722,\"\")","v":""},{"$f":"IF('Clearing Calculations'!B1722,'Clearing Calculations'!C1722,\"\")","v":""},"","","",""]
[{"$f":"IF('Clearing Calculations'!A1723=\"\",\"\",'Clearing Calculations'!A1723)","v":""},{"$f":"IF('Clearing Calculations'!A1723,'Clearing Calculations'!B1723,\"\")","v":""},{"$f":"IF('Clearing Calculations'!B1723,'Clearing Calculations'!C1723,\"\")","v":""},"","","",""]
[{"$f":"IF('Clearing Calculations'!A1724=\"\",\"\",'Clearing Calculations'!A1724)","v":""},{"$f":"IF('Clearing Calculations'!A1724,'Clearing Calculations'!B1724,\"\")","v":""},{"$f":"IF('Clearing Calculations'!B1724,'Clearing Calculations'!C1724,\"\")","v":""},"","","",""]
[{"$f":"IF('Clearing Calculations'!A1725=\"\",\"\",'Clearing Calculations'!A1725)","v":""},{"$f":"IF('Clearing Calculations'!A1725,'Clearing Calculations'!B1725,\"\")","v":""},{"$f":"IF('Clearing Calculations'!B1725,'Clearing Calculations'!C1725,\"\")","v":""},"","","",""]
[{"$f":"IF('Clearing Calculations'!A1726=\"\",\"\",'Clearing Calculations'!A1726)","v":""},{"$f":"IF('Clearing Calculations'!A1726,'Clearing Calculations'!B1726,\"\")","v":""},{"$f":"IF('Clearing Calculations'!B1726,'Clearing Calculations'!C1726,\"\")","v":""},"","","",""]
[{"$f":"IF('Clearing Calculations'!A1727=\"\",\"\",'Clearing Calculations'!A1727)","v":""},{"$f":"IF('Clearing Calculations'!A1727,'Clearing Calculations'!B1727,\"\")","v":""},{"$f":"IF('Clearing Calculations'!B1727,'Clearing Calculations'!C1727,\"\")","v":""},"","","",""]
[{"$f":"IF('Clearing Calculations'!A1728=\"\",\"\",'Clearing Calculations'!A1728)","v":""},{"$f":"IF('Clearing Calculations'!A1728,'Clearing Calculations'!B1728,\"\")","v":""},{"$f":"IF('Clearing Calculations'!B1728,'Clearing Calculations'!C1728,\"\")","v":""},"","","",""]
[{"$f":"IF('Clearing Calculations'!A1729=\"\",\"\",'Clearing Calculations'!A1729)","v":""},{"$f":"IF('Clearing Calculations'!A1729,'Clearing Calculations'!B1729,\"\")","v":""},{"$f":"IF('Clearing Calculations'!B1729,'Clearing Calculations'!C1729,\"\")","v":""},"","","",""]
[{"$f":"IF('Clearing Calculations'!A1730=\"\",\"\",'Clearing Calculations'!A1730)","v":""},{"$f":"IF('Clearing Calculations'!A1730,'Clearing Calculations'!B1730,\"\")","v":""},{"$f":"IF('Clearing Calculations'!B1730,'Clearing Calculations'!C1730,\"\")","v":""},"","","",""]
[{"$f":"IF('Clearing Calculations'!A1731=\"\",\"\",'Clearing Calculations'!A1731)","v":""},{"$f":"IF('Clearing Calculations'!A1731,'Clearing Calculations'!B1731,\"\")","v":""},{"$f":"IF('Clearing Calculations'!B1731,'Clearing Calculations'!C1731,\"\")","v":""},"","","",""]
[{"$f":"IF('Clearing Calculations'!A1732=\"\",\"\",'Clearing Calculations'!A1732)","v":""},{"$f":"IF('Clearing Calculations'!A1732,'Clearing Calculations'!B1732,\"\")","v":""},{"$f":"IF('Clearing Calculations'!B1732,'Clearing Calculations'!C1732,\"\")","v":""},"","","",""]
[{"$f":"IF('Clearing Calculations'!A1733=\"\",\"\",'Clearing Calculations'!A1733)","v":""},{"$f":"IF('Clearing Calculations'!A1733,'Clearing Calculations'!B1733,\"\")","v":""},{"$f":"IF('Clearing Calculations'!B1733,'Clearing Calculations'!C1733,\"\")","v":""},"","","",""]
[{"$f":"IF('Clearing Calculations'!A1734=\"\",\"\",'Clearing Calculations'!A1734)","v":""},{"$f":"IF('Clearing Calculations'!A1734,'Clearing Calculations'!B1734,\"\")","v":""},{"$f":"IF('Clearing Calculations'!B1734,'Clearing Calculations'!C1734,\"\")","v":""},"","","",""]
[{"$f":"IF('Clearing Calculations'!A1735=\"\",\"\",'Clearing Calculations'!A1735)","v":""},{"$f":"IF('Clearing Calculations'!A1735,'Clearing Calculations'!B1735,\"\")","v":""},{"$f":"IF('Clearing Calculations'!B1735,'Clearing Calculations'!C1735,\"\")","v":""},"","","",""]
[{"$f":"IF('Clearing Calculations'!A1736=\"\",\"\",'Clearing Calculations'!A1736)","v":""},{"$f":"IF('Clearing Calculations'!A1736,'Clearing Calculations'!B1736,\"\")","v":""},{"$f":"IF('Clearing Calculations'!B1736,'Clearing Calculations'!C1736,\"\")","v":""},"","","",""]
[{"$f":"IF('Clearing Calculations'!A1737=\"\",\"\",'Clearing Calculations'!A1737)","v":""},{"$f":"IF('Clearing Calculations'!A1737,'Clearing Calculations'!B1737,\"\")","v":""},{"$f":"IF('Clearing Calculations'!B1737,'Clearing Calculations'!C1737,\"\")","v":""},"","","",""]
[{"$f":"IF('Clearing Calculations'!A1738=\"\",\"\",'Clearing Calculations'!A1738)","v":""},{"$f":"IF('Clearing Calculations'!A1738,'Clearing Calculations'!B1738,\"\")","v":""},{"$f":"IF('Clearing Calculations'!B1738,'Clearing Calculations'!C1738,\"\")","v":""},"","","",""]
[{"$f":"IF('Clearing Calculations'!A1739=\"\",\"\",'Clearing Calculations'!A1739)","v":""},{"$f":"IF('Clearing Calculations'!A1739,'Clearing Calculations'!B1739,\"\")","v":""},{"$f":"IF('Clearing Calculations'!B1739,'Clearing Calculations'!C1739,\"\")","v":""},"","","",""]
[{"$f":"IF('Clearing Calculations'!A1740=\"\",\"\",'Clearing Calculations'!A1740)","v":""},{"$f":"IF('Clearing Calculations'!A1740,'Clearing Calculations'!B1740,\"\")","v":""},{"$f":"IF('Clearing Calculations'!B1740,'Clearing Calculations'!C1740,\"\")","v":""},"","","",""]
[{"$f":"IF('Clearing Calculations'!A1741=\"\",\"\",'Clearing Calculations'!A1741)","v":""},{"$f":"IF('Clearing Calculations'!A1741,'Clearing Calculations'!B1741,\"\")","v":""},{"$f":"IF('Clearing Calculations'!B1741,'Clearing Calculations'!C1741,\"\")","v":""},"","","",""]
[{"$f":"IF('Clearing Calculations'!A1742=\"\",\"\",'Clearing Calculations'!A1742)","v":""},{"$f":"IF('Clearing Calculations'!A1742,'Clearing Calculations'!B1742,\"\")","v":""},{"$f":"IF('Clearing Calculations'!B1742,'Clearing Calculations'!C1742,\"\")","v":""},"","","",""]
[{"$f":"IF('Clearing Calculations'!A1743=\"\",\"\",'Clearing Calculations'!A1743)","v":""},{"$f":"IF('Clearing Calculations'!A1743,'Clearing Calculations'!B1743,\"\")","v":""},{"$f":"IF('Clearing Calculations'!B1743,'Clearing Calculations'!C1743,\"\")","v":""},"","","",""]
[{"$f":"IF('Clearing Calculations'!A1744=\"\",\"\",'Clearing Calculations'!A1744)","v":""},{"$f":"IF('Clearing Calculations'!A1744,'Clearing Calculations'!B1744,\"\")","v":""},{"$f":"IF('Clearing Calculations'!B1744,'Clearing Calculations'!C1744,\"\")","v":""},"","","",""]
[{"$f":"IF('Clearing Calculations'!A1745=\"\",\"\",'Clearing Calculations'!A1745)","v":""},{"$f":"IF('Clearing Calculations'!A1745,'Clearing Calculations'!B1745,\"\")","v":""},{"$f":"IF('Clearing Calculations'!B1745,'Clearing Calculations'!C1745,\"\")","v":""},"","","",""]
[{"$f":"IF('Clearing Calculations'!A1746=\"\",\"\",'Clearing Calculations'!A1746)","v":""},{"$f":"IF('Clearing Calculations'!A1746,'Clearing Calculations'!B1746,\"\")","v":""},{"$f":"IF('Clearing Calculations'!B1746,'Clearing Calculations'!C1746,\"\")","v":""},"","","",""]
[{"$f":"IF('Clearing Calculations'!A1747=\"\",\"\",'Clearing Calculations'!A1747)","v":""},{"$f":"IF('Clearing Calculations'!A1747,'Clearing Calculations'!B1747,\"\")","v":""},{"$f":"IF('Clearing Calculations'!B1747,'Clearing Calculations'!C1747,\"\")","v":""},"","","",""]
[{"$f":"IF('Clearing Calculations'!A1748=\"\",\"\",'Clearing Calculations'!A1748)","v":""},{"$f":"IF('Clearing Calculations'!A1748,'Clearing Calculations'!B1748,\"\")","v":""},{"$f":"IF('Clearing Calculations'!B1748,'Clearing Calculations'!C1748,\"\")","v":""},"","","",""]
[{"$f":"IF('Clearing Calculations'!A1749=\"\",\"\",'Clearing Calculations'!A1749)","v":""},{"$f":"IF('Clearing Calculations'!A1749,'Clearing Calculations'!B1749,\"\")","v":""},{"$f":"IF('Clearing Calculations'!B1749,'Clearing Calculations'!C1749,\"\")","v":""},"","","",""]
[{"$f":"IF('Clearing Calculations'!A1750=\"\",\"\",'Clearing Calculations'!A1750)","v":""},{"$f":"IF('Clearing Calculations'!A1750,'Clearing Calculations'!B1750,\"\")","v":""},{"$f":"IF('Clearing Calculations'!B1750,'Clearing Calculations'!C1750,\"\")","v":""},"","","",""]
[{"$f":"IF('Clearing Calculations'!A1751=\"\",\"\",'Clearing Calculations'!A1751)","v":""},{"$f":"IF('Clearing Calculations'!A1751,'Clearing Calculations'!B1751,\"\")","v":""},{"$f":"IF('Clearing Calculations'!B1751,'Clearing Calculations'!C1751,\"\")","v":""},"","","",""]
[{"$f":"IF('Clearing Calculations'!A1752=\"\",\"\",'Clearing Calculations'!A1752)","v":""},{"$f":"IF('Clearing Calculations'!A1752,'Clearing Calculations'!B1752,\"\")","v":""},{"$f":"IF('Clearing Calculations'!B1752,'Clearing Calculations'!C1752,\"\")","v":""},"","","",""]
[{"$f":"IF('Clearing Calculations'!A1753=\"\",\"\",'Clearing Calculations'!A1753)","v":""},{"$f":"IF('Clearing Calculations'!A1753,'Clearing Calculations'!B1753,\"\")","v":""},{"$f":"IF('Clearing Calculations'!B1753,'Clearing Calculations'!C1753,\"\")","v":""},"","","",""]
[{"$f":"IF('Clearing Calculations'!A1754=\"\",\"\",'Clearing Calculations'!A1754)","v":""},{"$f":"IF('Clearing Calculations'!A1754,'Clearing Calculations'!B1754,\"\")","v":""},{"$f":"IF('Clearing Calculations'!B1754,'Clearing Calculations'!C1754,\"\")","v":""},"","","",""]
[{"$f":"IF('Clearing Calculations'!A1755=\"\",\"\",'Clearing Calculations'!A1755)","v":""},{"$f":"IF('Clearing Calculations'!A1755,'Clearing Calculations'!B1755,\"\")","v":""},{"$f":"IF('Clearing Calculations'!B1755,'Clearing Calculations'!C1755,\"\")","v":""},"","","",""]
[{"$f":"IF('Clearing Calculations'!A1756=\"\",\"\",'Clearing Calculations'!A1756)","v":""},{"$f":"IF('Clearing Calculations'!A1756,'Clearing Calculations'!B1756,\"\")","v":""},{"$f":"IF('Clearing Calculations'!B1756,'Clearing Calculations'!C1756,\"\")","v":""},"","","",""]
[{"$f":"IF('Clearing Calculations'!A1757=\"\",\"\",'Clearing Calculations'!A1757)","v":""},{"$f":"IF('Clearing Calculations'!A1757,'Clearing Calculations'!B1757,\"\")","v":""},{"$f":"IF('Clearing Calculations'!B1757,'Clearing Calculations'!C1757,\"\")","v":""},"","","",""]
[{"$f":"IF('Clearing Calculations'!A1758=\"\",\"\",'Clearing Calculations'!A1758)","v":""},{"$f":"IF('Clearing Calculations'!A1758,'Clearing Calculations'!B1758,\"\")","v":""},{"$f":"IF('Clearing Calculations'!B1758,'Clearing Calculations'!C1758,\"\")","v":""},"","","",""]
[{"$f":"IF('Clearing Calculations'!A1759=\"\",\"\",'Clearing Calculations'!A1759)","v":""},{"$f":"IF('Clearing Calculations'!A1759,'Clearing Calculations'!B1759,\"\")","v":""},{"$f":"IF('Clearing Calculations'!B1759,'Clearing Calculations'!C1759,\"\")","v":""},"","","",""]
[{"$f":"IF('Clearing Calculations'!A1760=\"\",\"\",'Clearing Calculations'!A1760)","v":""},{"$f":"IF('Clearing Calculations'!A1760,'Clearing Calculations'!B1760,\"\")","v":""},{"$f":"IF('Clearing Calculations'!B1760,'Clearing Calculations'!C1760,\"\")","v":""},"","","",""]
[{"$f":"IF('Clearing Calculations'!A1761=\"\",\"\",'Clearing Calculations'!A1761)","v":""},{"$f":"IF('Clearing Calculations'!A1761,'Clearing Calculations'!B1761,\"\")","v":""},{"$f":"IF('Clearing Calculations'!B1761,'Clearing Calculations'!C1761,\"\")","v":""},"","","",""]
[{"$f":"IF('Clearing Calculations'!A1762=\"\",\"\",'Clearing Calculations'!A1762)","v":""},{"$f":"IF('Clearing Calculations'!A1762,'Clearing Calculations'!B1762,\"\")","v":""},{"$f":"IF('Clearing Calculations'!B1762,'Clearing Calculations'!C1762,\"\")","v":""},"","","",""]
[{"$f":"IF('Clearing Calculations'!A1763=\"\",\"\",'Clearing Calculations'!A1763)","v":""},{"$f":"IF('Clearing Calculations'!A1763,'Clearing Calculations'!B1763,\"\")","v":""},{"$f":"IF('Clearing Calculations'!B1763,'Clearing Calculations'!C1763,\"\")","v":""},"","","",""]
[{"$f":"IF('Clearing Calculations'!A1764=\"\",\"\",'Clearing Calculations'!A1764)","v":""},{"$f":"IF('Clearing Calculations'!A1764,'Clearing Calculations'!B1764,\"\")","v":""},{"$f":"IF('Clearing Calculations'!B1764,'Clearing Calculations'!C1764,\"\")","v":""},"","","",""]
[{"$f":"IF('Clearing Calculations'!A1765=\"\",\"\",'Clearing Calculations'!A1765)","v":""},{"$f":"IF('Clearing Calculations'!A1765,'Clearing Calculations'!B1765,\"\")","v":""},{"$f":"IF('Clearing Calculations'!B1765,'Clearing Calculations'!C1765,\"\")","v":""},"","","",""]
[{"$f":"IF('Clearing Calculations'!A1766=\"\",\"\",'Clearing Calculations'!A1766)","v":""},{"$f":"IF('Clearing Calculations'!A1766,'Clearing Calculations'!B1766,\"\")","v":""},{"$f":"IF('Clearing Calculations'!B1766,'Clearing Calculations'!C1766,\"\")","v":""},"","","",""]
[{"$f":"IF('Clearing Calculations'!A1767=\"\",\"\",'Clearing Calculations'!A1767)","v":""},{"$f":"IF('Clearing Calculations'!A1767,'Clearing Calculations'!B1767,\"\")","v":""},{"$f":"IF('Clearing Calculations'!B1767,'Clearing Calculations'!C1767,\"\")","v":""},"","","",""]
[{"$f":"IF('Clearing Calculations'!A1768=\"\",\"\",'Clearing Calculations'!A1768)","v":""},{"$f":"IF('Clearing Calculations'!A1768,'Clearing Calculations'!B1768,\"\")","v":""},{"$f":"IF('Clearing Calculations'!B1768,'Clearing Calculations'!C1768,\"\")","v":""},"","","",""]
[{"$f":"IF('Clearing Calculations'!A1769=\"\",\"\",'Clearing Calculations'!A1769)","v":""},{"$f":"IF('Clearing Calculations'!A1769,'Clearing Calculations'!B1769,\"\")","v":""},{"$f":"IF('Clearing Calculations'!B1769,'Clearing Calculations'!C1769,\"\")","v":""},"","","",""]
[{"$f":"IF('Clearing Calculations'!A1770=\"\",\"\",'Clearing Calculations'!A1770)","v":""},{"$f":"IF('Clearing Calculations'!A1770,'Clearing Calculations'!B1770,\"\")","v":""},{"$f":"IF('Clearing Calculations'!B1770,'Clearing Calculations'!C1770,\"\")","v":""},"","","",""]
[{"$f":"IF('Clearing Calculations'!A1771=\"\",\"\",'Clearing Calculations'!A1771)","v":""},{"$f":"IF('Clearing Calculations'!A1771,'Clearing Calculations'!B1771,\"\")","v":""},{"$f":"IF('Clearing Calculations'!B1771,'Clearing Calculations'!C1771,\"\")","v":""},"","","",""]
[{"$f":"IF('Clearing Calculations'!A1772=\"\",\"\",'Clearing Calculations'!A1772)","v":""},{"$f":"IF('Clearing Calculations'!A1772,'Clearing Calculations'!B1772,\"\")","v":""},{"$f":"IF('Clearing Calculations'!B1772,'Clearing Calculations'!C1772,\"\")","v":""},{"$f":"IF(A1778=\"\",\"\",$B1778+$C1778)","v":""},{"$f":"IF(A1778=\"\",\"\",(D1778+D1777)/2*(A1778-A1777))","v":""},{"$f":"IF(A1778=\"\",\"\",(E1778/9))","v":""},{"$f":"IF(A1778=\"\",\"\",E1778/$G$3)","v":""}]
[{"$f":"IF('Clearing Calculations'!A1773=\"\",\"\",'Clearing Calculations'!A1773)","v":""},{"$f":"IF('Clearing Calculations'!A1773,'Clearing Calculations'!B1773,\"\")","v":""},{"$f":"IF('Clearing Calculations'!B1773,'Clearing Calculations'!C1773,\"\")","v":""},"","","",""]
[{"$f":"IF('Clearing Calculations'!A1774=\"\",\"\",'Clearing Calculations'!A1774)","v":""},{"$f":"IF('Clearing Calculations'!A1774,'Clearing Calculations'!B1774,\"\")","v":""},{"$f":"IF('Clearing Calculations'!B1774,'Clearing Calculations'!C1774,\"\")","v":""},"","","",""]
[{"$f":"IF('Clearing Calculations'!A1775=\"\",\"\",'Clearing Calculations'!A1775)","v":""},{"$f":"IF('Clearing Calculations'!A1775,'Clearing Calculations'!B1775,\"\")","v":""},{"$f":"IF('Clearing Calculations'!B1775,'Clearing Calculations'!C1775,\"\")","v":""},"","","",""]
[{"$f":"IF('Clearing Calculations'!A1776=\"\",\"\",'Clearing Calculations'!A1776)","v":""},{"$f":"IF('Clearing Calculations'!A1776,'Clearing Calculations'!B1776,\"\")","v":""},{"$f":"IF('Clearing Calculations'!B1776,'Clearing Calculations'!C1776,\"\")","v":""},"","","",""]
[{"$f":"IF('Clearing Calculations'!A1777=\"\",\"\",'Clearing Calculations'!A1777)","v":""},{"$f":"IF('Clearing Calculations'!A1777,'Clearing Calculations'!B1777,\"\")","v":""},{"$f":"IF('Clearing Calculations'!B1777,'Clearing Calculations'!C1777,\"\")","v":""},"","","",""]
[{"$f":"IF('Clearing Calculations'!A1778=\"\",\"\",'Clearing Calculations'!A1778)","v":""},{"$f":"IF('Clearing Calculations'!A1778,'Clearing Calculations'!B1778,\"\")","v":""},{"$f":"IF('Clearing Calculations'!B1778,'Clearing Calculations'!C1778,\"\")","v":""},"","","",""]
[{"$f":"IF('Clearing Calculations'!A1779=\"\",\"\",'Clearing Calculations'!A1779)","v":""},{"$f":"IF('Clearing Calculations'!A1779,'Clearing Calculations'!B1779,\"\")","v":""},{"$f":"IF('Clearing Calculations'!B1779,'Clearing Calculations'!C1779,\"\")","v":""},"","","",""]
[{"$f":"IF('Clearing Calculations'!A1780=\"\",\"\",'Clearing Calculations'!A1780)","v":""},{"$f":"IF('Clearing Calculations'!A1780,'Clearing Calculations'!B1780,\"\")","v":""},{"$f":"IF('Clearing Calculations'!B1780,'Clearing Calculations'!C1780,\"\")","v":""},"","","",""]
[{"$f":"IF('Clearing Calculations'!A1781=\"\",\"\",'Clearing Calculations'!A1781)","v":""},{"$f":"IF('Clearing Calculations'!A1781,'Clearing Calculations'!B1781,\"\")","v":""},{"$f":"IF('Clearing Calculations'!B1781,'Clearing Calculations'!C1781,\"\")","v":""},"","","",""]
[{"$f":"IF('Clearing Calculations'!A1782=\"\",\"\",'Clearing Calculations'!A1782)","v":""},{"$f":"IF('Clearing Calculations'!A1782,'Clearing Calculations'!B1782,\"\")","v":""},{"$f":"IF('Clearing Calculations'!B1782,'Clearing Calculations'!C1782,\"\")","v":""},"","","",""]
[{"$f":"IF('Clearing Calculations'!A1783=\"\",\"\",'Clearing Calculations'!A1783)","v":""},{"$f":"IF('Clearing Calculations'!A1783,'Clearing Calculations'!B1783,\"\")","v":""},{"$f":"IF('Clearing Calculations'!B1783,'Clearing Calculations'!C1783,\"\")","v":""},"","","",""]
[{"$f":"IF('Clearing Calculations'!A1784=\"\",\"\",'Clearing Calculations'!A1784)","v":""},{"$f":"IF('Clearing Calculations'!A1784,'Clearing Calculations'!B1784,\"\")","v":""},{"$f":"IF('Clearing Calculations'!B1784,'Clearing Calculations'!C1784,\"\")","v":""},"","","",""]
[{"$f":"IF('Clearing Calculations'!A1785=\"\",\"\",'Clearing Calculations'!A1785)","v":""},{"$f":"IF('Clearing Calculations'!A1785,'Clearing Calculations'!B1785,\"\")","v":""},{"$f":"IF('Clearing Calculations'!B1785,'Clearing Calculations'!C1785,\"\")","v":""},"","","",""]
[{"$f":"IF('Clearing Calculations'!A1786=\"\",\"\",'Clearing Calculations'!A1786)","v":""},{"$f":"IF('Clearing Calculations'!A1786,'Clearing Calculations'!B1786,\"\")","v":""},{"$f":"IF('Clearing Calculations'!B1786,'Clearing Calculations'!C1786,\"\")","v":""},"","","",""]
[{"$f":"IF('Clearing Calculations'!A1787=\"\",\"\",'Clearing Calculations'!A1787)","v":""},{"$f":"IF('Clearing Calculations'!A1787,'Clearing Calculations'!B1787,\"\")","v":""},{"$f":"IF('Clearing Calculations'!B1787,'Clearing Calculations'!C1787,\"\")","v":""},"","","",""]
[{"$f":"IF('Clearing Calculations'!A1788=\"\",\"\",'Clearing Calculations'!A1788)","v":""},{"$f":"IF('Clearing Calculations'!A1788,'Clearing Calculations'!B1788,\"\")","v":""},{"$f":"IF('Clearing Calculations'!B1788,'Clearing Calculations'!C1788,\"\")","v":""},"","","",""]
[{"$f":"IF('Clearing Calculations'!A1789=\"\",\"\",'Clearing Calculations'!A1789)","v":""},{"$f":"IF('Clearing Calculations'!A1789,'Clearing Calculations'!B1789,\"\")","v":""},{"$f":"IF('Clearing Calculations'!B1789,'Clearing Calculations'!C1789,\"\")","v":""},"","","",""]
[{"$f":"IF('Clearing Calculations'!A1790=\"\",\"\",'Clearing Calculations'!A1790)","v":""},{"$f":"IF('Clearing Calculations'!A1790,'Clearing Calculations'!B1790,\"\")","v":""},{"$f":"IF('Clearing Calculations'!B1790,'Clearing Calculations'!C1790,\"\")","v":""},"","","",""]
[{"$f":"IF('Clearing Calculations'!A1791=\"\",\"\",'Clearing Calculations'!A1791)","v":""},{"$f":"IF('Clearing Calculations'!A1791,'Clearing Calculations'!B1791,\"\")","v":""},{"$f":"IF('Clearing Calculations'!B1791,'Clearing Calculations'!C1791,\"\")","v":""},"","","",""]
[{"$f":"IF('Clearing Calculations'!A1792=\"\",\"\",'Clearing Calculations'!A1792)","v":""},{"$f":"IF('Clearing Calculations'!A1792,'Clearing Calculations'!B1792,\"\")","v":""},{"$f":"IF('Clearing Calculations'!B1792,'Clearing Calculations'!C1792,\"\")","v":""},"","","",""]
[{"$f":"IF('Clearing Calculations'!A1793=\"\",\"\",'Clearing Calculations'!A1793)","v":""},{"$f":"IF('Clearing Calculations'!A1793,'Clearing Calculations'!B1793,\"\")","v":""},{"$f":"IF('Clearing Calculations'!B1793,'Clearing Calculations'!C1793,\"\")","v":""},"","","",""]
[{"$f":"IF('Clearing Calculations'!A1794=\"\",\"\",'Clearing Calculations'!A1794)","v":""},{"$f":"IF('Clearing Calculations'!A1794,'Clearing Calculations'!B1794,\"\")","v":""},{"$f":"IF('Clearing Calculations'!B1794,'Clearing Calculations'!C1794,\"\")","v":""},"","","",""]
[{"$f":"IF('Clearing Calculations'!A1795=\"\",\"\",'Clearing Calculations'!A1795)","v":""},{"$f":"IF('Clearing Calculations'!A1795,'Clearing Calculations'!B1795,\"\")","v":""},{"$f":"IF('Clearing Calculations'!B1795,'Clearing Calculations'!C1795,\"\")","v":""},"","","",""]
[{"$f":"IF('Clearing Calculations'!A1796=\"\",\"\",'Clearing Calculations'!A1796)","v":""},{"$f":"IF('Clearing Calculations'!A1796,'Clearing Calculations'!B1796,\"\")","v":""},{"$f":"IF('Clearing Calculations'!B1796,'Clearing Calculations'!C1796,\"\")","v":""},"","","",""]
[{"$f":"IF('Clearing Calculations'!A1797=\"\",\"\",'Clearing Calculations'!A1797)","v":""},{"$f":"IF('Clearing Calculations'!A1797,'Clearing Calculations'!B1797,\"\")","v":""},{"$f":"IF('Clearing Calculations'!B1797,'Clearing Calculations'!C1797,\"\")","v":""},"","","",""]
[{"$f":"IF('Clearing Calculations'!A1798=\"\",\"\",'Clearing Calculations'!A1798)","v":""},{"$f":"IF('Clearing Calculations'!A1798,'Clearing Calculations'!B1798,\"\")","v":""},{"$f":"IF('Clearing Calculations'!B1798,'Clearing Calculations'!C1798,\"\")","v":""},"","","",""]
[{"$f":"IF('Clearing Calculations'!A1799=\"\",\"\",'Clearing Calculations'!A1799)","v":""},{"$f":"IF('Clearing Calculations'!A1799,'Clearing Calculations'!B1799,\"\")","v":""},{"$f":"IF('Clearing Calculations'!B1799,'Clearing Calculations'!C1799,\"\")","v":""},"","","",""]
[{"$f":"IF('Clearing Calculations'!A1800=\"\",\"\",'Clearing Calculations'!A1800)","v":""},{"$f":"IF('Clearing Calculations'!A1800,'Clearing Calculations'!B1800,\"\")","v":""},{"$f":"IF('Clearing Calculations'!B1800,'Clearing Calculations'!C1800,\"\")","v":""},"","","",""]
[{"$f":"IF('Clearing Calculations'!A1801=\"\",\"\",'Clearing Calculations'!A1801)","v":""},{"$f":"IF('Clearing Calculations'!A1801,'Clearing Calculations'!B1801,\"\")","v":""},{"$f":"IF('Clearing Calculations'!B1801,'Clearing Calculations'!C1801,\"\")","v":""},"","","",""]
[{"$f":"IF('Clearing Calculations'!A1802=\"\",\"\",'Clearing Calculations'!A1802)","v":""},{"$f":"IF('Clearing Calculations'!A1802,'Clearing Calculations'!B1802,\"\")","v":""},{"$f":"IF('Clearing Calculations'!B1802,'Clearing Calculations'!C1802,\"\")","v":""},"","","",""]
[{"$f":"IF('Clearing Calculations'!A1803=\"\",\"\",'Clearing Calculations'!A1803)","v":""},{"$f":"IF('Clearing Calculations'!A1803,'Clearing Calculations'!B1803,\"\")","v":""},{"$f":"IF('Clearing Calculations'!B1803,'Clearing Calculations'!C1803,\"\")","v":""},"","","",""]
[{"$f":"IF('Clearing Calculations'!A1804=\"\",\"\",'Clearing Calculations'!A1804)","v":""},{"$f":"IF('Clearing Calculations'!A1804,'Clearing Calculations'!B1804,\"\")","v":""},{"$f":"IF('Clearing Calculations'!B1804,'Clearing Calculations'!C1804,\"\")","v":""},"","","",""]
[{"$f":"IF('Clearing Calculations'!A1805=\"\",\"\",'Clearing Calculations'!A1805)","v":""},{"$f":"IF('Clearing Calculations'!A1805,'Clearing Calculations'!B1805,\"\")","v":""},{"$f":"IF('Clearing Calculations'!B1805,'Clearing Calculations'!C1805,\"\")","v":""},"","","",""]
[{"$f":"IF('Clearing Calculations'!A1806=\"\",\"\",'Clearing Calculations'!A1806)","v":""},{"$f":"IF('Clearing Calculations'!A1806,'Clearing Calculations'!B1806,\"\")","v":""},{"$f":"IF('Clearing Calculations'!B1806,'Clearing Calculations'!C1806,\"\")","v":""},"","","",""]
[{"$f":"IF('Clearing Calculations'!A1807=\"\",\"\",'Clearing Calculations'!A1807)","v":""},{"$f":"IF('Clearing Calculations'!A1807,'Clearing Calculations'!B1807,\"\")","v":""},{"$f":"IF('Clearing Calculations'!B1807,'Clearing Calculations'!C1807,\"\")","v":""},"","","",""]
[{"$f":"IF('Clearing Calculations'!A1808=\"\",\"\",'Clearing Calculations'!A1808)","v":""},{"$f":"IF('Clearing Calculations'!A1808,'Clearing Calculations'!B1808,\"\")","v":""},{"$f":"IF('Clearing Calculations'!B1808,'Clearing Calculations'!C1808,\"\")","v":""},"","","",""]
[{"$f":"IF('Clearing Calculations'!A1809=\"\",\"\",'Clearing Calculations'!A1809)","v":""},{"$f":"IF('Clearing Calculations'!A1809,'Clearing Calculations'!B1809,\"\")","v":""},{"$f":"IF('Clearing Calculations'!B1809,'Clearing Calculations'!C1809,\"\")","v":""},"","","",""]
[{"$f":"IF('Clearing Calculations'!A1810=\"\",\"\",'Clearing Calculations'!A1810)","v":""},{"$f":"IF('Clearing Calculations'!A1810,'Clearing Calculations'!B1810,\"\")","v":""},{"$f":"IF('Clearing Calculations'!B1810,'Clearing Calculations'!C1810,\"\")","v":""},"","","",""]
[{"$f":"IF('Clearing Calculations'!A1811=\"\",\"\",'Clearing Calculations'!A1811)","v":""},{"$f":"IF('Clearing Calculations'!A1811,'Clearing Calculations'!B1811,\"\")","v":""},{"$f":"IF('Clearing Calculations'!B1811,'Clearing Calculations'!C1811,\"\")","v":""},"","","",""]
[{"$f":"IF('Clearing Calculations'!A1812=\"\",\"\",'Clearing Calculations'!A1812)","v":""},{"$f":"IF('Clearing Calculations'!A1812,'Clearing Calculations'!B1812,\"\")","v":""},{"$f":"IF('Clearing Calculations'!B1812,'Clearing Calculations'!C1812,\"\")","v":""},"","","",""]
[{"$f":"IF('Clearing Calculations'!A1813=\"\",\"\",'Clearing Calculations'!A1813)","v":""},{"$f":"IF('Clearing Calculations'!A1813,'Clearing Calculations'!B1813,\"\")","v":""},{"$f":"IF('Clearing Calculations'!B1813,'Clearing Calculations'!C1813,\"\")","v":""},"","","",""]
[{"$f":"IF('Clearing Calculations'!A1814=\"\",\"\",'Clearing Calculations'!A1814)","v":""},{"$f":"IF('Clearing Calculations'!A1814,'Clearing Calculations'!B1814,\"\")","v":""},{"$f":"IF('Clearing Calculations'!B1814,'Clearing Calculations'!C1814,\"\")","v":""},"","","",""]
[{"$f":"IF('Clearing Calculations'!A1815=\"\",\"\",'Clearing Calculations'!A1815)","v":""},{"$f":"IF('Clearing Calculations'!A1815,'Clearing Calculations'!B1815,\"\")","v":""},{"$f":"IF('Clearing Calculations'!B1815,'Clearing Calculations'!C1815,\"\")","v":""},"","","",""]
[{"$f":"IF('Clearing Calculations'!A1816=\"\",\"\",'Clearing Calculations'!A1816)","v":""},{"$f":"IF('Clearing Calculations'!A1816,'Clearing Calculations'!B1816,\"\")","v":""},{"$f":"IF('Clearing Calculations'!B1816,'Clearing Calculations'!C1816,\"\")","v":""},"","","",""]
[{"$f":"IF('Clearing Calculations'!A1817=\"\",\"\",'Clearing Calculations'!A1817)","v":""},{"$f":"IF('Clearing Calculations'!A1817,'Clearing Calculations'!B1817,\"\")","v":""},{"$f":"IF('Clearing Calculations'!B1817,'Clearing Calculations'!C1817,\"\")","v":""},"","","",""]
[{"$f":"IF('Clearing Calculations'!A1818=\"\",\"\",'Clearing Calculations'!A1818)","v":""},{"$f":"IF('Clearing Calculations'!A1818,'Clearing Calculations'!B1818,\"\")","v":""},{"$f":"IF('Clearing Calculations'!B1818,'Clearing Calculations'!C1818,\"\")","v":""},"","","",""]
[{"$f":"IF('Clearing Calculations'!A1819=\"\",\"\",'Clearing Calculations'!A1819)","v":""},{"$f":"IF('Clearing Calculations'!A1819,'Clearing Calculations'!B1819,\"\")","v":""},{"$f":"IF('Clearing Calculations'!B1819,'Clearing Calculations'!C1819,\"\")","v":""},"","","",""]
[{"$f":"IF('Clearing Calculations'!A1820=\"\",\"\",'Clearing Calculations'!A1820)","v":""},{"$f":"IF('Clearing Calculations'!A1820,'Clearing Calculations'!B1820,\"\")","v":""},{"$f":"IF('Clearing Calculations'!B1820,'Clearing Calculations'!C1820,\"\")","v":""},"","","",""]
[{"$f":"IF('Clearing Calculations'!A1821=\"\",\"\",'Clearing Calculations'!A1821)","v":""},{"$f":"IF('Clearing Calculations'!A1821,'Clearing Calculations'!B1821,\"\")","v":""},{"$f":"IF('Clearing Calculations'!B1821,'Clearing Calculations'!C1821,\"\")","v":""},"","","",""]
[{"$f":"IF('Clearing Calculations'!A1822=\"\",\"\",'Clearing Calculations'!A1822)","v":""},{"$f":"IF('Clearing Calculations'!A1822,'Clearing Calculations'!B1822,\"\")","v":""},{"$f":"IF('Clearing Calculations'!B1822,'Clearing Calculations'!C1822,\"\")","v":""},"","","",""]
[{"$f":"IF('Clearing Calculations'!A1823=\"\",\"\",'Clearing Calculations'!A1823)","v":""},{"$f":"IF('Clearing Calculations'!A1823,'Clearing Calculations'!B1823,\"\")","v":""},{"$f":"IF('Clearing Calculations'!B1823,'Clearing Calculations'!C1823,\"\")","v":""},"","","",""]
[{"$f":"IF('Clearing Calculations'!A1824=\"\",\"\",'Clearing Calculations'!A1824)","v":""},{"$f":"IF('Clearing Calculations'!A1824,'Clearing Calculations'!B1824,\"\")","v":""},{"$f":"IF('Clearing Calculations'!B1824,'Clearing Calculations'!C1824,\"\")","v":""},"","","",""]
[{"$f":"IF('Clearing Calculations'!A1825=\"\",\"\",'Clearing Calculations'!A1825)","v":""},{"$f":"IF('Clearing Calculations'!A1825,'Clearing Calculations'!B1825,\"\")","v":""},{"$f":"IF('Clearing Calculations'!B1825,'Clearing Calculations'!C1825,\"\")","v":""},"","","",""]
[{"$f":"IF('Clearing Calculations'!A1826=\"\",\"\",'Clearing Calculations'!A1826)","v":""},{"$f":"IF('Clearing Calculations'!A1826,'Clearing Calculations'!B1826,\"\")","v":""},{"$f":"IF('Clearing Calculations'!B1826,'Clearing Calculations'!C1826,\"\")","v":""},"","","",""]
[{"$f":"IF('Clearing Calculations'!A1827=\"\",\"\",'Clearing Calculations'!A1827)","v":""},{"$f":"IF('Clearing Calculations'!A1827,'Clearing Calculations'!B1827,\"\")","v":""},{"$f":"IF('Clearing Calculations'!B1827,'Clearing Calculations'!C1827,\"\")","v":""},"","","",""]
[{"$f":"IF('Clearing Calculations'!A1828=\"\",\"\",'Clearing Calculations'!A1828)","v":""},{"$f":"IF('Clearing Calculations'!A1828,'Clearing Calculations'!B1828,\"\")","v":""},{"$f":"IF('Clearing Calculations'!B1828,'Clearing Calculations'!C1828,\"\")","v":""},"","","",""]
[{"$f":"IF('Clearing Calculations'!A1829=\"\",\"\",'Clearing Calculations'!A1829)","v":""},{"$f":"IF('Clearing Calculations'!A1829,'Clearing Calculations'!B1829,\"\")","v":""},{"$f":"IF('Clearing Calculations'!B1829,'Clearing Calculations'!C1829,\"\")","v":""},"","","",""]
[{"$f":"IF('Clearing Calculations'!A1830=\"\",\"\",'Clearing Calculations'!A1830)","v":""},{"$f":"IF('Clearing Calculations'!A1830,'Clearing Calculations'!B1830,\"\")","v":""},{"$f":"IF('Clearing Calculations'!B1830,'Clearing Calculations'!C1830,\"\")","v":""},"","","",""]
[{"$f":"IF('Clearing Calculations'!A1831=\"\",\"\",'Clearing Calculations'!A1831)","v":""},{"$f":"IF('Clearing Calculations'!A1831,'Clearing Calculations'!B1831,\"\")","v":""},{"$f":"IF('Clearing Calculations'!B1831,'Clearing Calculations'!C1831,\"\")","v":""},"","","",""]
[{"$f":"IF('Clearing Calculations'!A1832=\"\",\"\",'Clearing Calculations'!A1832)","v":""},{"$f":"IF('Clearing Calculations'!A1832,'Clearing Calculations'!B1832,\"\")","v":""},{"$f":"IF('Clearing Calculations'!B1832,'Clearing Calculations'!C1832,\"\")","v":""},"","","",""]
[{"$f":"IF('Clearing Calculations'!A1833=\"\",\"\",'Clearing Calculations'!A1833)","v":""},{"$f":"IF('Clearing Calculations'!A1833,'Clearing Calculations'!B1833,\"\")","v":""},{"$f":"IF('Clearing Calculations'!B1833,'Clearing Calculations'!C1833,\"\")","v":""},"","","",""]
[{"$f":"IF('Clearing Calculations'!A1834=\"\",\"\",'Clearing Calculations'!A1834)","v":""},{"$f":"IF('Clearing Calculations'!A1834,'Clearing Calculations'!B1834,\"\")","v":""},{"$f":"IF('Clearing Calculations'!B1834,'Clearing Calculations'!C1834,\"\")","v":""},"","","",""]
[{"$f":"IF('Clearing Calculations'!A1835=\"\",\"\",'Clearing Calculations'!A1835)","v":""},{"$f":"IF('Clearing Calculations'!A1835,'Clearing Calculations'!B1835,\"\")","v":""},{"$f":"IF('Clearing Calculations'!B1835,'Clearing Calculations'!C1835,\"\")","v":""},"","","",""]
[{"$f":"IF('Clearing Calculations'!A1836=\"\",\"\",'Clearing Calculations'!A1836)","v":""},{"$f":"IF('Clearing Calculations'!A1836,'Clearing Calculations'!B1836,\"\")","v":""},{"$f":"IF('Clearing Calculations'!B1836,'Clearing Calculations'!C1836,\"\")","v":""},{"$f":"IF(A1842=\"\",\"\",$B1842+$C1842)","v":""},{"$f":"IF(A1842=\"\",\"\",(D1842+D1841)/2*(A1842-A1841))","v":""},{"$f":"IF(A1842=\"\",\"\",(E1842/9))","v":""},{"$f":"IF(A1842=\"\",\"\",E1842/$G$3)","v":""}]
[{"$f":"IF('Clearing Calculations'!A1837=\"\",\"\",'Clearing Calculations'!A1837)","v":""},{"$f":"IF('Clearing Calculations'!A1837,'Clearing Calculations'!B1837,\"\")","v":""},{"$f":"IF('Clearing Calculations'!B1837,'Clearing Calculations'!C1837,\"\")","v":""},"","","",""]
[{"$f":"IF('Clearing Calculations'!A1838=\"\",\"\",'Clearing Calculations'!A1838)","v":""},{"$f":"IF('Clearing Calculations'!A1838,'Clearing Calculations'!B1838,\"\")","v":""},{"$f":"IF('Clearing Calculations'!B1838,'Clearing Calculations'!C1838,\"\")","v":""},"","","",""]
[{"$f":"IF('Clearing Calculations'!A1839=\"\",\"\",'Clearing Calculations'!A1839)","v":""},{"$f":"IF('Clearing Calculations'!A1839,'Clearing Calculations'!B1839,\"\")","v":""},{"$f":"IF('Clearing Calculations'!B1839,'Clearing Calculations'!C1839,\"\")","v":""},"","","",""]
[{"$f":"IF('Clearing Calculations'!A1840=\"\",\"\",'Clearing Calculations'!A1840)","v":""},{"$f":"IF('Clearing Calculations'!A1840,'Clearing Calculations'!B1840,\"\")","v":""},{"$f":"IF('Clearing Calculations'!B1840,'Clearing Calculations'!C1840,\"\")","v":""},"","","",""]
[{"$f":"IF('Clearing Calculations'!A1841=\"\",\"\",'Clearing Calculations'!A1841)","v":""},{"$f":"IF('Clearing Calculations'!A1841,'Clearing Calculations'!B1841,\"\")","v":""},{"$f":"IF('Clearing Calculations'!B1841,'Clearing Calculations'!C1841,\"\")","v":""},"","","",""]
[{"$f":"IF('Clearing Calculations'!A1842=\"\",\"\",'Clearing Calculations'!A1842)","v":""},{"$f":"IF('Clearing Calculations'!A1842,'Clearing Calculations'!B1842,\"\")","v":""},{"$f":"IF('Clearing Calculations'!B1842,'Clearing Calculations'!C1842,\"\")","v":""},"","","",""]
[{"$f":"IF('Clearing Calculations'!A1843=\"\",\"\",'Clearing Calculations'!A1843)","v":""},{"$f":"IF('Clearing Calculations'!A1843,'Clearing Calculations'!B1843,\"\")","v":""},{"$f":"IF('Clearing Calculations'!B1843,'Clearing Calculations'!C1843,\"\")","v":""},"","","",""]
[{"$f":"IF('Clearing Calculations'!A1844=\"\",\"\",'Clearing Calculations'!A1844)","v":""},{"$f":"IF('Clearing Calculations'!A1844,'Clearing Calculations'!B1844,\"\")","v":""},{"$f":"IF('Clearing Calculations'!B1844,'Clearing Calculations'!C1844,\"\")","v":""},"","","",""]
[{"$f":"IF('Clearing Calculations'!A1845=\"\",\"\",'Clearing Calculations'!A1845)","v":""},{"$f":"IF('Clearing Calculations'!A1845,'Clearing Calculations'!B1845,\"\")","v":""},{"$f":"IF('Clearing Calculations'!B1845,'Clearing Calculations'!C1845,\"\")","v":""},"","","",""]
[{"$f":"IF('Clearing Calculations'!A1846=\"\",\"\",'Clearing Calculations'!A1846)","v":""},{"$f":"IF('Clearing Calculations'!A1846,'Clearing Calculations'!B1846,\"\")","v":""},{"$f":"IF('Clearing Calculations'!B1846,'Clearing Calculations'!C1846,\"\")","v":""},"","","",""]
[{"$f":"IF('Clearing Calculations'!A1847=\"\",\"\",'Clearing Calculations'!A1847)","v":""},{"$f":"IF('Clearing Calculations'!A1847,'Clearing Calculations'!B1847,\"\")","v":""},{"$f":"IF('Clearing Calculations'!B1847,'Clearing Calculations'!C1847,\"\")","v":""},"","","",""]
[{"$f":"IF('Clearing Calculations'!A1848=\"\",\"\",'Clearing Calculations'!A1848)","v":""},{"$f":"IF('Clearing Calculations'!A1848,'Clearing Calculations'!B1848,\"\")","v":""},{"$f":"IF('Clearing Calculations'!B1848,'Clearing Calculations'!C1848,\"\")","v":""},"","","",""]
[{"$f":"IF('Clearing Calculations'!A1849=\"\",\"\",'Clearing Calculations'!A1849)","v":""},{"$f":"IF('Clearing Calculations'!A1849,'Clearing Calculations'!B1849,\"\")","v":""},{"$f":"IF('Clearing Calculations'!B1849,'Clearing Calculations'!C1849,\"\")","v":""},"","","",""]
[{"$f":"IF('Clearing Calculations'!A1850=\"\",\"\",'Clearing Calculations'!A1850)","v":""},{"$f":"IF('Clearing Calculations'!A1850,'Clearing Calculations'!B1850,\"\")","v":""},{"$f":"IF('Clearing Calculations'!B1850,'Clearing Calculations'!C1850,\"\")","v":""},"","","",""]
[{"$f":"IF('Clearing Calculations'!A1851=\"\",\"\",'Clearing Calculations'!A1851)","v":""},{"$f":"IF('Clearing Calculations'!A1851,'Clearing Calculations'!B1851,\"\")","v":""},{"$f":"IF('Clearing Calculations'!B1851,'Clearing Calculations'!C1851,\"\")","v":""},"","","",""]
[{"$f":"IF('Clearing Calculations'!A1852=\"\",\"\",'Clearing Calculations'!A1852)","v":""},{"$f":"IF('Clearing Calculations'!A1852,'Clearing Calculations'!B1852,\"\")","v":""},{"$f":"IF('Clearing Calculations'!B1852,'Clearing Calculations'!C1852,\"\")","v":""},"","","",""]
[{"$f":"IF('Clearing Calculations'!A1853=\"\",\"\",'Clearing Calculations'!A1853)","v":""},{"$f":"IF('Clearing Calculations'!A1853,'Clearing Calculations'!B1853,\"\")","v":""},{"$f":"IF('Clearing Calculations'!B1853,'Clearing Calculations'!C1853,\"\")","v":""},"","","",""]
[{"$f":"IF('Clearing Calculations'!A1854=\"\",\"\",'Clearing Calculations'!A1854)","v":""},{"$f":"IF('Clearing Calculations'!A1854,'Clearing Calculations'!B1854,\"\")","v":""},{"$f":"IF('Clearing Calculations'!B1854,'Clearing Calculations'!C1854,\"\")","v":""},"","","",""]
[{"$f":"IF('Clearing Calculations'!A1855=\"\",\"\",'Clearing Calculations'!A1855)","v":""},{"$f":"IF('Clearing Calculations'!A1855,'Clearing Calculations'!B1855,\"\")","v":""},{"$f":"IF('Clearing Calculations'!B1855,'Clearing Calculations'!C1855,\"\")","v":""},"","","",""]
[{"$f":"IF('Clearing Calculations'!A1856=\"\",\"\",'Clearing Calculations'!A1856)","v":""},{"$f":"IF('Clearing Calculations'!A1856,'Clearing Calculations'!B1856,\"\")","v":""},{"$f":"IF('Clearing Calculations'!B1856,'Clearing Calculations'!C1856,\"\")","v":""},"","","",""]
[{"$f":"IF('Clearing Calculations'!A1857=\"\",\"\",'Clearing Calculations'!A1857)","v":""},{"$f":"IF('Clearing Calculations'!A1857,'Clearing Calculations'!B1857,\"\")","v":""},{"$f":"IF('Clearing Calculations'!B1857,'Clearing Calculations'!C1857,\"\")","v":""},"","","",""]
[{"$f":"IF('Clearing Calculations'!A1858=\"\",\"\",'Clearing Calculations'!A1858)","v":""},{"$f":"IF('Clearing Calculations'!A1858,'Clearing Calculations'!B1858,\"\")","v":""},{"$f":"IF('Clearing Calculations'!B1858,'Clearing Calculations'!C1858,\"\")","v":""},"","","",""]
[{"$f":"IF('Clearing Calculations'!A1859=\"\",\"\",'Clearing Calculations'!A1859)","v":""},{"$f":"IF('Clearing Calculations'!A1859,'Clearing Calculations'!B1859,\"\")","v":""},{"$f":"IF('Clearing Calculations'!B1859,'Clearing Calculations'!C1859,\"\")","v":""},"","","",""]
[{"$f":"IF('Clearing Calculations'!A1860=\"\",\"\",'Clearing Calculations'!A1860)","v":""},{"$f":"IF('Clearing Calculations'!A1860,'Clearing Calculations'!B1860,\"\")","v":""},{"$f":"IF('Clearing Calculations'!B1860,'Clearing Calculations'!C1860,\"\")","v":""},"","","",""]
[{"$f":"IF('Clearing Calculations'!A1861=\"\",\"\",'Clearing Calculations'!A1861)","v":""},{"$f":"IF('Clearing Calculations'!A1861,'Clearing Calculations'!B1861,\"\")","v":""},{"$f":"IF('Clearing Calculations'!B1861,'Clearing Calculations'!C1861,\"\")","v":""},"","","",""]
[{"$f":"IF('Clearing Calculations'!A1862=\"\",\"\",'Clearing Calculations'!A1862)","v":""},{"$f":"IF('Clearing Calculations'!A1862,'Clearing Calculations'!B1862,\"\")","v":""},{"$f":"IF('Clearing Calculations'!B1862,'Clearing Calculations'!C1862,\"\")","v":""},"","","",""]
[{"$f":"IF('Clearing Calculations'!A1863=\"\",\"\",'Clearing Calculations'!A1863)","v":""},{"$f":"IF('Clearing Calculations'!A1863,'Clearing Calculations'!B1863,\"\")","v":""},{"$f":"IF('Clearing Calculations'!B1863,'Clearing Calculations'!C1863,\"\")","v":""},"","","",""]
[{"$f":"IF('Clearing Calculations'!A1864=\"\",\"\",'Clearing Calculations'!A1864)","v":""},{"$f":"IF('Clearing Calculations'!A1864,'Clearing Calculations'!B1864,\"\")","v":""},{"$f":"IF('Clearing Calculations'!B1864,'Clearing Calculations'!C1864,\"\")","v":""},"","","",""]
[{"$f":"IF('Clearing Calculations'!A1865=\"\",\"\",'Clearing Calculations'!A1865)","v":""},{"$f":"IF('Clearing Calculations'!A1865,'Clearing Calculations'!B1865,\"\")","v":""},{"$f":"IF('Clearing Calculations'!B1865,'Clearing Calculations'!C1865,\"\")","v":""},"","","",""]
[{"$f":"IF('Clearing Calculations'!A1866=\"\",\"\",'Clearing Calculations'!A1866)","v":""},{"$f":"IF('Clearing Calculations'!A1866,'Clearing Calculations'!B1866,\"\")","v":""},{"$f":"IF('Clearing Calculations'!B1866,'Clearing Calculations'!C1866,\"\")","v":""},"","","",""]
[{"$f":"IF('Clearing Calculations'!A1867=\"\",\"\",'Clearing Calculations'!A1867)","v":""},{"$f":"IF('Clearing Calculations'!A1867,'Clearing Calculations'!B1867,\"\")","v":""},{"$f":"IF('Clearing Calculations'!B1867,'Clearing Calculations'!C1867,\"\")","v":""},"","","",""]
[{"$f":"IF('Clearing Calculations'!A1868=\"\",\"\",'Clearing Calculations'!A1868)","v":""},{"$f":"IF('Clearing Calculations'!A1868,'Clearing Calculations'!B1868,\"\")","v":""},{"$f":"IF('Clearing Calculations'!B1868,'Clearing Calculations'!C1868,\"\")","v":""},"","","",""]
[{"$f":"IF('Clearing Calculations'!A1869=\"\",\"\",'Clearing Calculations'!A1869)","v":""},{"$f":"IF('Clearing Calculations'!A1869,'Clearing Calculations'!B1869,\"\")","v":""},{"$f":"IF('Clearing Calculations'!B1869,'Clearing Calculations'!C1869,\"\")","v":""},"","","",""]
[{"$f":"IF('Clearing Calculations'!A1870=\"\",\"\",'Clearing Calculations'!A1870)","v":""},{"$f":"IF('Clearing Calculations'!A1870,'Clearing Calculations'!B1870,\"\")","v":""},{"$f":"IF('Clearing Calculations'!B1870,'Clearing Calculations'!C1870,\"\")","v":""},"","","",""]
[{"$f":"IF('Clearing Calculations'!A1871=\"\",\"\",'Clearing Calculations'!A1871)","v":""},{"$f":"IF('Clearing Calculations'!A1871,'Clearing Calculations'!B1871,\"\")","v":""},{"$f":"IF('Clearing Calculations'!B1871,'Clearing Calculations'!C1871,\"\")","v":""},"","","",""]
[{"$f":"IF('Clearing Calculations'!A1872=\"\",\"\",'Clearing Calculations'!A1872)","v":""},{"$f":"IF('Clearing Calculations'!A1872,'Clearing Calculations'!B1872,\"\")","v":""},{"$f":"IF('Clearing Calculations'!B1872,'Clearing Calculations'!C1872,\"\")","v":""},"","","",""]
[{"$f":"IF('Clearing Calculations'!A1873=\"\",\"\",'Clearing Calculations'!A1873)","v":""},{"$f":"IF('Clearing Calculations'!A1873,'Clearing Calculations'!B1873,\"\")","v":""},{"$f":"IF('Clearing Calculations'!B1873,'Clearing Calculations'!C1873,\"\")","v":""},"","","",""]
[{"$f":"IF('Clearing Calculations'!A1874=\"\",\"\",'Clearing Calculations'!A1874)","v":""},{"$f":"IF('Clearing Calculations'!A1874,'Clearing Calculations'!B1874,\"\")","v":""},{"$f":"IF('Clearing Calculations'!B1874,'Clearing Calculations'!C1874,\"\")","v":""},"","","",""]
[{"$f":"IF('Clearing Calculations'!A1875=\"\",\"\",'Clearing Calculations'!A1875)","v":""},{"$f":"IF('Clearing Calculations'!A1875,'Clearing Calculations'!B1875,\"\")","v":""},{"$f":"IF('Clearing Calculations'!B1875,'Clearing Calculations'!C1875,\"\")","v":""},"","","",""]
[{"$f":"IF('Clearing Calculations'!A1876=\"\",\"\",'Clearing Calculations'!A1876)","v":""},{"$f":"IF('Clearing Calculations'!A1876,'Clearing Calculations'!B1876,\"\")","v":""},{"$f":"IF('Clearing Calculations'!B1876,'Clearing Calculations'!C1876,\"\")","v":""},"","","",""]
[{"$f":"IF('Clearing Calculations'!A1877=\"\",\"\",'Clearing Calculations'!A1877)","v":""},{"$f":"IF('Clearing Calculations'!A1877,'Clearing Calculations'!B1877,\"\")","v":""},{"$f":"IF('Clearing Calculations'!B1877,'Clearing Calculations'!C1877,\"\")","v":""},"","","",""]
[{"$f":"IF('Clearing Calculations'!A1878=\"\",\"\",'Clearing Calculations'!A1878)","v":""},{"$f":"IF('Clearing Calculations'!A1878,'Clearing Calculations'!B1878,\"\")","v":""},{"$f":"IF('Clearing Calculations'!B1878,'Clearing Calculations'!C1878,\"\")","v":""},"","","",""]
[{"$f":"IF('Clearing Calculations'!A1879=\"\",\"\",'Clearing Calculations'!A1879)","v":""},{"$f":"IF('Clearing Calculations'!A1879,'Clearing Calculations'!B1879,\"\")","v":""},{"$f":"IF('Clearing Calculations'!B1879,'Clearing Calculations'!C1879,\"\")","v":""},"","","",""]
[{"$f":"IF('Clearing Calculations'!A1880=\"\",\"\",'Clearing Calculations'!A1880)","v":""},{"$f":"IF('Clearing Calculations'!A1880,'Clearing Calculations'!B1880,\"\")","v":""},{"$f":"IF('Clearing Calculations'!B1880,'Clearing Calculations'!C1880,\"\")","v":""},"","","",""]
[{"$f":"IF('Clearing Calculations'!A1881=\"\",\"\",'Clearing Calculations'!A1881)","v":""},{"$f":"IF('Clearing Calculations'!A1881,'Clearing Calculations'!B1881,\"\")","v":""},{"$f":"IF('Clearing Calculations'!B1881,'Clearing Calculations'!C1881,\"\")","v":""},"","","",""]
[{"$f":"IF('Clearing Calculations'!A1882=\"\",\"\",'Clearing Calculations'!A1882)","v":""},{"$f":"IF('Clearing Calculations'!A1882,'Clearing Calculations'!B1882,\"\")","v":""},{"$f":"IF('Clearing Calculations'!B1882,'Clearing Calculations'!C1882,\"\")","v":""},"","","",""]
[{"$f":"IF('Clearing Calculations'!A1883=\"\",\"\",'Clearing Calculations'!A1883)","v":""},{"$f":"IF('Clearing Calculations'!A1883,'Clearing Calculations'!B1883,\"\")","v":""},{"$f":"IF('Clearing Calculations'!B1883,'Clearing Calculations'!C1883,\"\")","v":""},"","","",""]
[{"$f":"IF('Clearing Calculations'!A1884=\"\",\"\",'Clearing Calculations'!A1884)","v":""},{"$f":"IF('Clearing Calculations'!A1884,'Clearing Calculations'!B1884,\"\")","v":""},{"$f":"IF('Clearing Calculations'!B1884,'Clearing Calculations'!C1884,\"\")","v":""},"","","",""]
[{"$f":"IF('Clearing Calculations'!A1885=\"\",\"\",'Clearing Calculations'!A1885)","v":""},{"$f":"IF('Clearing Calculations'!A1885,'Clearing Calculations'!B1885,\"\")","v":""},{"$f":"IF('Clearing Calculations'!B1885,'Clearing Calculations'!C1885,\"\")","v":""},"","","",""]
[{"$f":"IF('Clearing Calculations'!A1886=\"\",\"\",'Clearing Calculations'!A1886)","v":""},{"$f":"IF('Clearing Calculations'!A1886,'Clearing Calculations'!B1886,\"\")","v":""},{"$f":"IF('Clearing Calculations'!B1886,'Clearing Calculations'!C1886,\"\")","v":""},"","","",""]
[{"$f":"IF('Clearing Calculations'!A1887=\"\",\"\",'Clearing Calculations'!A1887)","v":""},{"$f":"IF('Clearing Calculations'!A1887,'Clearing Calculations'!B1887,\"\")","v":""},{"$f":"IF('Clearing Calculations'!B1887,'Clearing Calculations'!C1887,\"\")","v":""},"","","",""]
[{"$f":"IF('Clearing Calculations'!A1888=\"\",\"\",'Clearing Calculations'!A1888)","v":""},{"$f":"IF('Clearing Calculations'!A1888,'Clearing Calculations'!B1888,\"\")","v":""},{"$f":"IF('Clearing Calculations'!B1888,'Clearing Calculations'!C1888,\"\")","v":""},"","","",""]
[{"$f":"IF('Clearing Calculations'!A1889=\"\",\"\",'Clearing Calculations'!A1889)","v":""},{"$f":"IF('Clearing Calculations'!A1889,'Clearing Calculations'!B1889,\"\")","v":""},{"$f":"IF('Clearing Calculations'!B1889,'Clearing Calculations'!C1889,\"\")","v":""},"","","",""]
[{"$f":"IF('Clearing Calculations'!A1890=\"\",\"\",'Clearing Calculations'!A1890)","v":""},{"$f":"IF('Clearing Calculations'!A1890,'Clearing Calculations'!B1890,\"\")","v":""},{"$f":"IF('Clearing Calculations'!B1890,'Clearing Calculations'!C1890,\"\")","v":""},"","","",""]
[{"$f":"IF('Clearing Calculations'!A1891=\"\",\"\",'Clearing Calculations'!A1891)","v":""},{"$f":"IF('Clearing Calculations'!A1891,'Clearing Calculations'!B1891,\"\")","v":""},{"$f":"IF('Clearing Calculations'!B1891,'Clearing Calculations'!C1891,\"\")","v":""},"","","",""]
[{"$f":"IF('Clearing Calculations'!A1892=\"\",\"\",'Clearing Calculations'!A1892)","v":""},{"$f":"IF('Clearing Calculations'!A1892,'Clearing Calculations'!B1892,\"\")","v":""},{"$f":"IF('Clearing Calculations'!B1892,'Clearing Calculations'!C1892,\"\")","v":""},"","","",""]
[{"$f":"IF('Clearing Calculations'!A1893=\"\",\"\",'Clearing Calculations'!A1893)","v":""},{"$f":"IF('Clearing Calculations'!A1893,'Clearing Calculations'!B1893,\"\")","v":""},{"$f":"IF('Clearing Calculations'!B1893,'Clearing Calculations'!C1893,\"\")","v":""},"","","",""]
[{"$f":"IF('Clearing Calculations'!A1894=\"\",\"\",'Clearing Calculations'!A1894)","v":""},{"$f":"IF('Clearing Calculations'!A1894,'Clearing Calculations'!B1894,\"\")","v":""},{"$f":"IF('Clearing Calculations'!B1894,'Clearing Calculations'!C1894,\"\")","v":""},"","","",""]
[{"$f":"IF('Clearing Calculations'!A1895=\"\",\"\",'Clearing Calculations'!A1895)","v":""},{"$f":"IF('Clearing Calculations'!A1895,'Clearing Calculations'!B1895,\"\")","v":""},{"$f":"IF('Clearing Calculations'!B1895,'Clearing Calculations'!C1895,\"\")","v":""},"","","",""]
[{"$f":"IF('Clearing Calculations'!A1896=\"\",\"\",'Clearing Calculations'!A1896)","v":""},{"$f":"IF('Clearing Calculations'!A1896,'Clearing Calculations'!B1896,\"\")","v":""},{"$f":"IF('Clearing Calculations'!B1896,'Clearing Calculations'!C1896,\"\")","v":""},"","","",""]
[{"$f":"IF('Clearing Calculations'!A1897=\"\",\"\",'Clearing Calculations'!A1897)","v":""},{"$f":"IF('Clearing Calculations'!A1897,'Clearing Calculations'!B1897,\"\")","v":""},{"$f":"IF('Clearing Calculations'!B1897,'Clearing Calculations'!C1897,\"\")","v":""},"","","",""]
[{"$f":"IF('Clearing Calculations'!A1898=\"\",\"\",'Clearing Calculations'!A1898)","v":""},{"$f":"IF('Clearing Calculations'!A1898,'Clearing Calculations'!B1898,\"\")","v":""},{"$f":"IF('Clearing Calculations'!B1898,'Clearing Calculations'!C1898,\"\")","v":""},"","","",""]
[{"$f":"IF('Clearing Calculations'!A1899=\"\",\"\",'Clearing Calculations'!A1899)","v":""},{"$f":"IF('Clearing Calculations'!A1899,'Clearing Calculations'!B1899,\"\")","v":""},{"$f":"IF('Clearing Calculations'!B1899,'Clearing Calculations'!C1899,\"\")","v":""},"","","",""]
[{"$f":"IF('Clearing Calculations'!A1900=\"\",\"\",'Clearing Calculations'!A1900)","v":""},{"$f":"IF('Clearing Calculations'!A1900,'Clearing Calculations'!B1900,\"\")","v":""},{"$f":"IF('Clearing Calculations'!B1900,'Clearing Calculations'!C1900,\"\")","v":""},{"$f":"IF(A1906=\"\",\"\",$B1906+$C1906)","v":""},{"$f":"IF(A1906=\"\",\"\",(D1906+D1905)/2*(A1906-A1905))","v":""},{"$f":"IF(A1906=\"\",\"\",(E1906/9))","v":""},{"$f":"IF(A1906=\"\",\"\",E1906/$G$3)","v":""}]
[{"$f":"IF('Clearing Calculations'!A1901=\"\",\"\",'Clearing Calculations'!A1901)","v":""},{"$f":"IF('Clearing Calculations'!A1901,'Clearing Calculations'!B1901,\"\")","v":""},{"$f":"IF('Clearing Calculations'!B1901,'Clearing Calculations'!C1901,\"\")","v":""},"","","",""]
[{"$f":"IF('Clearing Calculations'!A1902=\"\",\"\",'Clearing Calculations'!A1902)","v":""},{"$f":"IF('Clearing Calculations'!A1902,'Clearing Calculations'!B1902,\"\")","v":""},{"$f":"IF('Clearing Calculations'!B1902,'Clearing Calculations'!C1902,\"\")","v":""},"","","",""]
[{"$f":"IF('Clearing Calculations'!A1903=\"\",\"\",'Clearing Calculations'!A1903)","v":""},{"$f":"IF('Clearing Calculations'!A1903,'Clearing Calculations'!B1903,\"\")","v":""},{"$f":"IF('Clearing Calculations'!B1903,'Clearing Calculations'!C1903,\"\")","v":""},"","","",""]
[{"$f":"IF('Clearing Calculations'!A1904=\"\",\"\",'Clearing Calculations'!A1904)","v":""},{"$f":"IF('Clearing Calculations'!A1904,'Clearing Calculations'!B1904,\"\")","v":""},{"$f":"IF('Clearing Calculations'!B1904,'Clearing Calculations'!C1904,\"\")","v":""},"","","",""]
[{"$f":"IF('Clearing Calculations'!A1905=\"\",\"\",'Clearing Calculations'!A1905)","v":""},{"$f":"IF('Clearing Calculations'!A1905,'Clearing Calculations'!B1905,\"\")","v":""},{"$f":"IF('Clearing Calculations'!B1905,'Clearing Calculations'!C1905,\"\")","v":""},"","","",""]
[{"$f":"IF('Clearing Calculations'!A1906=\"\",\"\",'Clearing Calculations'!A1906)","v":""},{"$f":"IF('Clearing Calculations'!A1906,'Clearing Calculations'!B1906,\"\")","v":""},{"$f":"IF('Clearing Calculations'!B1906,'Clearing Calculations'!C1906,\"\")","v":""},"","","",""]
[{"$f":"IF('Clearing Calculations'!A1907=\"\",\"\",'Clearing Calculations'!A1907)","v":""},{"$f":"IF('Clearing Calculations'!A1907,'Clearing Calculations'!B1907,\"\")","v":""},{"$f":"IF('Clearing Calculations'!B1907,'Clearing Calculations'!C1907,\"\")","v":""},"","","",""]
[{"$f":"IF('Clearing Calculations'!A1908=\"\",\"\",'Clearing Calculations'!A1908)","v":""},{"$f":"IF('Clearing Calculations'!A1908,'Clearing Calculations'!B1908,\"\")","v":""},{"$f":"IF('Clearing Calculations'!B1908,'Clearing Calculations'!C1908,\"\")","v":""},"","","",""]
[{"$f":"IF('Clearing Calculations'!A1909=\"\",\"\",'Clearing Calculations'!A1909)","v":""},{"$f":"IF('Clearing Calculations'!A1909,'Clearing Calculations'!B1909,\"\")","v":""},{"$f":"IF('Clearing Calculations'!B1909,'Clearing Calculations'!C1909,\"\")","v":""},"","","",""]
[{"$f":"IF('Clearing Calculations'!A1910=\"\",\"\",'Clearing Calculations'!A1910)","v":""},{"$f":"IF('Clearing Calculations'!A1910,'Clearing Calculations'!B1910,\"\")","v":""},{"$f":"IF('Clearing Calculations'!B1910,'Clearing Calculations'!C1910,\"\")","v":""},"","","",""]
[{"$f":"IF('Clearing Calculations'!A1911=\"\",\"\",'Clearing Calculations'!A1911)","v":""},{"$f":"IF('Clearing Calculations'!A1911,'Clearing Calculations'!B1911,\"\")","v":""},{"$f":"IF('Clearing Calculations'!B1911,'Clearing Calculations'!C1911,\"\")","v":""},"","","",""]
[{"$f":"IF('Clearing Calculations'!A1912=\"\",\"\",'Clearing Calculations'!A1912)","v":""},{"$f":"IF('Clearing Calculations'!A1912,'Clearing Calculations'!B1912,\"\")","v":""},{"$f":"IF('Clearing Calculations'!B1912,'Clearing Calculations'!C1912,\"\")","v":""},"","","",""]
[{"$f":"IF('Clearing Calculations'!A1913=\"\",\"\",'Clearing Calculations'!A1913)","v":""},{"$f":"IF('Clearing Calculations'!A1913,'Clearing Calculations'!B1913,\"\")","v":""},{"$f":"IF('Clearing Calculations'!B1913,'Clearing Calculations'!C1913,\"\")","v":""},"","","",""]
[{"$f":"IF('Clearing Calculations'!A1914=\"\",\"\",'Clearing Calculations'!A1914)","v":""},{"$f":"IF('Clearing Calculations'!A1914,'Clearing Calculations'!B1914,\"\")","v":""},{"$f":"IF('Clearing Calculations'!B1914,'Clearing Calculations'!C1914,\"\")","v":""},"","","",""]
[{"$f":"IF('Clearing Calculations'!A1915=\"\",\"\",'Clearing Calculations'!A1915)","v":""},{"$f":"IF('Clearing Calculations'!A1915,'Clearing Calculations'!B1915,\"\")","v":""},{"$f":"IF('Clearing Calculations'!B1915,'Clearing Calculations'!C1915,\"\")","v":""},"","","",""]
[{"$f":"IF('Clearing Calculations'!A1916=\"\",\"\",'Clearing Calculations'!A1916)","v":""},{"$f":"IF('Clearing Calculations'!A1916,'Clearing Calculations'!B1916,\"\")","v":""},{"$f":"IF('Clearing Calculations'!B1916,'Clearing Calculations'!C1916,\"\")","v":""},"","","",""]
[{"$f":"IF('Clearing Calculations'!A1917=\"\",\"\",'Clearing Calculations'!A1917)","v":""},{"$f":"IF('Clearing Calculations'!A1917,'Clearing Calculations'!B1917,\"\")","v":""},{"$f":"IF('Clearing Calculations'!B1917,'Clearing Calculations'!C1917,\"\")","v":""},"","","",""]
[{"$f":"IF('Clearing Calculations'!A1918=\"\",\"\",'Clearing Calculations'!A1918)","v":""},{"$f":"IF('Clearing Calculations'!A1918,'Clearing Calculations'!B1918,\"\")","v":""},{"$f":"IF('Clearing Calculations'!B1918,'Clearing Calculations'!C1918,\"\")","v":""},"","","",""]
[{"$f":"IF('Clearing Calculations'!A1919=\"\",\"\",'Clearing Calculations'!A1919)","v":""},{"$f":"IF('Clearing Calculations'!A1919,'Clearing Calculations'!B1919,\"\")","v":""},{"$f":"IF('Clearing Calculations'!B1919,'Clearing Calculations'!C1919,\"\")","v":""},"","","",""]
[{"$f":"IF('Clearing Calculations'!A1920=\"\",\"\",'Clearing Calculations'!A1920)","v":""},{"$f":"IF('Clearing Calculations'!A1920,'Clearing Calculations'!B1920,\"\")","v":""},{"$f":"IF('Clearing Calculations'!B1920,'Clearing Calculations'!C1920,\"\")","v":""},"","","",""]
[{"$f":"IF('Clearing Calculations'!A1921=\"\",\"\",'Clearing Calculations'!A1921)","v":""},{"$f":"IF('Clearing Calculations'!A1921,'Clearing Calculations'!B1921,\"\")","v":""},{"$f":"IF('Clearing Calculations'!B1921,'Clearing Calculations'!C1921,\"\")","v":""},"","","",""]
[{"$f":"IF('Clearing Calculations'!A1922=\"\",\"\",'Clearing Calculations'!A1922)","v":""},{"$f":"IF('Clearing Calculations'!A1922,'Clearing Calculations'!B1922,\"\")","v":""},{"$f":"IF('Clearing Calculations'!B1922,'Clearing Calculations'!C1922,\"\")","v":""},"","","",""]
[{"$f":"IF('Clearing Calculations'!A1923=\"\",\"\",'Clearing Calculations'!A1923)","v":""},{"$f":"IF('Clearing Calculations'!A1923,'Clearing Calculations'!B1923,\"\")","v":""},{"$f":"IF('Clearing Calculations'!B1923,'Clearing Calculations'!C1923,\"\")","v":""},"","","",""]
[{"$f":"IF('Clearing Calculations'!A1924=\"\",\"\",'Clearing Calculations'!A1924)","v":""},{"$f":"IF('Clearing Calculations'!A1924,'Clearing Calculations'!B1924,\"\")","v":""},{"$f":"IF('Clearing Calculations'!B1924,'Clearing Calculations'!C1924,\"\")","v":""},"","","",""]
[{"$f":"IF('Clearing Calculations'!A1925=\"\",\"\",'Clearing Calculations'!A1925)","v":""},{"$f":"IF('Clearing Calculations'!A1925,'Clearing Calculations'!B1925,\"\")","v":""},{"$f":"IF('Clearing Calculations'!B1925,'Clearing Calculations'!C1925,\"\")","v":""},"","","",""]
[{"$f":"IF('Clearing Calculations'!A1926=\"\",\"\",'Clearing Calculations'!A1926)","v":""},{"$f":"IF('Clearing Calculations'!A1926,'Clearing Calculations'!B1926,\"\")","v":""},{"$f":"IF('Clearing Calculations'!B1926,'Clearing Calculations'!C1926,\"\")","v":""},"","","",""]
[{"$f":"IF('Clearing Calculations'!A1927=\"\",\"\",'Clearing Calculations'!A1927)","v":""},{"$f":"IF('Clearing Calculations'!A1927,'Clearing Calculations'!B1927,\"\")","v":""},{"$f":"IF('Clearing Calculations'!B1927,'Clearing Calculations'!C1927,\"\")","v":""},"","","",""]
[{"$f":"IF('Clearing Calculations'!A1928=\"\",\"\",'Clearing Calculations'!A1928)","v":""},{"$f":"IF('Clearing Calculations'!A1928,'Clearing Calculations'!B1928,\"\")","v":""},{"$f":"IF('Clearing Calculations'!B1928,'Clearing Calculations'!C1928,\"\")","v":""},"","","",""]
[{"$f":"IF('Clearing Calculations'!A1929=\"\",\"\",'Clearing Calculations'!A1929)","v":""},{"$f":"IF('Clearing Calculations'!A1929,'Clearing Calculations'!B1929,\"\")","v":""},{"$f":"IF('Clearing Calculations'!B1929,'Clearing Calculations'!C1929,\"\")","v":""},"","","",""]
[{"$f":"IF('Clearing Calculations'!A1930=\"\",\"\",'Clearing Calculations'!A1930)","v":""},{"$f":"IF('Clearing Calculations'!A1930,'Clearing Calculations'!B1930,\"\")","v":""},{"$f":"IF('Clearing Calculations'!B1930,'Clearing Calculations'!C1930,\"\")","v":""},"","","",""]
[{"$f":"IF('Clearing Calculations'!A1931=\"\",\"\",'Clearing Calculations'!A1931)","v":""},{"$f":"IF('Clearing Calculations'!A1931,'Clearing Calculations'!B1931,\"\")","v":""},{"$f":"IF('Clearing Calculations'!B1931,'Clearing Calculations'!C1931,\"\")","v":""},"","","",""]
[{"$f":"IF('Clearing Calculations'!A1932=\"\",\"\",'Clearing Calculations'!A1932)","v":""},{"$f":"IF('Clearing Calculations'!A1932,'Clearing Calculations'!B1932,\"\")","v":""},{"$f":"IF('Clearing Calculations'!B1932,'Clearing Calculations'!C1932,\"\")","v":""},"","","",""]
[{"$f":"IF('Clearing Calculations'!A1933=\"\",\"\",'Clearing Calculations'!A1933)","v":""},{"$f":"IF('Clearing Calculations'!A1933,'Clearing Calculations'!B1933,\"\")","v":""},{"$f":"IF('Clearing Calculations'!B1933,'Clearing Calculations'!C1933,\"\")","v":""},"","","",""]
[{"$f":"IF('Clearing Calculations'!A1934=\"\",\"\",'Clearing Calculations'!A1934)","v":""},{"$f":"IF('Clearing Calculations'!A1934,'Clearing Calculations'!B1934,\"\")","v":""},{"$f":"IF('Clearing Calculations'!B1934,'Clearing Calculations'!C1934,\"\")","v":""},"","","",""]
[{"$f":"IF('Clearing Calculations'!A1935=\"\",\"\",'Clearing Calculations'!A1935)","v":""},{"$f":"IF('Clearing Calculations'!A1935,'Clearing Calculations'!B1935,\"\")","v":""},{"$f":"IF('Clearing Calculations'!B1935,'Clearing Calculations'!C1935,\"\")","v":""},"","","",""]
[{"$f":"IF('Clearing Calculations'!A1936=\"\",\"\",'Clearing Calculations'!A1936)","v":""},{"$f":"IF('Clearing Calculations'!A1936,'Clearing Calculations'!B1936,\"\")","v":""},{"$f":"IF('Clearing Calculations'!B1936,'Clearing Calculations'!C1936,\"\")","v":""},"","","",""]
[{"$f":"IF('Clearing Calculations'!A1937=\"\",\"\",'Clearing Calculations'!A1937)","v":""},{"$f":"IF('Clearing Calculations'!A1937,'Clearing Calculations'!B1937,\"\")","v":""},{"$f":"IF('Clearing Calculations'!B1937,'Clearing Calculations'!C1937,\"\")","v":""},"","","",""]
[{"$f":"IF('Clearing Calculations'!A1938=\"\",\"\",'Clearing Calculations'!A1938)","v":""},{"$f":"IF('Clearing Calculations'!A1938,'Clearing Calculations'!B1938,\"\")","v":""},{"$f":"IF('Clearing Calculations'!B1938,'Clearing Calculations'!C1938,\"\")","v":""},"","","",""]
[{"$f":"IF('Clearing Calculations'!A1939=\"\",\"\",'Clearing Calculations'!A1939)","v":""},{"$f":"IF('Clearing Calculations'!A1939,'Clearing Calculations'!B1939,\"\")","v":""},{"$f":"IF('Clearing Calculations'!B1939,'Clearing Calculations'!C1939,\"\")","v":""},"","","",""]
[{"$f":"IF('Clearing Calculations'!A1940=\"\",\"\",'Clearing Calculations'!A1940)","v":""},{"$f":"IF('Clearing Calculations'!A1940,'Clearing Calculations'!B1940,\"\")","v":""},{"$f":"IF('Clearing Calculations'!B1940,'Clearing Calculations'!C1940,\"\")","v":""},"","","",""]
[{"$f":"IF('Clearing Calculations'!A1941=\"\",\"\",'Clearing Calculations'!A1941)","v":""},{"$f":"IF('Clearing Calculations'!A1941,'Clearing Calculations'!B1941,\"\")","v":""},{"$f":"IF('Clearing Calculations'!B1941,'Clearing Calculations'!C1941,\"\")","v":""},"","","",""]
[{"$f":"IF('Clearing Calculations'!A1942=\"\",\"\",'Clearing Calculations'!A1942)","v":""},{"$f":"IF('Clearing Calculations'!A1942,'Clearing Calculations'!B1942,\"\")","v":""},{"$f":"IF('Clearing Calculations'!B1942,'Clearing Calculations'!C1942,\"\")","v":""},"","","",""]
[{"$f":"IF('Clearing Calculations'!A1943=\"\",\"\",'Clearing Calculations'!A1943)","v":""},{"$f":"IF('Clearing Calculations'!A1943,'Clearing Calculations'!B1943,\"\")","v":""},{"$f":"IF('Clearing Calculations'!B1943,'Clearing Calculations'!C1943,\"\")","v":""},"","","",""]
[{"$f":"IF('Clearing Calculations'!A1944=\"\",\"\",'Clearing Calculations'!A1944)","v":""},{"$f":"IF('Clearing Calculations'!A1944,'Clearing Calculations'!B1944,\"\")","v":""},{"$f":"IF('Clearing Calculations'!B1944,'Clearing Calculations'!C1944,\"\")","v":""},"","","",""]
[{"$f":"IF('Clearing Calculations'!A1945=\"\",\"\",'Clearing Calculations'!A1945)","v":""},{"$f":"IF('Clearing Calculations'!A1945,'Clearing Calculations'!B1945,\"\")","v":""},{"$f":"IF('Clearing Calculations'!B1945,'Clearing Calculations'!C1945,\"\")","v":""},"","","",""]
[{"$f":"IF('Clearing Calculations'!A1946=\"\",\"\",'Clearing Calculations'!A1946)","v":""},{"$f":"IF('Clearing Calculations'!A1946,'Clearing Calculations'!B1946,\"\")","v":""},{"$f":"IF('Clearing Calculations'!B1946,'Clearing Calculations'!C1946,\"\")","v":""},"","","",""]
[{"$f":"IF('Clearing Calculations'!A1947=\"\",\"\",'Clearing Calculations'!A1947)","v":""},{"$f":"IF('Clearing Calculations'!A1947,'Clearing Calculations'!B1947,\"\")","v":""},{"$f":"IF('Clearing Calculations'!B1947,'Clearing Calculations'!C1947,\"\")","v":""},"","","",""]
[{"$f":"IF('Clearing Calculations'!A1948=\"\",\"\",'Clearing Calculations'!A1948)","v":""},{"$f":"IF('Clearing Calculations'!A1948,'Clearing Calculations'!B1948,\"\")","v":""},{"$f":"IF('Clearing Calculations'!B1948,'Clearing Calculations'!C1948,\"\")","v":""},"","","",""]
[{"$f":"IF('Clearing Calculations'!A1949=\"\",\"\",'Clearing Calculations'!A1949)","v":""},{"$f":"IF('Clearing Calculations'!A1949,'Clearing Calculations'!B1949,\"\")","v":""},{"$f":"IF('Clearing Calculations'!B1949,'Clearing Calculations'!C1949,\"\")","v":""},"","","",""]
[{"$f":"IF('Clearing Calculations'!A1950=\"\",\"\",'Clearing Calculations'!A1950)","v":""},{"$f":"IF('Clearing Calculations'!A1950,'Clearing Calculations'!B1950,\"\")","v":""},{"$f":"IF('Clearing Calculations'!B1950,'Clearing Calculations'!C1950,\"\")","v":""},"","","",""]
[{"$f":"IF('Clearing Calculations'!A1951=\"\",\"\",'Clearing Calculations'!A1951)","v":""},{"$f":"IF('Clearing Calculations'!A1951,'Clearing Calculations'!B1951,\"\")","v":""},{"$f":"IF('Clearing Calculations'!B1951,'Clearing Calculations'!C1951,\"\")","v":""},"","","",""]
[{"$f":"IF('Clearing Calculations'!A1952=\"\",\"\",'Clearing Calculations'!A1952)","v":""},{"$f":"IF('Clearing Calculations'!A1952,'Clearing Calculations'!B1952,\"\")","v":""},{"$f":"IF('Clearing Calculations'!B1952,'Clearing Calculations'!C1952,\"\")","v":""},"","","",""]
[{"$f":"IF('Clearing Calculations'!A1953=\"\",\"\",'Clearing Calculations'!A1953)","v":""},{"$f":"IF('Clearing Calculations'!A1953,'Clearing Calculations'!B1953,\"\")","v":""},{"$f":"IF('Clearing Calculations'!B1953,'Clearing Calculations'!C1953,\"\")","v":""},"","","",""]
[{"$f":"IF('Clearing Calculations'!A1954=\"\",\"\",'Clearing Calculations'!A1954)","v":""},{"$f":"IF('Clearing Calculations'!A1954,'Clearing Calculations'!B1954,\"\")","v":""},{"$f":"IF('Clearing Calculations'!B1954,'Clearing Calculations'!C1954,\"\")","v":""},"","","",""]
[{"$f":"IF('Clearing Calculations'!A1955=\"\",\"\",'Clearing Calculations'!A1955)","v":""},{"$f":"IF('Clearing Calculations'!A1955,'Clearing Calculations'!B1955,\"\")","v":""},{"$f":"IF('Clearing Calculations'!B1955,'Clearing Calculations'!C1955,\"\")","v":""},"","","",""]
[{"$f":"IF('Clearing Calculations'!A1956=\"\",\"\",'Clearing Calculations'!A1956)","v":""},{"$f":"IF('Clearing Calculations'!A1956,'Clearing Calculations'!B1956,\"\")","v":""},{"$f":"IF('Clearing Calculations'!B1956,'Clearing Calculations'!C1956,\"\")","v":""},"","","",""]
[{"$f":"IF('Clearing Calculations'!A1957=\"\",\"\",'Clearing Calculations'!A1957)","v":""},{"$f":"IF('Clearing Calculations'!A1957,'Clearing Calculations'!B1957,\"\")","v":""},{"$f":"IF('Clearing Calculations'!B1957,'Clearing Calculations'!C1957,\"\")","v":""},"","","",""]
[{"$f":"IF('Clearing Calculations'!A1958=\"\",\"\",'Clearing Calculations'!A1958)","v":""},{"$f":"IF('Clearing Calculations'!A1958,'Clearing Calculations'!B1958,\"\")","v":""},{"$f":"IF('Clearing Calculations'!B1958,'Clearing Calculations'!C1958,\"\")","v":""},"","","",""]
[{"$f":"IF('Clearing Calculations'!A1959=\"\",\"\",'Clearing Calculations'!A1959)","v":""},{"$f":"IF('Clearing Calculations'!A1959,'Clearing Calculations'!B1959,\"\")","v":""},{"$f":"IF('Clearing Calculations'!B1959,'Clearing Calculations'!C1959,\"\")","v":""},"","","",""]
[{"$f":"IF('Clearing Calculations'!A1960=\"\",\"\",'Clearing Calculations'!A1960)","v":""},{"$f":"IF('Clearing Calculations'!A1960,'Clearing Calculations'!B1960,\"\")","v":""},{"$f":"IF('Clearing Calculations'!B1960,'Clearing Calculations'!C1960,\"\")","v":""},"","","",""]
[{"$f":"IF('Clearing Calculations'!A1961=\"\",\"\",'Clearing Calculations'!A1961)","v":""},{"$f":"IF('Clearing Calculations'!A1961,'Clearing Calculations'!B1961,\"\")","v":""},{"$f":"IF('Clearing Calculations'!B1961,'Clearing Calculations'!C1961,\"\")","v":""},"","","",""]
[{"$f":"IF('Clearing Calculations'!A1962=\"\",\"\",'Clearing Calculations'!A1962)","v":""},{"$f":"IF('Clearing Calculations'!A1962,'Clearing Calculations'!B1962,\"\")","v":""},{"$f":"IF('Clearing Calculations'!B1962,'Clearing Calculations'!C1962,\"\")","v":""},"","","",""]
[{"$f":"IF('Clearing Calculations'!A1963=\"\",\"\",'Clearing Calculations'!A1963)","v":""},{"$f":"IF('Clearing Calculations'!A1963,'Clearing Calculations'!B1963,\"\")","v":""},{"$f":"IF('Clearing Calculations'!B1963,'Clearing Calculations'!C1963,\"\")","v":""},"","","",""]
[{"$f":"IF('Clearing Calculations'!A1964=\"\",\"\",'Clearing Calculations'!A1964)","v":""},{"$f":"IF('Clearing Calculations'!A1964,'Clearing Calculations'!B1964,\"\")","v":""},{"$f":"IF('Clearing Calculations'!B1964,'Clearing Calculations'!C1964,\"\")","v":""},{"$f":"IF(A1970=\"\",\"\",$B1970+$C1970)","v":""},{"$f":"IF(A1970=\"\",\"\",(D1970+D1969)/2*(A1970-A1969))","v":""},{"$f":"IF(A1970=\"\",\"\",(E1970/9))","v":""},{"$f":"IF(A1970=\"\",\"\",E1970/$G$3)","v":""}]
[{"$f":"IF('Clearing Calculations'!A1965=\"\",\"\",'Clearing Calculations'!A1965)","v":""},{"$f":"IF('Clearing Calculations'!A1965,'Clearing Calculations'!B1965,\"\")","v":""},{"$f":"IF('Clearing Calculations'!B1965,'Clearing Calculations'!C1965,\"\")","v":""},"","","",""]
[{"$f":"IF('Clearing Calculations'!A1966=\"\",\"\",'Clearing Calculations'!A1966)","v":""},{"$f":"IF('Clearing Calculations'!A1966,'Clearing Calculations'!B1966,\"\")","v":""},{"$f":"IF('Clearing Calculations'!B1966,'Clearing Calculations'!C1966,\"\")","v":""},"","","",""]
[{"$f":"IF('Clearing Calculations'!A1967=\"\",\"\",'Clearing Calculations'!A1967)","v":""},{"$f":"IF('Clearing Calculations'!A1967,'Clearing Calculations'!B1967,\"\")","v":""},{"$f":"IF('Clearing Calculations'!B1967,'Clearing Calculations'!C1967,\"\")","v":""},"","","",""]
[{"$f":"IF('Clearing Calculations'!A1968=\"\",\"\",'Clearing Calculations'!A1968)","v":""},{"$f":"IF('Clearing Calculations'!A1968,'Clearing Calculations'!B1968,\"\")","v":""},{"$f":"IF('Clearing Calculations'!B1968,'Clearing Calculations'!C1968,\"\")","v":""},"","","",""]
[{"$f":"IF('Clearing Calculations'!A1969=\"\",\"\",'Clearing Calculations'!A1969)","v":""},{"$f":"IF('Clearing Calculations'!A1969,'Clearing Calculations'!B1969,\"\")","v":""},{"$f":"IF('Clearing Calculations'!B1969,'Clearing Calculations'!C1969,\"\")","v":""},"","","",""]
[{"$f":"IF('Clearing Calculations'!A1970=\"\",\"\",'Clearing Calculations'!A1970)","v":""},{"$f":"IF('Clearing Calculations'!A1970,'Clearing Calculations'!B1970,\"\")","v":""},{"$f":"IF('Clearing Calculations'!B1970,'Clearing Calculations'!C1970,\"\")","v":""},"","","",""]
[{"$f":"IF('Clearing Calculations'!A1971=\"\",\"\",'Clearing Calculations'!A1971)","v":""},{"$f":"IF('Clearing Calculations'!A1971,'Clearing Calculations'!B1971,\"\")","v":""},{"$f":"IF('Clearing Calculations'!B1971,'Clearing Calculations'!C1971,\"\")","v":""},"","","",""]
[{"$f":"IF('Clearing Calculations'!A1972=\"\",\"\",'Clearing Calculations'!A1972)","v":""},{"$f":"IF('Clearing Calculations'!A1972,'Clearing Calculations'!B1972,\"\")","v":""},{"$f":"IF('Clearing Calculations'!B1972,'Clearing Calculations'!C1972,\"\")","v":""},"","","",""]
[{"$f":"IF('Clearing Calculations'!A1973=\"\",\"\",'Clearing Calculations'!A1973)","v":""},{"$f":"IF('Clearing Calculations'!A1973,'Clearing Calculations'!B1973,\"\")","v":""},{"$f":"IF('Clearing Calculations'!B1973,'Clearing Calculations'!C1973,\"\")","v":""},"","","",""]
[{"$f":"IF('Clearing Calculations'!A1974=\"\",\"\",'Clearing Calculations'!A1974)","v":""},{"$f":"IF('Clearing Calculations'!A1974,'Clearing Calculations'!B1974,\"\")","v":""},{"$f":"IF('Clearing Calculations'!B1974,'Clearing Calculations'!C1974,\"\")","v":""},"","","",""]
[{"$f":"IF('Clearing Calculations'!A1975=\"\",\"\",'Clearing Calculations'!A1975)","v":""},{"$f":"IF('Clearing Calculations'!A1975,'Clearing Calculations'!B1975,\"\")","v":""},{"$f":"IF('Clearing Calculations'!B1975,'Clearing Calculations'!C1975,\"\")","v":""},"","","",""]
[{"$f":"IF('Clearing Calculations'!A1976=\"\",\"\",'Clearing Calculations'!A1976)","v":""},{"$f":"IF('Clearing Calculations'!A1976,'Clearing Calculations'!B1976,\"\")","v":""},{"$f":"IF('Clearing Calculations'!B1976,'Clearing Calculations'!C1976,\"\")","v":""},"","","",""]
[{"$f":"IF('Clearing Calculations'!A1977=\"\",\"\",'Clearing Calculations'!A1977)","v":""},{"$f":"IF('Clearing Calculations'!A1977,'Clearing Calculations'!B1977,\"\")","v":""},{"$f":"IF('Clearing Calculations'!B1977,'Clearing Calculations'!C1977,\"\")","v":""},"","","",""]
[{"$f":"IF('Clearing Calculations'!A1978=\"\",\"\",'Clearing Calculations'!A1978)","v":""},{"$f":"IF('Clearing Calculations'!A1978,'Clearing Calculations'!B1978,\"\")","v":""},{"$f":"IF('Clearing Calculations'!B1978,'Clearing Calculations'!C1978,\"\")","v":""},"","","",""]
[{"$f":"IF('Clearing Calculations'!A1979=\"\",\"\",'Clearing Calculations'!A1979)","v":""},{"$f":"IF('Clearing Calculations'!A1979,'Clearing Calculations'!B1979,\"\")","v":""},{"$f":"IF('Clearing Calculations'!B1979,'Clearing Calculations'!C1979,\"\")","v":""},"","","",""]
[{"$f":"IF('Clearing Calculations'!A1980=\"\",\"\",'Clearing Calculations'!A1980)","v":""},{"$f":"IF('Clearing Calculations'!A1980,'Clearing Calculations'!B1980,\"\")","v":""},{"$f":"IF('Clearing Calculations'!B1980,'Clearing Calculations'!C1980,\"\")","v":""},"","","",""]
[{"$f":"IF('Clearing Calculations'!A1981=\"\",\"\",'Clearing Calculations'!A1981)","v":""},{"$f":"IF('Clearing Calculations'!A1981,'Clearing Calculations'!B1981,\"\")","v":""},{"$f":"IF('Clearing Calculations'!B1981,'Clearing Calculations'!C1981,\"\")","v":""},"","","",""]
[{"$f":"IF('Clearing Calculations'!A1982=\"\",\"\",'Clearing Calculations'!A1982)","v":""},{"$f":"IF('Clearing Calculations'!A1982,'Clearing Calculations'!B1982,\"\")","v":""},{"$f":"IF('Clearing Calculations'!B1982,'Clearing Calculations'!C1982,\"\")","v":""},"","","",""]
[{"$f":"IF('Clearing Calculations'!A1983=\"\",\"\",'Clearing Calculations'!A1983)","v":""},{"$f":"IF('Clearing Calculations'!A1983,'Clearing Calculations'!B1983,\"\")","v":""},{"$f":"IF('Clearing Calculations'!B1983,'Clearing Calculations'!C1983,\"\")","v":""},"","","",""]
[{"$f":"IF('Clearing Calculations'!A1984=\"\",\"\",'Clearing Calculations'!A1984)","v":""},{"$f":"IF('Clearing Calculations'!A1984,'Clearing Calculations'!B1984,\"\")","v":""},{"$f":"IF('Clearing Calculations'!B1984,'Clearing Calculations'!C1984,\"\")","v":""},"","","",""]
[{"$f":"IF('Clearing Calculations'!A1985=\"\",\"\",'Clearing Calculations'!A1985)","v":""},{"$f":"IF('Clearing Calculations'!A1985,'Clearing Calculations'!B1985,\"\")","v":""},{"$f":"IF('Clearing Calculations'!B1985,'Clearing Calculations'!C1985,\"\")","v":""},"","","",""]
[{"$f":"IF('Clearing Calculations'!A1986=\"\",\"\",'Clearing Calculations'!A1986)","v":""},{"$f":"IF('Clearing Calculations'!A1986,'Clearing Calculations'!B1986,\"\")","v":""},{"$f":"IF('Clearing Calculations'!B1986,'Clearing Calculations'!C1986,\"\")","v":""},"","","",""]
[{"$f":"IF('Clearing Calculations'!A1987=\"\",\"\",'Clearing Calculations'!A1987)","v":""},{"$f":"IF('Clearing Calculations'!A1987,'Clearing Calculations'!B1987,\"\")","v":""},{"$f":"IF('Clearing Calculations'!B1987,'Clearing Calculations'!C1987,\"\")","v":""},"","","",""]
[{"$f":"IF('Clearing Calculations'!A1988=\"\",\"\",'Clearing Calculations'!A1988)","v":""},{"$f":"IF('Clearing Calculations'!A1988,'Clearing Calculations'!B1988,\"\")","v":""},{"$f":"IF('Clearing Calculations'!B1988,'Clearing Calculations'!C1988,\"\")","v":""},"","","",""]
[{"$f":"IF('Clearing Calculations'!A1989=\"\",\"\",'Clearing Calculations'!A1989)","v":""},{"$f":"IF('Clearing Calculations'!A1989,'Clearing Calculations'!B1989,\"\")","v":""},{"$f":"IF('Clearing Calculations'!B1989,'Clearing Calculations'!C1989,\"\")","v":""},"","","",""]
[{"$f":"IF('Clearing Calculations'!A1990=\"\",\"\",'Clearing Calculations'!A1990)","v":""},{"$f":"IF('Clearing Calculations'!A1990,'Clearing Calculations'!B1990,\"\")","v":""},{"$f":"IF('Clearing Calculations'!B1990,'Clearing Calculations'!C1990,\"\")","v":""},"","","",""]
[{"$f":"IF('Clearing Calculations'!A1991=\"\",\"\",'Clearing Calculations'!A1991)","v":""},{"$f":"IF('Clearing Calculations'!A1991,'Clearing Calculations'!B1991,\"\")","v":""},{"$f":"IF('Clearing Calculations'!B1991,'Clearing Calculations'!C1991,\"\")","v":""},"","","",""]
[{"$f":"IF('Clearing Calculations'!A1992=\"\",\"\",'Clearing Calculations'!A1992)","v":""},{"$f":"IF('Clearing Calculations'!A1992,'Clearing Calculations'!B1992,\"\")","v":""},{"$f":"IF('Clearing Calculations'!B1992,'Clearing Calculations'!C1992,\"\")","v":""},"","","",""]
["","",null,"","",null,""]
["","",null,"","",null,""]

{"sheet":"Seeding","index":5,"n_rows":240,"n_cols":16,"rows_kept":240,"cut":false,"hidden":false,"merged":[[0,9,5,9],[0,10,5,10],[3,2,3,3],[6,9,6,10],[7,9,7,10]]}
[null,null,null,null,"Pay Column","Pay Column",null,null,null,"<---Type Beginning Row Number","<---Automatic calculates except for last row"]
[null,null,null,null,null,43560]
["TOTALS",null,{"$f":"SUM(C8:C999999)","v":0},{"$f":"SUM(D8:D32)","v":0},{"$f":"SUM(E8:E32)","v":0},{"$f":"SUM(F8:F32)","v":0}]
[null,null,"Seeding",null,"Total","Total"]
[null,null,"Seeding in Cut\nSQFT","Seeding in Fill\nSQFT","SQFT","ACRE"]
["ORD Component Name",null,"XS_TC_Cut: ","XS_TC_Fill: ","Total Seeding","Total Seeding"]
["Enter Start of Project",{"$f":"IFERROR(INDEX('Manual Inputs'!M:M,SMALL(IF('Manual Inputs'!M:M<>\"\",ROW('Manual Inputs'!M:M)),ROW(2:2))),\"\")","v":0},null,null,null,null,null,null,null,"Rows from"]
[null,{"$f":"IFERROR(INDEX('Manual Inputs'!M:M,SMALL(IF('Manual Inputs'!M:M<>\"\",ROW('Manual Inputs'!M:M)),ROW(3:3))),\"\")","v":725},{"$f":"IF(B8=\"\",\"\",IFERROR(INDEX('Seeding_quantities report'!$F$2:$F$10003,SMALL(IF('Seeding_quantities report'!$A$2:$A$10003=C$6,ROW('Seeding_quantities report'!$A$2:$A$10003)-1,\"\"),ROWS($B$8:$B8))),\"0\"))","v":"0"},{"$f":"IF(B8=\"\",\"\",IFERROR(INDEX('Seeding_quantities report'!$F$2:$F$10003,SMALL(IF('Seeding_quantities report'!$A$2:$A$10003=D$6,ROW('Seeding_quantities report'!$A$2:$A$10003)-1,\"\"),ROWS($B$8:$B8))),\"0\"))","v":"0"},{"$f":"IF(B8=\"\",\"\",$C8+$D8)","v":0},{"$f":"IF(C8=\"\",\"\",($C8+$D8)/$F$2)","v":0},null,null,null,"Seeding",null,null,null,null,"ACRE","SQFT"]
[null,{"$f":"IFERROR(INDEX('Manual Inputs'!M:M,SMALL(IF('Manual Inputs'!M:M<>\"\",ROW('Manual Inputs'!M:M)),ROW(4:4))),\"\")","v":1450},{"$f":"IF(B9=\"\",\"\",IFERROR(INDEX('Seeding_quantities report'!$F$2:$F$10003,SMALL(IF('Seeding_quantities report'!$A$2:$A$10003=C$6,ROW('Seeding_quantities report'!$A$2:$A$10003)-1,\"\"),ROWS($B$8:$B9))),\"0\"))","v":"0"},{"$f":"IF(B9=\"\",\"\",IFERROR(INDEX('Seeding_quantities report'!$F$2:$F$10003,SMALL(IF('Seeding_quantities report'!$A$2:$A$10003=D$6,ROW('Seeding_quantities report'!$A$2:$A$10003)-1,\"\"),ROWS($B$8:$B9))),\"0\"))","v":"0"},{"$f":"IF(B9=\"\",\"\",$C9+$D9)","v":0},{"$f":"IF(C9=\"\",\"\",($C9+$D9)/$F$2)","v":0},null,null,null,null,null,"Station","to","Station","Clearing","Clearing"]
[null,{"$f":"IFERROR(INDEX('Manual Inputs'!M:M,SMALL(IF('Manual Inputs'!M:M<>\"\",ROW('Manual Inputs'!M:M)),ROW(5:5))),\"\")","v":""},{"$f":"IF(B10=\"\",\"\",IFERROR(INDEX('Seeding_quantities report'!$F$2:$F$10003,SMALL(IF('Seeding_quantities report'!$A$2:$A$10003=C$6,ROW('Seeding_quantities report'!$A$2:$A$10003)-1,\"\"),ROWS($B$8:$B10))),\"0\"))","v":""},{"$f":"IF(B10=\"\",\"\",IFERROR(INDEX('Seeding_quantities report'!$F$2:$F$10003,SMALL(IF('Seeding_quantities report'!$A$2:$A$10003=D$6,ROW('Seeding_quantities report'!$A$2:$A$10003)-1,\"\"),ROWS($B$8:$B10))),\"0\"))","v":""},"","",null,null,null,null,{"$f":"IF(J11=\"\",\"\",J11)","v":""},{"$f":"_xlfn.SINGLE(IF(J10=\"\",\"\",INDIRECT(CONCATENATE($J$8,\"!\",\"B\",J10))))","v":""},{"$f":"IF(J10=\"\",\"\",\"-\")","v":""},{"$f":"IF(J10=\"\",\"\",INDIRECT(CONCATENATE($J$8,\"!\",\"B\",K10)))","v":""},{"$f":"IF(L10=\"\",\"\",ROUND(SUM(INDIRECT(CONCATENATE($J$8,\"!\",\"F\",$K10))),2))","v":""},{"$f":"IF(L10=\"\",\"\",ROUND(SUM(INDIRECT(CONCATENATE($J$8,\"!\",\"E\",$K10))),0))","v":""}]
[null,{"$f":"IFERROR(INDEX('Manual Inputs'!M:M,SMALL(IF('Manual Inputs'!M:M<>\"\",ROW('Manual Inputs'!M:M)),ROW(6:6))),\"\")","v":""},{"$f":"IF(B11=\"\",\"\",IFERROR(INDEX('Seeding_quantities report'!$F$2:$F$10003,SMALL(IF('Seeding_quantities report'!$A$2:$A$10003=C$6,ROW('Seeding_quantities report'!$A$2:$A$10003)-1,\"\"),ROWS($B$8:$B11))),\"0\"))","v":""},{"$f":"IF(B11=\"\",\"\",IFERROR(INDEX('Seeding_quantities report'!$F$2:$F$10003,SMALL(IF('Seeding_quantities report'!$A$2:$A$10003=D$6,ROW('Seeding_quantities report'!$A$2:$A$10003)-1,\"\"),ROWS($B$8:$B11))),\"0\"))","v":""},"","",null,null,null,null,{"$f":"IF(J12=\"\",\"\",J12)","v":""},{"$f":"_xlfn.SINGLE(IF(J11=\"\",\"\",INDIRECT(CONCATENATE($J$8,\"!\",\"B\",J11))))","v":""},{"$f":"IF(J11=\"\",\"\",\"-\")","v":""},{"$f":"IF(J11=\"\",\"\",INDIRECT(CONCATENATE($J$8,\"!\",\"B\",K11)))","v":""},{"$f":"IF(L11=\"\",\"\",ROUND(SUM(INDIRECT(CONCATENATE($J$8,\"!\",\"F\",$K11))),2))","v":""},{"$f":"IF(L11=\"\",\"\",ROUND(SUM(INDIRECT(CONCATENATE($J$8,\"!\",\"E\",$K11))),0))","v":""}]
[null,{"$f":"IFERROR(INDEX('Manual Inputs'!M:M,SMALL(IF('Manual Inputs'!M:M<>\"\",ROW('Manual Inputs'!M:M)),ROW(7:7))),\"\")","v":""},{"$f":"IF(B12=\"\",\"\",IFERROR(INDEX('Seeding_quantities report'!$F$2:$F$10003,SMALL(IF('Seeding_quantities report'!$A$2:$A$10003=C$6,ROW('Seeding_quantities report'!$A$2:$A$10003)-1,\"\"),ROWS($B$8:$B12))),\"0\"))","v":""},{"$f":"IF(B12=\"\",\"\",IFERROR(INDEX('Seeding_quantities report'!$F$2:$F$10003,SMALL(IF('Seeding_quantities report'!$A$2:$A$10003=D$6,ROW('Seeding_quantities report'!$A$2:$A$10003)-1,\"\"),ROWS($B$8:$B12))),\"0\"))","v":""},"","",null,null,null,null,"",{"$f":"_xlfn.SINGLE(IF(J12=\"\",\"\",INDIRECT(CONCATENATE($J$8,\"!\",\"B\",J12))))","v":""},"","",{"$f":"IF(L12=\"\",\"\",ROUND(SUM(INDIRECT(CONCATENATE($J$8,\"!\",\"F\",$K12))),2))","v":""},{"$f":"IF(L12=\"\",\"\",ROUND(SUM(INDIRECT(CONCATENATE($J$8,\"!\",\"E\",$K12))),0))","v":""}]
[null,{"$f":"IFERROR(INDEX('Manual Inputs'!M:M,SMALL(IF('Manual Inputs'!M:M<>\"\",ROW('Manual Inputs'!M:M)),ROW(8:8))),\"\")","v":""},{"$f":"IF(B13=\"\",\"\",IFERROR(INDEX('Seeding_quantities report'!$F$2:$F$10003,SMALL(IF('Seeding_quantities report'!$A$2:$A$10003=C$6,ROW('Seeding_quantities report'!$A$2:$A$10003)-1,\"\"),ROWS($B$8:$B13))),\"0\"))","v":""},{"$f":"IF(B13=\"\",\"\",IFERROR(INDEX('Seeding_quantities report'!$F$2:$F$10003,SMALL(IF('Seeding_quantities report'!$A$2:$A$10003=D$6,ROW('Seeding_quantities report'!$A$2:$A$10003)-1,\"\"),ROWS($B$8:$B13))),\"0\"))","v":""},"","",null,null,null,null,"",{"$f":"_xlfn.SINGLE(IF(J13=\"\",\"\",INDIRECT(CONCATENATE($J$8,\"!\",\"B\",J13))))","v":""},"","",{"$f":"IF(L13=\"\",\"\",ROUND(SUM(INDIRECT(CONCATENATE($J$8,\"!\",\"F\",$K13))),2))","v":""},{"$f":"IF(L13=\"\",\"\",ROUND(SUM(INDIRECT(CONCATENATE($J$8,\"!\",\"E\",$K13))),0))","v":""}]
[null,{"$f":"IFERROR(INDEX('Manual Inputs'!M:M,SMALL(IF('Manual Inputs'!M:M<>\"\",ROW('Manual Inputs'!M:M)),ROW(9:9))),\"\")","v":""},{"$f":"IF(B14=\"\",\"\",IFERROR(INDEX('Seeding_quantities report'!$F$2:$F$10003,SMALL(IF('Seeding_quantities report'!$A$2:$A$10003=C$6,ROW('Seeding_quantities report'!$A$2:$A$10003)-1,\"\"),ROWS($B$8:$B14))),\"0\"))","v":""},{"$f":"IF(B14=\"\",\"\",IFERROR(INDEX('Seeding_quantities report'!$F$2:$F$10003,SMALL(IF('Seeding_quantities report'!$A$2:$A$10003=D$6,ROW('Seeding_quantities report'!$A$2:$A$10003)-1,\"\"),ROWS($B$8:$B14))),\"0\"))","v":""},"","",null,null,null,null,"",{"$f":"_xlfn.SINGLE(IF(J14=\"\",\"\",INDIRECT(CONCATENATE($J$8,\"!\",\"B\",J14))))","v":""},"","",{"$f":"IF(L14=\"\",\"\",ROUND(SUM(INDIRECT(CONCATENATE($J$8,\"!\",\"F\",$K14))),2))","v":""},{"$f":"IF(L14=\"\",\"\",ROUND(SUM(INDIRECT(CONCATENATE($J$8,\"!\",\"E\",$K14))),0))","v":""}]
[null,{"$f":"IFERROR(INDEX('Manual Inputs'!M:M,SMALL(IF('Manual Inputs'!M:M<>\"\",ROW('Manual Inputs'!M:M)),ROW(10:10))),\"\")","v":""},{"$f":"IF(B15=\"\",\"\",IFERROR(INDEX('Seeding_quantities report'!$F$2:$F$10003,SMALL(IF('Seeding_quantities report'!$A$2:$A$10003=C$6,ROW('Seeding_quantities report'!$A$2:$A$10003)-1,\"\"),ROWS($B$8:$B15))),\"0\"))","v":""},{"$f":"IF(B15=\"\",\"\",IFERROR(INDEX('Seeding_quantities report'!$F$2:$F$10003,SMALL(IF('Seeding_quantities report'!$A$2:$A$10003=D$6,ROW('Seeding_quantities report'!$A$2:$A$10003)-1,\"\"),ROWS($B$8:$B15))),\"0\"))","v":""},"","",null,null,null,null,"",{"$f":"_xlfn.SINGLE(IF(J15=\"\",\"\",INDIRECT(CONCATENATE($J$8,\"!\",\"B\",J15))))","v":""},"","",{"$f":"IF(L15=\"\",\"\",ROUND(SUM(INDIRECT(CONCATENATE($J$8,\"!\",\"F\",$K15))),2))","v":""},{"$f":"IF(L15=\"\",\"\",ROUND(SUM(INDIRECT(CONCATENATE($J$8,\"!\",\"E\",$K15))),0))","v":""}]
[null,{"$f":"IFERROR(INDEX('Manual Inputs'!M:M,SMALL(IF('Manual Inputs'!M:M<>\"\",ROW('Manual Inputs'!M:M)),ROW(11:11))),\"\")","v":""},{"$f":"IF(B16=\"\",\"\",IFERROR(INDEX('Seeding_quantities report'!$F$2:$F$10003,SMALL(IF('Seeding_quantities report'!$A$2:$A$10003=C$6,ROW('Seeding_quantities report'!$A$2:$A$10003)-1,\"\"),ROWS($B$8:$B16))),\"0\"))","v":""},{"$f":"IF(B16=\"\",\"\",IFERROR(INDEX('Seeding_quantities report'!$F$2:$F$10003,SMALL(IF('Seeding_quantities report'!$A$2:$A$10003=D$6,ROW('Seeding_quantities report'!$A$2:$A$10003)-1,\"\"),ROWS($B$8:$B16))),\"0\"))","v":""},"","",null,null,null,null,"",{"$f":"_xlfn.SINGLE(IF(J16=\"\",\"\",INDIRECT(CONCATENATE($J$8,\"!\",\"B\",J16))))","v":""},"","",{"$f":"IF(L16=\"\",\"\",ROUND(SUM(INDIRECT(CONCATENATE($J$8,\"!\",\"F\",$K16))),2))","v":""},{"$f":"IF(L16=\"\",\"\",ROUND(SUM(INDIRECT(CONCATENATE($J$8,\"!\",\"E\",$K16))),0))","v":""}]
[null,{"$f":"IFERROR(INDEX('Manual Inputs'!M:M,SMALL(IF('Manual Inputs'!M:M<>\"\",ROW('Manual Inputs'!M:M)),ROW(12:12))),\"\")","v":""},{"$f":"IF(B17=\"\",\"\",IFERROR(INDEX('Seeding_quantities report'!$F$2:$F$10003,SMALL(IF('Seeding_quantities report'!$A$2:$A$10003=C$6,ROW('Seeding_quantities report'!$A$2:$A$10003)-1,\"\"),ROWS($B$8:$B17))),\"0\"))","v":""},{"$f":"IF(B17=\"\",\"\",IFERROR(INDEX('Seeding_quantities report'!$F$2:$F$10003,SMALL(IF('Seeding_quantities report'!$A$2:$A$10003=D$6,ROW('Seeding_quantities report'!$A$2:$A$10003)-1,\"\"),ROWS($B$8:$B17))),\"0\"))","v":""},"","",null,null,null,null,"",{"$f":"_xlfn.SINGLE(IF(J17=\"\",\"\",INDIRECT(CONCATENATE($J$8,\"!\",\"B\",J17))))","v":""},"","",{"$f":"IF(L17=\"\",\"\",ROUND(SUM(INDIRECT(CONCATENATE($J$8,\"!\",\"F\",$K17))),2))","v":""},{"$f":"IF(L17=\"\",\"\",ROUND(SUM(INDIRECT(CONCATENATE($J$8,\"!\",\"E\",$K17))),0))","v":""}]
[null,{"$f":"IFERROR(INDEX('Manual Inputs'!M:M,SMALL(IF('Manual Inputs'!M:M<>\"\",ROW('Manual Inputs'!M:M)),ROW(13:13))),\"\")","v":""},{"$f":"IF(B18=\"\",\"\",IFERROR(INDEX('Seeding_quantities report'!$F$2:$F$10003,SMALL(IF('Seeding_quantities report'!$A$2:$A$10003=C$6,ROW('Seeding_quantities report'!$A$2:$A$10003)-1,\"\"),ROWS($B$8:$B18))),\"0\"))","v":""},{"$f":"IF(B18=\"\",\"\",IFERROR(INDEX('Seeding_quantities report'!$F$2:$F$10003,SMALL(IF('Seeding_quantities report'!$A$2:$A$10003=D$6,ROW('Seeding_quantities report'!$A$2:$A$10003)-1,\"\"),ROWS($B$8:$B18))),\"0\"))","v":""},"","",null,null,null,null,"",{"$f":"_xlfn.SINGLE(IF(J18=\"\",\"\",INDIRECT(CONCATENATE($J$8,\"!\",\"B\",J18))))","v":""},"","",{"$f":"IF(L18=\"\",\"\",ROUND(SUM(INDIRECT(CONCATENATE($J$8,\"!\",\"F\",$K18))),2))","v":""},{"$f":"IF(L18=\"\",\"\",ROUND(SUM(INDIRECT(CONCATENATE($J$8,\"!\",\"E\",$K18))),0))","v":""}]
[null,{"$f":"IFERROR(INDEX('Manual Inputs'!M:M,SMALL(IF('Manual Inputs'!M:M<>\"\",ROW('Manual Inputs'!M:M)),ROW(14:14))),\"\")","v":""},{"$f":"IF(B19=\"\",\"\",IFERROR(INDEX('Seeding_quantities report'!$F$2:$F$10003,SMALL(IF('Seeding_quantities report'!$A$2:$A$10003=C$6,ROW('Seeding_quantities report'!$A$2:$A$10003)-1,\"\"),ROWS($B$8:$B19))),\"0\"))","v":""},{"$f":"IF(B19=\"\",\"\",IFERROR(INDEX('Seeding_quantities report'!$F$2:$F$10003,SMALL(IF('Seeding_quantities report'!$A$2:$A$10003=D$6,ROW('Seeding_quantities report'!$A$2:$A$10003)-1,\"\"),ROWS($B$8:$B19))),\"0\"))","v":""},"","",null,null,null,null,"",{"$f":"_xlfn.SINGLE(IF(J19=\"\",\"\",INDIRECT(CONCATENATE($J$8,\"!\",\"B\",J19))))","v":""},"",{"$f":"IF(J19=\"\",\"\",INDIRECT(CONCATENATE($J$8,\"!\",\"B\",K19+1)))","v":""},{"$f":"IF(L19=\"\",\"\",ROUND(SUM(INDIRECT(CONCATENATE($J$8,\"!\",\"F\",$K19))),2))","v":""},{"$f":"IF(L19=\"\",\"\",ROUND(SUM(INDIRECT(CONCATENATE($J$8,\"!\",\"E\",$K19))),0))","v":""}]
[null,{"$f":"IFERROR(INDEX('Manual Inputs'!M:M,SMALL(IF('Manual Inputs'!M:M<>\"\",ROW('Manual Inputs'!M:M)),ROW(15:15))),\"\")","v":""},{"$f":"IF(B20=\"\",\"\",IFERROR(INDEX('Seeding_quantities report'!$F$2:$F$10003,SMALL(IF('Seeding_quantities report'!$A$2:$A$10003=C$6,ROW('Seeding_quantities report'!$A$2:$A$10003)-1,\"\"),ROWS($B$8:$B20))),\"0\"))","v":""},{"$f":"IF(B20=\"\",\"\",IFERROR(INDEX('Seeding_quantities report'!$F$2:$F$10003,SMALL(IF('Seeding_quantities report'!$A$2:$A$10003=D$6,ROW('Seeding_quantities report'!$A$2:$A$10003)-1,\"\"),ROWS($B$8:$B20))),\"0\"))","v":""},"","",null,null,null,null,"",{"$f":"_xlfn.SINGLE(IF(J20=\"\",\"\",INDIRECT(CONCATENATE($J$8,\"!\",\"B\",J20))))","v":""},"","",{"$f":"IF(L20=\"\",\"\",ROUND(SUM(INDIRECT(CONCATENATE($J$8,\"!\",\"F\",$K20))),2))","v":""},{"$f":"IF(L20=\"\",\"\",ROUND(SUM(INDIRECT(CONCATENATE($J$8,\"!\",\"E\",$K20))),0))","v":""}]
[null,{"$f":"IFERROR(INDEX('Manual Inputs'!M:M,SMALL(IF('Manual Inputs'!M:M<>\"\",ROW('Manual Inputs'!M:M)),ROW(16:16))),\"\")","v":""},{"$f":"IF(B21=\"\",\"\",IFERROR(INDEX('Seeding_quantities report'!$F$2:$F$10003,SMALL(IF('Seeding_quantities report'!$A$2:$A$10003=C$6,ROW('Seeding_quantities report'!$A$2:$A$10003)-1,\"\"),ROWS($B$8:$B21))),\"0\"))","v":""},{"$f":"IF(B21=\"\",\"\",IFERROR(INDEX('Seeding_quantities report'!$F$2:$F$10003,SMALL(IF('Seeding_quantities report'!$A$2:$A$10003=D$6,ROW('Seeding_quantities report'!$A$2:$A$10003)-1,\"\"),ROWS($B$8:$B21))),\"0\"))","v":""},"","",null,null,null,null,"",{"$f":"_xlfn.SINGLE(IF(J21=\"\",\"\",INDIRECT(CONCATENATE($J$8,\"!\",\"B\",J21))))","v":""},"","",{"$f":"IF(L21=\"\",\"\",ROUND(SUM(INDIRECT(CONCATENATE($J$8,\"!\",\"F\",$K21))),2))","v":""},{"$f":"IF(L21=\"\",\"\",ROUND(SUM(INDIRECT(CONCATENATE($J$8,\"!\",\"E\",$K21))),0))","v":""}]
[null,{"$f":"IFERROR(INDEX('Manual Inputs'!M:M,SMALL(IF('Manual Inputs'!M:M<>\"\",ROW('Manual Inputs'!M:M)),ROW(17:17))),\"\")","v":""},{"$f":"IF(B22=\"\",\"\",IFERROR(INDEX('Seeding_quantities report'!$F$2:$F$10003,SMALL(IF('Seeding_quantities report'!$A$2:$A$10003=C$6,ROW('Seeding_quantities report'!$A$2:$A$10003)-1,\"\"),ROWS($B$8:$B22))),\"0\"))","v":""},{"$f":"IF(B22=\"\",\"\",IFERROR(INDEX('Seeding_quantities report'!$F$2:$F$10003,SMALL(IF('Seeding_quantities report'!$A$2:$A$10003=D$6,ROW('Seeding_quantities report'!$A$2:$A$10003)-1,\"\"),ROWS($B$8:$B22))),\"0\"))","v":""},"","",null,null,null,null,"",{"$f":"_xlfn.SINGLE(IF(J22=\"\",\"\",INDIRECT(CONCATENATE($J$8,\"!\",\"B\",J22))))","v":""},"","",{"$f":"IF(L22=\"\",\"\",ROUND(SUM(INDIRECT(CONCATENATE($J$8,\"!\",\"F\",$K22))),2))","v":""},{"$f":"IF(L22=\"\",\"\",ROUND(SUM(INDIRECT(CONCATENATE($J$8,\"!\",\"E\",$K22))),0))","v":""}]
[null,{"$f":"IFERROR(INDEX('Manual Inputs'!M:M,SMALL(IF('Manual Inputs'!M:M<>\"\",ROW('Manual Inputs'!M:M)),ROW(18:18))),\"\")","v":""},{"$f":"IF(B23=\"\",\"\",IFERROR(INDEX('Seeding_quantities report'!$F$2:$F$10003,SMALL(IF('Seeding_quantities report'!$A$2:$A$10003=C$6,ROW('Seeding_quantities report'!$A$2:$A$10003)-1,\"\"),ROWS($B$8:$B23))),\"0\"))","v":""},{"$f":"IF(B23=\"\",\"\",IFERROR(INDEX('Seeding_quantities report'!$F$2:$F$10003,SMALL(IF('Seeding_quantities report'!$A$2:$A$10003=D$6,ROW('Seeding_quantities report'!$A$2:$A$10003)-1,\"\"),ROWS($B$8:$B23))),\"0\"))","v":""},"","",null,null,null,null,"",{"$f":"_xlfn.SINGLE(IF(J23=\"\",\"\",INDIRECT(CONCATENATE($J$8,\"!\",\"B\",J23))))","v":""},"","",{"$f":"IF(L23=\"\",\"\",ROUND(SUM(INDIRECT(CONCATENATE($J$8,\"!\",\"F\",$K23))),2))","v":""},{"$f":"IF(L23=\"\",\"\",ROUND(SUM(INDIRECT(CONCATENATE($J$8,\"!\",\"E\",$K23))),0))","v":""}]
[null,{"$f":"IFERROR(INDEX('Manual Inputs'!M:M,SMALL(IF('Manual Inputs'!M:M<>\"\",ROW('Manual Inputs'!M:M)),ROW(19:19))),\"\")","v":""},{"$f":"IF(B24=\"\",\"\",IFERROR(INDEX('Seeding_quantities report'!$F$2:$F$10003,SMALL(IF('Seeding_quantities report'!$A$2:$A$10003=C$6,ROW('Seeding_quantities report'!$A$2:$A$10003)-1,\"\"),ROWS($B$8:$B24))),\"0\"))","v":""},{"$f":"IF(B24=\"\",\"\",IFERROR(INDEX('Seeding_quantities report'!$F$2:$F$10003,SMALL(IF('Seeding_quantities report'!$A$2:$A$10003=D$6,ROW('Seeding_quantities report'!$A$2:$A$10003)-1,\"\"),ROWS($B$8:$B24))),\"0\"))","v":""},"","",null,null,null,null,"",{"$f":"_xlfn.SINGLE(IF(J24=\"\",\"\",INDIRECT(CONCATENATE($J$8,\"!\",\"B\",J24))))","v":""},"","",{"$f":"IF(L24=\"\",\"\",ROUND(SUM(INDIRECT(CONCATENATE($J$8,\"!\",\"F\",$K24))),2))","v":""},{"$f":"IF(L24=\"\",\"\",ROUND(SUM(INDIRECT(CONCATENATE($J$8,\"!\",\"E\",$K24))),0))","v":""}]
[null,{"$f":"IFERROR(INDEX('Manual Inputs'!M:M,SMALL(IF('Manual Inputs'!M:M<>\"\",ROW('Manual Inputs'!M:M)),ROW(20:20))),\"\")","v":""},{"$f":"IF(B25=\"\",\"\",IFERROR(INDEX('Seeding_quantities report'!$F$2:$F$10003,SMALL(IF('Seeding_quantities report'!$A$2:$A$10003=C$6,ROW('Seeding_quantities report'!$A$2:$A$10003)-1,\"\"),ROWS($B$8:$B25))),\"0\"))","v":""},{"$f":"IF(B25=\"\",\"\",IFERROR(INDEX('Seeding_quantities report'!$F$2:$F$10003,SMALL(IF('Seeding_quantities report'!$A$2:$A$10003=D$6,ROW('Seeding_quantities report'!$A$2:$A$10003)-1,\"\"),ROWS($B$8:$B25))),\"0\"))","v":""},"","",null,null,null,null,"",{"$f":"_xlfn.SINGLE(IF(J25=\"\",\"\",INDIRECT(CONCATENATE($J$8,\"!\",\"B\",J25))))","v":""},"","",{"$f":"IF(L25=\"\",\"\",ROUND(SUM(INDIRECT(CONCATENATE($J$8,\"!\",\"F\",$K25))),2))","v":""},{"$f":"IF(L25=\"\",\"\",ROUND(SUM(INDIRECT(CONCATENATE($J$8,\"!\",\"E\",$K25))),0))","v":""}]
[null,{"$f":"IFERROR(INDEX('Manual Inputs'!M:M,SMALL(IF('Manual Inputs'!M:M<>\"\",ROW('Manual Inputs'!M:M)),ROW(21:21))),\"\")","v":""},{"$f":"IF(B26=\"\",\"\",IFERROR(INDEX('Seeding_quantities report'!$F$2:$F$10003,SMALL(IF('Seeding_quantities report'!$A$2:$A$10003=C$6,ROW('Seeding_quantities report'!$A$2:$A$10003)-1,\"\"),ROWS($B$8:$B26))),\"0\"))","v":""},{"$f":"IF(B26=\"\",\"\",IFERROR(INDEX('Seeding_quantities report'!$F$2:$F$10003,SMALL(IF('Seeding_quantities report'!$A$2:$A$10003=D$6,ROW('Seeding_quantities report'!$A$2:$A$10003)-1,\"\"),ROWS($B$8:$B26))),\"0\"))","v":""},"","",null,null,null,null,"",{"$f":"IF(Clearing!J26=\"\",\"\",INDIRECT(CONCATENATE(Clearing!$J$8,\"!\",\"A\",Clearing!J26)))","v":""},"","",{"$f":"IF(L26=\"\",\"\",ROUND(SUM(INDIRECT(CONCATENATE($J$8,\"!\",\"F\",$K26))),2))","v":""},{"$f":"IF(L26=\"\",\"\",ROUND(SUM(INDIRECT(CONCATENATE($J$8,\"!\",\"E\",$K26))),0))","v":""}]
[null,{"$f":"IFERROR(INDEX('Manual Inputs'!M:M,SMALL(IF('Manual Inputs'!M:M<>\"\",ROW('Manual Inputs'!M:M)),ROW(22:22))),\"\")","v":""},{"$f":"IF(B27=\"\",\"\",IFERROR(INDEX('Seeding_quantities report'!$F$2:$F$10003,SMALL(IF('Seeding_quantities report'!$A$2:$A$10003=C$6,ROW('Seeding_quantities report'!$A$2:$A$10003)-1,\"\"),ROWS($B$8:$B27))),\"0\"))","v":""},{"$f":"IF(B27=\"\",\"\",IFERROR(INDEX('Seeding_quantities report'!$F$2:$F$10003,SMALL(IF('Seeding_quantities report'!$A$2:$A$10003=D$6,ROW('Seeding_quantities report'!$A$2:$A$10003)-1,\"\"),ROWS($B$8:$B27))),\"0\"))","v":""},"","",null,null,null,null,"",{"$f":"IF(Clearing!J27=\"\",\"\",INDIRECT(CONCATENATE(Clearing!$J$8,\"!\",\"A\",Clearing!J27)))","v":""},"","",{"$f":"IF(L27=\"\",\"\",ROUND(SUM(INDIRECT(CONCATENATE($J$8,\"!\",\"F\",$K27))),2))","v":""},{"$f":"IF(L27=\"\",\"\",ROUND(SUM(INDIRECT(CONCATENATE($J$8,\"!\",\"E\",$K27))),0))","v":""}]
[null,{"$f":"IFERROR(INDEX('Manual Inputs'!M:M,SMALL(IF('Manual Inputs'!M:M<>\"\",ROW('Manual Inputs'!M:M)),ROW(23:23))),\"\")","v":""},{"$f":"IF(B28=\"\",\"\",IFERROR(INDEX('Seeding_quantities report'!$F$2:$F$10003,SMALL(IF('Seeding_quantities report'!$A$2:$A$10003=C$6,ROW('Seeding_quantities report'!$A$2:$A$10003)-1,\"\"),ROWS($B$8:$B28))),\"0\"))","v":""},{"$f":"IF(B28=\"\",\"\",IFERROR(INDEX('Seeding_quantities report'!$F$2:$F$10003,SMALL(IF('Seeding_quantities report'!$A$2:$A$10003=D$6,ROW('Seeding_quantities report'!$A$2:$A$10003)-1,\"\"),ROWS($B$8:$B28))),\"0\"))","v":""},"","",null,null,null,null,"",{"$f":"IF(Clearing!J28=\"\",\"\",INDIRECT(CONCATENATE(Clearing!$J$8,\"!\",\"A\",Clearing!J28)))","v":""},"",{"$f":"IF(Clearing!J28=\"\",\"\",INDIRECT(CONCATENATE(Clearing!$J$8,\"!\",\"A\",Clearing!K28)))","v":""},{"$f":"IF(L28=\"\",\"\",ROUND(SUM(INDIRECT(CONCATENATE($J$8,\"!\",\"F\",$K28))),2))","v":""},{"$f":"IF(L28=\"\",\"\",ROUND(SUM(INDIRECT(CONCATENATE($J$8,\"!\",\"E\",$K28))),0))","v":""}]
[null,{"$f":"IFERROR(INDEX('Manual Inputs'!M:M,SMALL(IF('Manual Inputs'!M:M<>\"\",ROW('Manual Inputs'!M:M)),ROW(24:24))),\"\")","v":""},{"$f":"IF(B29=\"\",\"\",IFERROR(INDEX('Seeding_quantities report'!$F$2:$F$10003,SMALL(IF('Seeding_quantities report'!$A$2:$A$10003=C$6,ROW('Seeding_quantities report'!$A$2:$A$10003)-1,\"\"),ROWS($B$8:$B29))),\"0\"))","v":""},{"$f":"IF(B29=\"\",\"\",IFERROR(INDEX('Seeding_quantities report'!$F$2:$F$10003,SMALL(IF('Seeding_quantities report'!$A$2:$A$10003=D$6,ROW('Seeding_quantities report'!$A$2:$A$10003)-1,\"\"),ROWS($B$8:$B29))),\"0\"))","v":""},"","",null,null,null,null,"",{"$f":"IF(Clearing!J29=\"\",\"\",INDIRECT(CONCATENATE(Clearing!$J$8,\"!\",\"A\",Clearing!J29)))","v":""},"",{"$f":"IF(Clearing!J29=\"\",\"\",INDIRECT(CONCATENATE(Clearing!$J$8,\"!\",\"A\",Clearing!K29)))","v":""},{"$f":"IF(L29=\"\",\"\",ROUND(SUM(INDIRECT(CONCATENATE($J$8,\"!\",\"F\",$K29))),2))","v":""},{"$f":"IF(L29=\"\",\"\",ROUND(SUM(INDIRECT(CONCATENATE($J$8,\"!\",\"E\",$K29))),0))","v":""}]
[null,{"$f":"IFERROR(INDEX('Manual Inputs'!M:M,SMALL(IF('Manual Inputs'!M:M<>\"\",ROW('Manual Inputs'!M:M)),ROW(25:25))),\"\")","v":""},{"$f":"IF(B30=\"\",\"\",IFERROR(INDEX('Seeding_quantities report'!$F$2:$F$10003,SMALL(IF('Seeding_quantities report'!$A$2:$A$10003=C$6,ROW('Seeding_quantities report'!$A$2:$A$10003)-1,\"\"),ROWS($B$8:$B30))),\"0\"))","v":""},{"$f":"IF(B30=\"\",\"\",IFERROR(INDEX('Seeding_quantities report'!$F$2:$F$10003,SMALL(IF('Seeding_quantities report'!$A$2:$A$10003=D$6,ROW('Seeding_quantities report'!$A$2:$A$10003)-1,\"\"),ROWS($B$8:$B30))),\"0\"))","v":""},"","",null,null,null,null,"",{"$f":"IF(Clearing!J30=\"\",\"\",INDIRECT(CONCATENATE(Clearing!$J$8,\"!\",\"A\",Clearing!J30)))","v":""},"",{"$f":"IF(Clearing!J30=\"\",\"\",INDIRECT(CONCATENATE(Clearing!$J$8,\"!\",\"A\",Clearing!K30)))","v":""},{"$f":"IF(L30=\"\",\"\",ROUND(SUM(INDIRECT(CONCATENATE($J$8,\"!\",\"F\",$K30))),2))","v":""},{"$f":"IF(L30=\"\",\"\",ROUND(SUM(INDIRECT(CONCATENATE($J$8,\"!\",\"E\",$K30))),0))","v":""}]
[null,{"$f":"IFERROR(INDEX('Manual Inputs'!M:M,SMALL(IF('Manual Inputs'!M:M<>\"\",ROW('Manual Inputs'!M:M)),ROW(27:27))),\"\")","v":""},{"$f":"IF(B31=\"\",\"\",IFERROR(INDEX('Seeding_quantities report'!$F$2:$F$10003,SMALL(IF('Seeding_quantities report'!$A$2:$A$10003=C$6,ROW('Seeding_quantities report'!$A$2:$A$10003)-1,\"\"),ROWS($B$8:$B31))),\"0\"))","v":""},{"$f":"IF(B31=\"\",\"\",IFERROR(INDEX('Seeding_quantities report'!$F$2:$F$10003,SMALL(IF('Seeding_quantities report'!$A$2:$A$10003=D$6,ROW('Seeding_quantities report'!$A$2:$A$10003)-1,\"\"),ROWS($B$8:$B31))),\"0\"))","v":""},"","",null,null,null,null,"",{"$f":"IF(Clearing!J31=\"\",\"\",INDIRECT(CONCATENATE(Clearing!$J$8,\"!\",\"A\",Clearing!J31)))","v":""},"",{"$f":"IF(Clearing!J31=\"\",\"\",INDIRECT(CONCATENATE(Clearing!$J$8,\"!\",\"A\",Clearing!K31)))","v":""},{"$f":"IF(L31=\"\",\"\",ROUND(SUM(INDIRECT(CONCATENATE($J$8,\"!\",\"F\",$K31))),2))","v":""},{"$f":"IF(L31=\"\",\"\",ROUND(SUM(INDIRECT(CONCATENATE($J$8,\"!\",\"E\",$K31))),0))","v":""}]
[null,{"$f":"IFERROR(INDEX('Manual Inputs'!M:M,SMALL(IF('Manual Inputs'!M:M<>\"\",ROW('Manual Inputs'!M:M)),ROW(28:28))),\"\")","v":""},{"$f":"IF(B32=\"\",\"\",IFERROR(INDEX('Seeding_quantities report'!$F$2:$F$10003,SMALL(IF('Seeding_quantities report'!$A$2:$A$10003=C$6,ROW('Seeding_quantities report'!$A$2:$A$10003)-1,\"\"),ROWS($B$8:$B32))),\"0\"))","v":""},null,{"$f":"IF(B32=\"\",\"\",$C32+#REF!+#REF!)","v":""},{"$f":"IF(C32=\"\",\"\",$C32+#REF!+#REF!)","v":""}]
[null,{"$f":"IFERROR(INDEX('Manual Inputs'!M:M,SMALL(IF('Manual Inputs'!M:M<>\"\",ROW('Manual Inputs'!M:M)),ROW(29:29))),\"\")","v":""},{"$f":"IF(B33=\"\",\"\",IFERROR(INDEX('Seeding_quantities report'!$F$2:$F$10003,SMALL(IF('Seeding_quantities report'!$A$2:$A$10003=C$6,ROW('Seeding_quantities report'!$A$2:$A$10003)-1,\"\"),ROWS($B$8:$B33))),\"0\"))","v":""},null,{"$f":"IF(B33=\"\",\"\",$C33+#REF!+#REF!)","v":""},{"$f":"IF(C33=\"\",\"\",$C33+#REF!+#REF!)","v":""}]
[null,{"$f":"IFERROR(INDEX('Manual Inputs'!M:M,SMALL(IF('Manual Inputs'!M:M<>\"\",ROW('Manual Inputs'!M:M)),ROW(30:30))),\"\")","v":""},{"$f":"IF(B34=\"\",\"\",IFERROR(INDEX('Seeding_quantities report'!$F$2:$F$10003,SMALL(IF('Seeding_quantities report'!$A$2:$A$10003=C$6,ROW('Seeding_quantities report'!$A$2:$A$10003)-1,\"\"),ROWS($B$8:$B34))),\"0\"))","v":""},null,{"$f":"IF(B34=\"\",\"\",$C34+#REF!+#REF!)","v":""},{"$f":"IF(C34=\"\",\"\",$C34+#REF!+#REF!)","v":""}]
[null,{"$f":"IFERROR(INDEX('Manual Inputs'!M:M,SMALL(IF('Manual Inputs'!M:M<>\"\",ROW('Manual Inputs'!M:M)),ROW(31:31))),\"\")","v":""},{"$f":"IF(B35=\"\",\"\",IFERROR(INDEX('Seeding_quantities report'!$F$2:$F$10003,SMALL(IF('Seeding_quantities report'!$A$2:$A$10003=C$6,ROW('Seeding_quantities report'!$A$2:$A$10003)-1,\"\"),ROWS($B$8:$B35))),\"0\"))","v":""},null,{"$f":"IF(B35=\"\",\"\",$C35+#REF!+#REF!)","v":""},{"$f":"IF(C35=\"\",\"\",$C35+#REF!+#REF!)","v":""}]
[null,{"$f":"IFERROR(INDEX('Manual Inputs'!M:M,SMALL(IF('Manual Inputs'!M:M<>\"\",ROW('Manual Inputs'!M:M)),ROW(32:32))),\"\")","v":""},{"$f":"IF(B36=\"\",\"\",IFERROR(INDEX('Seeding_quantities report'!$F$2:$F$10003,SMALL(IF('Seeding_quantities report'!$A$2:$A$10003=C$6,ROW('Seeding_quantities report'!$A$2:$A$10003)-1,\"\"),ROWS($B$8:$B36))),\"0\"))","v":""},null,{"$f":"IF(B36=\"\",\"\",$C36+#REF!+#REF!)","v":""},{"$f":"IF(C36=\"\",\"\",$C36+#REF!+#REF!)","v":""}]
[null,{"$f":"IFERROR(INDEX('Manual Inputs'!M:M,SMALL(IF('Manual Inputs'!M:M<>\"\",ROW('Manual Inputs'!M:M)),ROW(33:33))),\"\")","v":""},{"$f":"IF(B37=\"\",\"\",IFERROR(INDEX('Seeding_quantities report'!$F$2:$F$10003,SMALL(IF('Seeding_quantities report'!$A$2:$A$10003=C$6,ROW('Seeding_quantities report'!$A$2:$A$10003)-1,\"\"),ROWS($B$8:$B37))),\"0\"))","v":""},null,{"$f":"IF(B37=\"\",\"\",$C37+#REF!+#REF!)","v":""},{"$f":"IF(C37=\"\",\"\",$C37+#REF!+#REF!)","v":""}]
[null,{"$f":"IFERROR(INDEX('Manual Inputs'!M:M,SMALL(IF('Manual Inputs'!M:M<>\"\",ROW('Manual Inputs'!M:M)),ROW(34:34))),\"\")","v":""},{"$f":"IF(B38=\"\",\"\",IFERROR(INDEX('Seeding_quantities report'!$F$2:$F$10003,SMALL(IF('Seeding_quantities report'!$A$2:$A$10003=C$6,ROW('Seeding_quantities report'!$A$2:$A$10003)-1,\"\"),ROWS($B$8:$B38))),\"0\"))","v":""},null,{"$f":"IF(B38=\"\",\"\",$C38+#REF!+#REF!)","v":""},{"$f":"IF(C38=\"\",\"\",$C38+#REF!+#REF!)","v":""}]
[null,{"$f":"IFERROR(INDEX('Manual Inputs'!M:M,SMALL(IF('Manual Inputs'!M:M<>\"\",ROW('Manual Inputs'!M:M)),ROW(35:35))),\"\")","v":""},{"$f":"IF(B39=\"\",\"\",IFERROR(INDEX('Seeding_quantities report'!$F$2:$F$10003,SMALL(IF('Seeding_quantities report'!$A$2:$A$10003=C$6,ROW('Seeding_quantities report'!$A$2:$A$10003)-1,\"\"),ROWS($B$8:$B39))),\"0\"))","v":""},null,{"$f":"IF(B39=\"\",\"\",$C39+#REF!+#REF!)","v":""},{"$f":"IF(C39=\"\",\"\",$C39+#REF!+#REF!)","v":""}]
[null,{"$f":"IFERROR(INDEX('Manual Inputs'!M:M,SMALL(IF('Manual Inputs'!M:M<>\"\",ROW('Manual Inputs'!M:M)),ROW(36:36))),\"\")","v":""},{"$f":"IF(B40=\"\",\"\",IFERROR(INDEX('Seeding_quantities report'!$F$2:$F$10003,SMALL(IF('Seeding_quantities report'!$A$2:$A$10003=C$6,ROW('Seeding_quantities report'!$A$2:$A$10003)-1,\"\"),ROWS($B$8:$B40))),\"0\"))","v":""},null,{"$f":"IF(B40=\"\",\"\",$C40+#REF!+#REF!)","v":""},{"$f":"IF(C40=\"\",\"\",$C40+#REF!+#REF!)","v":""}]
[null,{"$f":"IFERROR(INDEX('Manual Inputs'!M:M,SMALL(IF('Manual Inputs'!M:M<>\"\",ROW('Manual Inputs'!M:M)),ROW(37:37))),\"\")","v":""},{"$f":"IF(B41=\"\",\"\",IFERROR(INDEX('Seeding_quantities report'!$F$2:$F$10003,SMALL(IF('Seeding_quantities report'!$A$2:$A$10003=C$6,ROW('Seeding_quantities report'!$A$2:$A$10003)-1,\"\"),ROWS($B$8:$B41))),\"0\"))","v":""},null,{"$f":"IF(B41=\"\",\"\",$C41+#REF!+#REF!)","v":""},{"$f":"IF(C41=\"\",\"\",$C41+#REF!+#REF!)","v":""}]
[null,{"$f":"IFERROR(INDEX('Manual Inputs'!M:M,SMALL(IF('Manual Inputs'!M:M<>\"\",ROW('Manual Inputs'!M:M)),ROW(38:38))),\"\")","v":""},{"$f":"IF(B42=\"\",\"\",IFERROR(INDEX('Seeding_quantities report'!$F$2:$F$10003,SMALL(IF('Seeding_quantities report'!$A$2:$A$10003=C$6,ROW('Seeding_quantities report'!$A$2:$A$10003)-1,\"\"),ROWS($B$8:$B42))),\"0\"))","v":""},null,{"$f":"IF(B42=\"\",\"\",$C42+#REF!+#REF!)","v":""},{"$f":"IF(C42=\"\",\"\",$C42+#REF!+#REF!)","v":""}]
[null,{"$f":"IFERROR(INDEX('Manual Inputs'!M:M,SMALL(IF('Manual Inputs'!M:M<>\"\",ROW('Manual Inputs'!M:M)),ROW(39:39))),\"\")","v":""},{"$f":"IF(B43=\"\",\"\",IFERROR(INDEX('Seeding_quantities report'!$F$2:$F$10003,SMALL(IF('Seeding_quantities report'!$A$2:$A$10003=C$6,ROW('Seeding_quantities report'!$A$2:$A$10003)-1,\"\"),ROWS($B$8:$B43))),\"0\"))","v":""},null,{"$f":"IF(B43=\"\",\"\",$C43+#REF!+#REF!)","v":""},{"$f":"IF(C43=\"\",\"\",$C43+#REF!+#REF!)","v":""}]
[null,{"$f":"IFERROR(INDEX('Manual Inputs'!M:M,SMALL(IF('Manual Inputs'!M:M<>\"\",ROW('Manual Inputs'!M:M)),ROW(40:40))),\"\")","v":""},{"$f":"IF(B44=\"\",\"\",IFERROR(INDEX('Seeding_quantities report'!$F$2:$F$10003,SMALL(IF('Seeding_quantities report'!$A$2:$A$10003=C$6,ROW('Seeding_quantities report'!$A$2:$A$10003)-1,\"\"),ROWS($B$8:$B44))),\"0\"))","v":""},null,{"$f":"IF(B44=\"\",\"\",$C44+#REF!+#REF!)","v":""},{"$f":"IF(C44=\"\",\"\",$C44+#REF!+#REF!)","v":""}]
[null,{"$f":"IFERROR(INDEX('Manual Inputs'!M:M,SMALL(IF('Manual Inputs'!M:M<>\"\",ROW('Manual Inputs'!M:M)),ROW(41:41))),\"\")","v":""},{"$f":"IF(B45=\"\",\"\",IFERROR(INDEX('Seeding_quantities report'!$F$2:$F$10003,SMALL(IF('Seeding_quantities report'!$A$2:$A$10003=C$6,ROW('Seeding_quantities report'!$A$2:$A$10003)-1,\"\"),ROWS($B$8:$B45))),\"0\"))","v":""},null,{"$f":"IF(B45=\"\",\"\",$C45+#REF!+#REF!)","v":""},{"$f":"IF(C45=\"\",\"\",$C45+#REF!+#REF!)","v":""}]
[null,{"$f":"IFERROR(INDEX('Manual Inputs'!M:M,SMALL(IF('Manual Inputs'!M:M<>\"\",ROW('Manual Inputs'!M:M)),ROW(42:42))),\"\")","v":""},{"$f":"IF(B46=\"\",\"\",IFERROR(INDEX('Seeding_quantities report'!$F$2:$F$10003,SMALL(IF('Seeding_quantities report'!$A$2:$A$10003=C$6,ROW('Seeding_quantities report'!$A$2:$A$10003)-1,\"\"),ROWS($B$8:$B46))),\"0\"))","v":""},null,{"$f":"IF(B46=\"\",\"\",$C46+#REF!+#REF!)","v":""},{"$f":"IF(C46=\"\",\"\",$C46+#REF!+#REF!)","v":""}]
[null,{"$f":"IFERROR(INDEX('Manual Inputs'!M:M,SMALL(IF('Manual Inputs'!M:M<>\"\",ROW('Manual Inputs'!M:M)),ROW(43:43))),\"\")","v":""},{"$f":"IF(B47=\"\",\"\",IFERROR(INDEX('Seeding_quantities report'!$F$2:$F$10003,SMALL(IF('Seeding_quantities report'!$A$2:$A$10003=C$6,ROW('Seeding_quantities report'!$A$2:$A$10003)-1,\"\"),ROWS($B$8:$B47))),\"0\"))","v":""},null,{"$f":"IF(B47=\"\",\"\",$C47+#REF!+#REF!)","v":""},{"$f":"IF(C47=\"\",\"\",$C47+#REF!+#REF!)","v":""}]
[null,{"$f":"IFERROR(INDEX('Manual Inputs'!M:M,SMALL(IF('Manual Inputs'!M:M<>\"\",ROW('Manual Inputs'!M:M)),ROW(44:44))),\"\")","v":""},{"$f":"IF(B48=\"\",\"\",IFERROR(INDEX('Seeding_quantities report'!$F$2:$F$10003,SMALL(IF('Seeding_quantities report'!$A$2:$A$10003=C$6,ROW('Seeding_quantities report'!$A$2:$A$10003)-1,\"\"),ROWS($B$8:$B48))),\"0\"))","v":""},null,{"$f":"IF(B48=\"\",\"\",$C48+#REF!+#REF!)","v":""},{"$f":"IF(C48=\"\",\"\",$C48+#REF!+#REF!)","v":""}]
[null,{"$f":"IFERROR(INDEX('Manual Inputs'!M:M,SMALL(IF('Manual Inputs'!M:M<>\"\",ROW('Manual Inputs'!M:M)),ROW(45:45))),\"\")","v":""},{"$f":"IF(B49=\"\",\"\",IFERROR(INDEX('Seeding_quantities report'!$F$2:$F$10003,SMALL(IF('Seeding_quantities report'!$A$2:$A$10003=C$6,ROW('Seeding_quantities report'!$A$2:$A$10003)-1,\"\"),ROWS($B$8:$B49))),\"0\"))","v":""},null,{"$f":"IF(B49=\"\",\"\",$C49+#REF!+#REF!)","v":""},{"$f":"IF(C49=\"\",\"\",$C49+#REF!+#REF!)","v":""}]
[null,{"$f":"IFERROR(INDEX('Manual Inputs'!M:M,SMALL(IF('Manual Inputs'!M:M<>\"\",ROW('Manual Inputs'!M:M)),ROW(46:46))),\"\")","v":""},{"$f":"IF(B50=\"\",\"\",IFERROR(INDEX('Seeding_quantities report'!$F$2:$F$10003,SMALL(IF('Seeding_quantities report'!$A$2:$A$10003=C$6,ROW('Seeding_quantities report'!$A$2:$A$10003)-1,\"\"),ROWS($B$8:$B50))),\"0\"))","v":""},null,{"$f":"IF(B50=\"\",\"\",$C50+#REF!+#REF!)","v":""},{"$f":"IF(C50=\"\",\"\",$C50+#REF!+#REF!)","v":""}]
[null,{"$f":"IFERROR(INDEX('Manual Inputs'!M:M,SMALL(IF('Manual Inputs'!M:M<>\"\",ROW('Manual Inputs'!M:M)),ROW(47:47))),\"\")","v":""},{"$f":"IF(B51=\"\",\"\",IFERROR(INDEX('Seeding_quantities report'!$F$2:$F$10003,SMALL(IF('Seeding_quantities report'!$A$2:$A$10003=C$6,ROW('Seeding_quantities report'!$A$2:$A$10003)-1,\"\"),ROWS($B$8:$B51))),\"0\"))","v":""},null,{"$f":"IF(B51=\"\",\"\",$C51+#REF!+#REF!)","v":""},{"$f":"IF(C51=\"\",\"\",$C51+#REF!+#REF!)","v":""}]
[null,{"$f":"IFERROR(INDEX('Manual Inputs'!M:M,SMALL(IF('Manual Inputs'!M:M<>\"\",ROW('Manual Inputs'!M:M)),ROW(48:48))),\"\")","v":""},{"$f":"IF(B52=\"\",\"\",IFERROR(INDEX('Seeding_quantities report'!$F$2:$F$10003,SMALL(IF('Seeding_quantities report'!$A$2:$A$10003=C$6,ROW('Seeding_quantities report'!$A$2:$A$10003)-1,\"\"),ROWS($B$8:$B52))),\"0\"))","v":""},null,{"$f":"IF(B52=\"\",\"\",$C52+#REF!+#REF!)","v":""},{"$f":"IF(C52=\"\",\"\",$C52+#REF!+#REF!)","v":""}]
[null,{"$f":"IFERROR(INDEX('Manual Inputs'!M:M,SMALL(IF('Manual Inputs'!M:M<>\"\",ROW('Manual Inputs'!M:M)),ROW(49:49))),\"\")","v":""},{"$f":"IF(B53=\"\",\"\",IFERROR(INDEX('Seeding_quantities report'!$F$2:$F$10003,SMALL(IF('Seeding_quantities report'!$A$2:$A$10003=C$6,ROW('Seeding_quantities report'!$A$2:$A$10003)-1,\"\"),ROWS($B$8:$B53))),\"0\"))","v":""},null,{"$f":"IF(B53=\"\",\"\",$C53+#REF!+#REF!)","v":""},{"$f":"IF(C53=\"\",\"\",$C53+#REF!+#REF!)","v":""}]
[null,{"$f":"IFERROR(INDEX('Manual Inputs'!M:M,SMALL(IF('Manual Inputs'!M:M<>\"\",ROW('Manual Inputs'!M:M)),ROW(50:50))),\"\")","v":""},{"$f":"IF(B54=\"\",\"\",IFERROR(INDEX('Seeding_quantities report'!$F$2:$F$10003,SMALL(IF('Seeding_quantities report'!$A$2:$A$10003=C$6,ROW('Seeding_quantities report'!$A$2:$A$10003)-1,\"\"),ROWS($B$8:$B54))),\"0\"))","v":""},null,{"$f":"IF(B54=\"\",\"\",$C54+#REF!+#REF!)","v":""},{"$f":"IF(C54=\"\",\"\",$C54+#REF!+#REF!)","v":""}]
[null,{"$f":"IFERROR(INDEX('Manual Inputs'!M:M,SMALL(IF('Manual Inputs'!M:M<>\"\",ROW('Manual Inputs'!M:M)),ROW(51:51))),\"\")","v":""},{"$f":"IF(B55=\"\",\"\",IFERROR(INDEX('Seeding_quantities report'!$F$2:$F$10003,SMALL(IF('Seeding_quantities report'!$A$2:$A$10003=C$6,ROW('Seeding_quantities report'!$A$2:$A$10003)-1,\"\"),ROWS($B$8:$B55))),\"0\"))","v":""},null,{"$f":"IF(B55=\"\",\"\",$C55+#REF!+#REF!)","v":""},{"$f":"IF(C55=\"\",\"\",$C55+#REF!+#REF!)","v":""}]
[null,{"$f":"IFERROR(INDEX('Manual Inputs'!M:M,SMALL(IF('Manual Inputs'!M:M<>\"\",ROW('Manual Inputs'!M:M)),ROW(52:52))),\"\")","v":""},{"$f":"IF(B56=\"\",\"\",IFERROR(INDEX('Seeding_quantities report'!$F$2:$F$10003,SMALL(IF('Seeding_quantities report'!$A$2:$A$10003=C$6,ROW('Seeding_quantities report'!$A$2:$A$10003)-1,\"\"),ROWS($B$8:$B56))),\"0\"))","v":""},null,{"$f":"IF(B56=\"\",\"\",$C56+#REF!+#REF!)","v":""},{"$f":"IF(C56=\"\",\"\",$C56+#REF!+#REF!)","v":""}]
[null,{"$f":"IFERROR(INDEX('Manual Inputs'!M:M,SMALL(IF('Manual Inputs'!M:M<>\"\",ROW('Manual Inputs'!M:M)),ROW(53:53))),\"\")","v":""},{"$f":"IF(B57=\"\",\"\",IFERROR(INDEX('Seeding_quantities report'!$F$2:$F$10003,SMALL(IF('Seeding_quantities report'!$A$2:$A$10003=C$6,ROW('Seeding_quantities report'!$A$2:$A$10003)-1,\"\"),ROWS($B$8:$B57))),\"0\"))","v":""},null,{"$f":"IF(B57=\"\",\"\",$C57+#REF!+#REF!)","v":""},{"$f":"IF(C57=\"\",\"\",$C57+#REF!+#REF!)","v":""}]
[null,{"$f":"IFERROR(INDEX('Manual Inputs'!M:M,SMALL(IF('Manual Inputs'!M:M<>\"\",ROW('Manual Inputs'!M:M)),ROW(54:54))),\"\")","v":""},{"$f":"IF(B58=\"\",\"\",IFERROR(INDEX('Seeding_quantities report'!$F$2:$F$10003,SMALL(IF('Seeding_quantities report'!$A$2:$A$10003=C$6,ROW('Seeding_quantities report'!$A$2:$A$10003)-1,\"\"),ROWS($B$8:$B58))),\"0\"))","v":""},null,{"$f":"IF(B58=\"\",\"\",$C58+#REF!+#REF!)","v":""},{"$f":"IF(C58=\"\",\"\",$C58+#REF!+#REF!)","v":""}]
[null,{"$f":"IFERROR(INDEX('Manual Inputs'!M:M,SMALL(IF('Manual Inputs'!M:M<>\"\",ROW('Manual Inputs'!M:M)),ROW(55:55))),\"\")","v":""},{"$f":"IF(B59=\"\",\"\",IFERROR(INDEX('Seeding_quantities report'!$F$2:$F$10003,SMALL(IF('Seeding_quantities report'!$A$2:$A$10003=C$6,ROW('Seeding_quantities report'!$A$2:$A$10003)-1,\"\"),ROWS($B$8:$B59))),\"0\"))","v":""},null,{"$f":"IF(B59=\"\",\"\",$C59+#REF!+#REF!)","v":""},{"$f":"IF(C59=\"\",\"\",$C59+#REF!+#REF!)","v":""}]
[null,{"$f":"IFERROR(INDEX('Manual Inputs'!M:M,SMALL(IF('Manual Inputs'!M:M<>\"\",ROW('Manual Inputs'!M:M)),ROW(56:56))),\"\")","v":""},{"$f":"IF(B60=\"\",\"\",IFERROR(INDEX('Seeding_quantities report'!$F$2:$F$10003,SMALL(IF('Seeding_quantities report'!$A$2:$A$10003=C$6,ROW('Seeding_quantities report'!$A$2:$A$10003)-1,\"\"),ROWS($B$8:$B60))),\"0\"))","v":""},null,{"$f":"IF(B60=\"\",\"\",$C60+#REF!+#REF!)","v":""},{"$f":"IF(C60=\"\",\"\",$C60+#REF!+#REF!)","v":""}]
[null,{"$f":"IFERROR(INDEX('Manual Inputs'!M:M,SMALL(IF('Manual Inputs'!M:M<>\"\",ROW('Manual Inputs'!M:M)),ROW(57:57))),\"\")","v":""},{"$f":"IF(B61=\"\",\"\",IFERROR(INDEX('Seeding_quantities report'!$F$2:$F$10003,SMALL(IF('Seeding_quantities report'!$A$2:$A$10003=C$6,ROW('Seeding_quantities report'!$A$2:$A$10003)-1,\"\"),ROWS($B$8:$B61))),\"0\"))","v":""},null,{"$f":"IF(B61=\"\",\"\",$C61+#REF!+#REF!)","v":""},{"$f":"IF(C61=\"\",\"\",$C61+#REF!+#REF!)","v":""}]
[null,{"$f":"IFERROR(INDEX('Manual Inputs'!M:M,SMALL(IF('Manual Inputs'!M:M<>\"\",ROW('Manual Inputs'!M:M)),ROW(58:58))),\"\")","v":""},{"$f":"IF(B62=\"\",\"\",IFERROR(INDEX('Seeding_quantities report'!$F$2:$F$10003,SMALL(IF('Seeding_quantities report'!$A$2:$A$10003=C$6,ROW('Seeding_quantities report'!$A$2:$A$10003)-1,\"\"),ROWS($B$8:$B62))),\"0\"))","v":""},null,{"$f":"IF(B62=\"\",\"\",$C62+#REF!+#REF!)","v":""},{"$f":"IF(C62=\"\",\"\",$C62+#REF!+#REF!)","v":""}]
[null,{"$f":"IFERROR(INDEX('Manual Inputs'!M:M,SMALL(IF('Manual Inputs'!M:M<>\"\",ROW('Manual Inputs'!M:M)),ROW(59:59))),\"\")","v":""},{"$f":"IF(B63=\"\",\"\",IFERROR(INDEX('Seeding_quantities report'!$F$2:$F$10003,SMALL(IF('Seeding_quantities report'!$A$2:$A$10003=C$6,ROW('Seeding_quantities report'!$A$2:$A$10003)-1,\"\"),ROWS($B$8:$B63))),\"0\"))","v":""},null,{"$f":"IF(B63=\"\",\"\",$C63+#REF!+#REF!)","v":""},{"$f":"IF(C63=\"\",\"\",$C63+#REF!+#REF!)","v":""}]
[null,{"$f":"IFERROR(INDEX('Manual Inputs'!M:M,SMALL(IF('Manual Inputs'!M:M<>\"\",ROW('Manual Inputs'!M:M)),ROW(60:60))),\"\")","v":""},{"$f":"IF(B64=\"\",\"\",IFERROR(INDEX('Seeding_quantities report'!$F$2:$F$10003,SMALL(IF('Seeding_quantities report'!$A$2:$A$10003=C$6,ROW('Seeding_quantities report'!$A$2:$A$10003)-1,\"\"),ROWS($B$8:$B64))),\"0\"))","v":""},null,{"$f":"IF(B64=\"\",\"\",$C64+#REF!+#REF!)","v":""},{"$f":"IF(C64=\"\",\"\",$C64+#REF!+#REF!)","v":""}]
[null,{"$f":"IFERROR(INDEX('Manual Inputs'!M:M,SMALL(IF('Manual Inputs'!M:M<>\"\",ROW('Manual Inputs'!M:M)),ROW(61:61))),\"\")","v":""},{"$f":"IF(B65=\"\",\"\",IFERROR(INDEX('Seeding_quantities report'!$F$2:$F$10003,SMALL(IF('Seeding_quantities report'!$A$2:$A$10003=C$6,ROW('Seeding_quantities report'!$A$2:$A$10003)-1,\"\"),ROWS($B$8:$B65))),\"0\"))","v":""},null,{"$f":"IF(B65=\"\",\"\",$C65+#REF!+#REF!)","v":""},{"$f":"IF(C65=\"\",\"\",$C65+#REF!+#REF!)","v":""}]
[null,{"$f":"IFERROR(INDEX('Manual Inputs'!M:M,SMALL(IF('Manual Inputs'!M:M<>\"\",ROW('Manual Inputs'!M:M)),ROW(62:62))),\"\")","v":""},{"$f":"IF(B66=\"\",\"\",IFERROR(INDEX('Seeding_quantities report'!$F$2:$F$10003,SMALL(IF('Seeding_quantities report'!$A$2:$A$10003=C$6,ROW('Seeding_quantities report'!$A$2:$A$10003)-1,\"\"),ROWS($B$8:$B66))),\"0\"))","v":""},null,{"$f":"IF(B66=\"\",\"\",$C66+#REF!+#REF!)","v":""},{"$f":"IF(C66=\"\",\"\",$C66+#REF!+#REF!)","v":""}]
[null,{"$f":"IFERROR(INDEX('Manual Inputs'!M:M,SMALL(IF('Manual Inputs'!M:M<>\"\",ROW('Manual Inputs'!M:M)),ROW(63:63))),\"\")","v":""},{"$f":"IF(B67=\"\",\"\",IFERROR(INDEX('Seeding_quantities report'!$F$2:$F$10003,SMALL(IF('Seeding_quantities report'!$A$2:$A$10003=C$6,ROW('Seeding_quantities report'!$A$2:$A$10003)-1,\"\"),ROWS($B$8:$B67))),\"0\"))","v":""},null,{"$f":"IF(B67=\"\",\"\",$C67+#REF!+#REF!)","v":""},{"$f":"IF(C67=\"\",\"\",$C67+#REF!+#REF!)","v":""}]
[null,{"$f":"IFERROR(INDEX('Manual Inputs'!M:M,SMALL(IF('Manual Inputs'!M:M<>\"\",ROW('Manual Inputs'!M:M)),ROW(64:64))),\"\")","v":""},{"$f":"IF(B68=\"\",\"\",IFERROR(INDEX('Seeding_quantities report'!$F$2:$F$10003,SMALL(IF('Seeding_quantities report'!$A$2:$A$10003=C$6,ROW('Seeding_quantities report'!$A$2:$A$10003)-1,\"\"),ROWS($B$8:$B68))),\"0\"))","v":""},null,{"$f":"IF(B68=\"\",\"\",$C68+#REF!+#REF!)","v":""},{"$f":"IF(C68=\"\",\"\",$C68+#REF!+#REF!)","v":""}]
[null,{"$f":"IFERROR(INDEX('Manual Inputs'!M:M,SMALL(IF('Manual Inputs'!M:M<>\"\",ROW('Manual Inputs'!M:M)),ROW(65:65))),\"\")","v":""},{"$f":"IF(B69=\"\",\"\",IFERROR(INDEX('Seeding_quantities report'!$F$2:$F$10003,SMALL(IF('Seeding_quantities report'!$A$2:$A$10003=C$6,ROW('Seeding_quantities report'!$A$2:$A$10003)-1,\"\"),ROWS($B$8:$B69))),\"0\"))","v":""},null,{"$f":"IF(B69=\"\",\"\",$C69+#REF!+#REF!)","v":""},{"$f":"IF(C69=\"\",\"\",$C69+#REF!+#REF!)","v":""}]
[null,{"$f":"IFERROR(INDEX('Manual Inputs'!M:M,SMALL(IF('Manual Inputs'!M:M<>\"\",ROW('Manual Inputs'!M:M)),ROW(66:66))),\"\")","v":""},{"$f":"IF(B70=\"\",\"\",IFERROR(INDEX('Seeding_quantities report'!$F$2:$F$10003,SMALL(IF('Seeding_quantities report'!$A$2:$A$10003=C$6,ROW('Seeding_quantities report'!$A$2:$A$10003)-1,\"\"),ROWS($B$8:$B70))),\"0\"))","v":""},null,{"$f":"IF(B70=\"\",\"\",$C70+#REF!+#REF!)","v":""},{"$f":"IF(C70=\"\",\"\",$C70+#REF!+#REF!)","v":""}]
[null,{"$f":"IFERROR(INDEX('Manual Inputs'!M:M,SMALL(IF('Manual Inputs'!M:M<>\"\",ROW('Manual Inputs'!M:M)),ROW(67:67))),\"\")","v":""},{"$f":"IF(B71=\"\",\"\",IFERROR(INDEX('Seeding_quantities report'!$F$2:$F$10003,SMALL(IF('Seeding_quantities report'!$A$2:$A$10003=C$6,ROW('Seeding_quantities report'!$A$2:$A$10003)-1,\"\"),ROWS($B$8:$B71))),\"0\"))","v":""},null,{"$f":"IF(B71=\"\",\"\",$C71+#REF!+#REF!)","v":""},{"$f":"IF(C71=\"\",\"\",$C71+#REF!+#REF!)","v":""}]
[null,{"$f":"IFERROR(INDEX('Manual Inputs'!M:M,SMALL(IF('Manual Inputs'!M:M<>\"\",ROW('Manual Inputs'!M:M)),ROW(68:68))),\"\")","v":""},{"$f":"IF(B72=\"\",\"\",IFERROR(INDEX('Seeding_quantities report'!$F$2:$F$10003,SMALL(IF('Seeding_quantities report'!$A$2:$A$10003=C$6,ROW('Seeding_quantities report'!$A$2:$A$10003)-1,\"\"),ROWS($B$8:$B72))),\"0\"))","v":""},null,{"$f":"IF(B72=\"\",\"\",$C72+#REF!+#REF!)","v":""},{"$f":"IF(C72=\"\",\"\",$C72+#REF!+#REF!)","v":""}]
[null,{"$f":"IFERROR(INDEX('Manual Inputs'!M:M,SMALL(IF('Manual Inputs'!M:M<>\"\",ROW('Manual Inputs'!M:M)),ROW(69:69))),\"\")","v":""},{"$f":"IF(B73=\"\",\"\",IFERROR(INDEX('Seeding_quantities report'!$F$2:$F$10003,SMALL(IF('Seeding_quantities report'!$A$2:$A$10003=C$6,ROW('Seeding_quantities report'!$A$2:$A$10003)-1,\"\"),ROWS($B$8:$B73))),\"0\"))","v":""},null,{"$f":"IF(B73=\"\",\"\",$C73+#REF!+#REF!)","v":""},{"$f":"IF(C73=\"\",\"\",$C73+#REF!+#REF!)","v":""}]
[null,{"$f":"IFERROR(INDEX('Manual Inputs'!M:M,SMALL(IF('Manual Inputs'!M:M<>\"\",ROW('Manual Inputs'!M:M)),ROW(70:70))),\"\")","v":""},{"$f":"IF(B74=\"\",\"\",IFERROR(INDEX('Seeding_quantities report'!$F$2:$F$10003,SMALL(IF('Seeding_quantities report'!$A$2:$A$10003=C$6,ROW('Seeding_quantities report'!$A$2:$A$10003)-1,\"\"),ROWS($B$8:$B74))),\"0\"))","v":""},null,{"$f":"IF(B74=\"\",\"\",$C74+#REF!+#REF!)","v":""},{"$f":"IF(C74=\"\",\"\",$C74+#REF!+#REF!)","v":""}]
[null,{"$f":"IFERROR(INDEX('Manual Inputs'!M:M,SMALL(IF('Manual Inputs'!M:M<>\"\",ROW('Manual Inputs'!M:M)),ROW(71:71))),\"\")","v":""},{"$f":"IF(B75=\"\",\"\",IFERROR(INDEX('Seeding_quantities report'!$F$2:$F$10003,SMALL(IF('Seeding_quantities report'!$A$2:$A$10003=C$6,ROW('Seeding_quantities report'!$A$2:$A$10003)-1,\"\"),ROWS($B$8:$B75))),\"0\"))","v":""},null,{"$f":"IF(B75=\"\",\"\",$C75+#REF!+#REF!)","v":""},{"$f":"IF(C75=\"\",\"\",$C75+#REF!+#REF!)","v":""}]
[null,{"$f":"IFERROR(INDEX('Manual Inputs'!M:M,SMALL(IF('Manual Inputs'!M:M<>\"\",ROW('Manual Inputs'!M:M)),ROW(72:72))),\"\")","v":""},{"$f":"IF(B76=\"\",\"\",IFERROR(INDEX('Seeding_quantities report'!$F$2:$F$10003,SMALL(IF('Seeding_quantities report'!$A$2:$A$10003=C$6,ROW('Seeding_quantities report'!$A$2:$A$10003)-1,\"\"),ROWS($B$8:$B76))),\"0\"))","v":""},null,{"$f":"IF(B76=\"\",\"\",$C76+#REF!+#REF!)","v":""},{"$f":"IF(C76=\"\",\"\",$C76+#REF!+#REF!)","v":""}]
[null,{"$f":"IFERROR(INDEX('Manual Inputs'!M:M,SMALL(IF('Manual Inputs'!M:M<>\"\",ROW('Manual Inputs'!M:M)),ROW(73:73))),\"\")","v":""},{"$f":"IF(B77=\"\",\"\",IFERROR(INDEX('Seeding_quantities report'!$F$2:$F$10003,SMALL(IF('Seeding_quantities report'!$A$2:$A$10003=C$6,ROW('Seeding_quantities report'!$A$2:$A$10003)-1,\"\"),ROWS($B$8:$B77))),\"0\"))","v":""},null,{"$f":"IF(B77=\"\",\"\",$C77+#REF!+#REF!)","v":""},{"$f":"IF(C77=\"\",\"\",$C77+#REF!+#REF!)","v":""}]
[null,{"$f":"IFERROR(INDEX('Manual Inputs'!M:M,SMALL(IF('Manual Inputs'!M:M<>\"\",ROW('Manual Inputs'!M:M)),ROW(74:74))),\"\")","v":""},{"$f":"IF(B78=\"\",\"\",IFERROR(INDEX('Seeding_quantities report'!$F$2:$F$10003,SMALL(IF('Seeding_quantities report'!$A$2:$A$10003=C$6,ROW('Seeding_quantities report'!$A$2:$A$10003)-1,\"\"),ROWS($B$8:$B78))),\"0\"))","v":""},null,{"$f":"IF(B78=\"\",\"\",$C78+#REF!+#REF!)","v":""},{"$f":"IF(C78=\"\",\"\",$C78+#REF!+#REF!)","v":""}]
[null,{"$f":"IFERROR(INDEX('Manual Inputs'!M:M,SMALL(IF('Manual Inputs'!M:M<>\"\",ROW('Manual Inputs'!M:M)),ROW(75:75))),\"\")","v":""},{"$f":"IF(B79=\"\",\"\",IFERROR(INDEX('Seeding_quantities report'!$F$2:$F$10003,SMALL(IF('Seeding_quantities report'!$A$2:$A$10003=C$6,ROW('Seeding_quantities report'!$A$2:$A$10003)-1,\"\"),ROWS($B$8:$B79))),\"0\"))","v":""},null,{"$f":"IF(B79=\"\",\"\",$C79+#REF!+#REF!)","v":""},{"$f":"IF(C79=\"\",\"\",$C79+#REF!+#REF!)","v":""}]
[null,{"$f":"IFERROR(INDEX('Manual Inputs'!M:M,SMALL(IF('Manual Inputs'!M:M<>\"\",ROW('Manual Inputs'!M:M)),ROW(76:76))),\"\")","v":""},{"$f":"IF(B80=\"\",\"\",IFERROR(INDEX('Seeding_quantities report'!$F$2:$F$10003,SMALL(IF('Seeding_quantities report'!$A$2:$A$10003=C$6,ROW('Seeding_quantities report'!$A$2:$A$10003)-1,\"\"),ROWS($B$8:$B80))),\"0\"))","v":""},null,{"$f":"IF(B80=\"\",\"\",$C80+#REF!+#REF!)","v":""},{"$f":"IF(C80=\"\",\"\",$C80+#REF!+#REF!)","v":""}]
[null,{"$f":"IFERROR(INDEX('Manual Inputs'!M:M,SMALL(IF('Manual Inputs'!M:M<>\"\",ROW('Manual Inputs'!M:M)),ROW(77:77))),\"\")","v":""},{"$f":"IF(B81=\"\",\"\",IFERROR(INDEX('Seeding_quantities report'!$F$2:$F$10003,SMALL(IF('Seeding_quantities report'!$A$2:$A$10003=C$6,ROW('Seeding_quantities report'!$A$2:$A$10003)-1,\"\"),ROWS($B$8:$B81))),\"0\"))","v":""},null,{"$f":"IF(B81=\"\",\"\",$C81+#REF!+#REF!)","v":""},{"$f":"IF(C81=\"\",\"\",$C81+#REF!+#REF!)","v":""}]
[null,{"$f":"IFERROR(INDEX('Manual Inputs'!M:M,SMALL(IF('Manual Inputs'!M:M<>\"\",ROW('Manual Inputs'!M:M)),ROW(78:78))),\"\")","v":""},{"$f":"IF(B82=\"\",\"\",IFERROR(INDEX('Seeding_quantities report'!$F$2:$F$10003,SMALL(IF('Seeding_quantities report'!$A$2:$A$10003=C$6,ROW('Seeding_quantities report'!$A$2:$A$10003)-1,\"\"),ROWS($B$8:$B82))),\"0\"))","v":""},null,{"$f":"IF(B82=\"\",\"\",$C82+#REF!+#REF!)","v":""},{"$f":"IF(C82=\"\",\"\",$C82+#REF!+#REF!)","v":""}]
[null,{"$f":"IFERROR(INDEX('Manual Inputs'!M:M,SMALL(IF('Manual Inputs'!M:M<>\"\",ROW('Manual Inputs'!M:M)),ROW(79:79))),\"\")","v":""},{"$f":"IF(B83=\"\",\"\",IFERROR(INDEX('Seeding_quantities report'!$F$2:$F$10003,SMALL(IF('Seeding_quantities report'!$A$2:$A$10003=C$6,ROW('Seeding_quantities report'!$A$2:$A$10003)-1,\"\"),ROWS($B$8:$B83))),\"0\"))","v":""},null,{"$f":"IF(B83=\"\",\"\",$C83+#REF!+#REF!)","v":""},{"$f":"IF(C83=\"\",\"\",$C83+#REF!+#REF!)","v":""}]
[null,{"$f":"IFERROR(INDEX('Manual Inputs'!M:M,SMALL(IF('Manual Inputs'!M:M<>\"\",ROW('Manual Inputs'!M:M)),ROW(80:80))),\"\")","v":""},{"$f":"IF(B84=\"\",\"\",IFERROR(INDEX('Seeding_quantities report'!$F$2:$F$10003,SMALL(IF('Seeding_quantities report'!$A$2:$A$10003=C$6,ROW('Seeding_quantities report'!$A$2:$A$10003)-1,\"\"),ROWS($B$8:$B84))),\"0\"))","v":""},null,{"$f":"IF(B84=\"\",\"\",$C84+#REF!+#REF!)","v":""},{"$f":"IF(C84=\"\",\"\",$C84+#REF!+#REF!)","v":""}]
[null,{"$f":"IFERROR(INDEX('Manual Inputs'!M:M,SMALL(IF('Manual Inputs'!M:M<>\"\",ROW('Manual Inputs'!M:M)),ROW(81:81))),\"\")","v":""},{"$f":"IF(B85=\"\",\"\",IFERROR(INDEX('Seeding_quantities report'!$F$2:$F$10003,SMALL(IF('Seeding_quantities report'!$A$2:$A$10003=C$6,ROW('Seeding_quantities report'!$A$2:$A$10003)-1,\"\"),ROWS($B$8:$B85))),\"0\"))","v":""},null,{"$f":"IF(B85=\"\",\"\",$C85+#REF!+#REF!)","v":""},{"$f":"IF(C85=\"\",\"\",$C85+#REF!+#REF!)","v":""}]
[null,{"$f":"IFERROR(INDEX('Manual Inputs'!M:M,SMALL(IF('Manual Inputs'!M:M<>\"\",ROW('Manual Inputs'!M:M)),ROW(82:82))),\"\")","v":""},{"$f":"IF(B86=\"\",\"\",IFERROR(INDEX('Seeding_quantities report'!$F$2:$F$10003,SMALL(IF('Seeding_quantities report'!$A$2:$A$10003=C$6,ROW('Seeding_quantities report'!$A$2:$A$10003)-1,\"\"),ROWS($B$8:$B86))),\"0\"))","v":""},null,{"$f":"IF(B86=\"\",\"\",$C86+#REF!+#REF!)","v":""},{"$f":"IF(C86=\"\",\"\",$C86+#REF!+#REF!)","v":""}]
[null,{"$f":"IFERROR(INDEX('Manual Inputs'!M:M,SMALL(IF('Manual Inputs'!M:M<>\"\",ROW('Manual Inputs'!M:M)),ROW(83:83))),\"\")","v":""},{"$f":"IF(B87=\"\",\"\",IFERROR(INDEX('Seeding_quantities report'!$F$2:$F$10003,SMALL(IF('Seeding_quantities report'!$A$2:$A$10003=C$6,ROW('Seeding_quantities report'!$A$2:$A$10003)-1,\"\"),ROWS($B$8:$B87))),\"0\"))","v":""},null,{"$f":"IF(B87=\"\",\"\",$C87+#REF!+#REF!)","v":""},{"$f":"IF(C87=\"\",\"\",$C87+#REF!+#REF!)","v":""}]
[null,{"$f":"IFERROR(INDEX('Manual Inputs'!M:M,SMALL(IF('Manual Inputs'!M:M<>\"\",ROW('Manual Inputs'!M:M)),ROW(84:84))),\"\")","v":""},{"$f":"IF(B88=\"\",\"\",IFERROR(INDEX('Seeding_quantities report'!$F$2:$F$10003,SMALL(IF('Seeding_quantities report'!$A$2:$A$10003=C$6,ROW('Seeding_quantities report'!$A$2:$A$10003)-1,\"\"),ROWS($B$8:$B88))),\"0\"))","v":""},null,{"$f":"IF(B88=\"\",\"\",$C88+#REF!+#REF!)","v":""},{"$f":"IF(C88=\"\",\"\",$C88+#REF!+#REF!)","v":""}]
[null,{"$f":"IFERROR(INDEX('Manual Inputs'!M:M,SMALL(IF('Manual Inputs'!M:M<>\"\",ROW('Manual Inputs'!M:M)),ROW(85:85))),\"\")","v":""},{"$f":"IF(B89=\"\",\"\",IFERROR(INDEX('Seeding_quantities report'!$F$2:$F$10003,SMALL(IF('Seeding_quantities report'!$A$2:$A$10003=C$6,ROW('Seeding_quantities report'!$A$2:$A$10003)-1,\"\"),ROWS($B$8:$B89))),\"0\"))","v":""},null,{"$f":"IF(B89=\"\",\"\",$C89+#REF!+#REF!)","v":""},{"$f":"IF(C89=\"\",\"\",$C89+#REF!+#REF!)","v":""}]
[null,{"$f":"IFERROR(INDEX('Manual Inputs'!M:M,SMALL(IF('Manual Inputs'!M:M<>\"\",ROW('Manual Inputs'!M:M)),ROW(86:86))),\"\")","v":""},{"$f":"IF(B90=\"\",\"\",IFERROR(INDEX('Seeding_quantities report'!$F$2:$F$10003,SMALL(IF('Seeding_quantities report'!$A$2:$A$10003=C$6,ROW('Seeding_quantities report'!$A$2:$A$10003)-1,\"\"),ROWS($B$8:$B90))),\"0\"))","v":""},null,{"$f":"IF(B90=\"\",\"\",$C90+#REF!+#REF!)","v":""},{"$f":"IF(C90=\"\",\"\",$C90+#REF!+#REF!)","v":""}]
[null,{"$f":"IFERROR(INDEX('Manual Inputs'!M:M,SMALL(IF('Manual Inputs'!M:M<>\"\",ROW('Manual Inputs'!M:M)),ROW(87:87))),\"\")","v":""},{"$f":"IF(B91=\"\",\"\",IFERROR(INDEX('Seeding_quantities report'!$F$2:$F$10003,SMALL(IF('Seeding_quantities report'!$A$2:$A$10003=C$6,ROW('Seeding_quantities report'!$A$2:$A$10003)-1,\"\"),ROWS($B$8:$B91))),\"0\"))","v":""},null,{"$f":"IF(B91=\"\",\"\",$C91+#REF!+#REF!)","v":""},{"$f":"IF(C91=\"\",\"\",$C91+#REF!+#REF!)","v":""}]
[null,{"$f":"IFERROR(INDEX('Manual Inputs'!M:M,SMALL(IF('Manual Inputs'!M:M<>\"\",ROW('Manual Inputs'!M:M)),ROW(88:88))),\"\")","v":""},{"$f":"IF(B92=\"\",\"\",IFERROR(INDEX('Seeding_quantities report'!$F$2:$F$10003,SMALL(IF('Seeding_quantities report'!$A$2:$A$10003=C$6,ROW('Seeding_quantities report'!$A$2:$A$10003)-1,\"\"),ROWS($B$8:$B92))),\"0\"))","v":""},null,{"$f":"IF(B92=\"\",\"\",$C92+#REF!+#REF!)","v":""},{"$f":"IF(C92=\"\",\"\",$C92+#REF!+#REF!)","v":""}]
[null,{"$f":"IFERROR(INDEX('Manual Inputs'!M:M,SMALL(IF('Manual Inputs'!M:M<>\"\",ROW('Manual Inputs'!M:M)),ROW(89:89))),\"\")","v":""},{"$f":"IF(B93=\"\",\"\",IFERROR(INDEX('Seeding_quantities report'!$F$2:$F$10003,SMALL(IF('Seeding_quantities report'!$A$2:$A$10003=C$6,ROW('Seeding_quantities report'!$A$2:$A$10003)-1,\"\"),ROWS($B$8:$B93))),\"0\"))","v":""},null,{"$f":"IF(B93=\"\",\"\",$C93+#REF!+#REF!)","v":""},{"$f":"IF(C93=\"\",\"\",$C93+#REF!+#REF!)","v":""}]
[null,{"$f":"IFERROR(INDEX('Manual Inputs'!M:M,SMALL(IF('Manual Inputs'!M:M<>\"\",ROW('Manual Inputs'!M:M)),ROW(90:90))),\"\")","v":""},{"$f":"IF(B94=\"\",\"\",IFERROR(INDEX('Seeding_quantities report'!$F$2:$F$10003,SMALL(IF('Seeding_quantities report'!$A$2:$A$10003=C$6,ROW('Seeding_quantities report'!$A$2:$A$10003)-1,\"\"),ROWS($B$8:$B94))),\"0\"))","v":""},null,{"$f":"IF(B94=\"\",\"\",$C94+#REF!+#REF!)","v":""},{"$f":"IF(C94=\"\",\"\",$C94+#REF!+#REF!)","v":""}]
[null,{"$f":"IFERROR(INDEX('Manual Inputs'!M:M,SMALL(IF('Manual Inputs'!M:M<>\"\",ROW('Manual Inputs'!M:M)),ROW(91:91))),\"\")","v":""},{"$f":"IF(B95=\"\",\"\",IFERROR(INDEX('Seeding_quantities report'!$F$2:$F$10003,SMALL(IF('Seeding_quantities report'!$A$2:$A$10003=C$6,ROW('Seeding_quantities report'!$A$2:$A$10003)-1,\"\"),ROWS($B$8:$B95))),\"0\"))","v":""},null,{"$f":"IF(B95=\"\",\"\",$C95+#REF!+#REF!)","v":""},{"$f":"IF(C95=\"\",\"\",$C95+#REF!+#REF!)","v":""}]
[null,{"$f":"IFERROR(INDEX('Manual Inputs'!M:M,SMALL(IF('Manual Inputs'!M:M<>\"\",ROW('Manual Inputs'!M:M)),ROW(92:92))),\"\")","v":""},{"$f":"IF(B96=\"\",\"\",IFERROR(INDEX('Seeding_quantities report'!$F$2:$F$10003,SMALL(IF('Seeding_quantities report'!$A$2:$A$10003=C$6,ROW('Seeding_quantities report'!$A$2:$A$10003)-1,\"\"),ROWS($B$8:$B96))),\"0\"))","v":""},null,{"$f":"IF(B96=\"\",\"\",$C96+#REF!+#REF!)","v":""},{"$f":"IF(C96=\"\",\"\",$C96+#REF!+#REF!)","v":""}]
[null,{"$f":"IFERROR(INDEX('Manual Inputs'!M:M,SMALL(IF('Manual Inputs'!M:M<>\"\",ROW('Manual Inputs'!M:M)),ROW(93:93))),\"\")","v":""},{"$f":"IF(B97=\"\",\"\",IFERROR(INDEX('Seeding_quantities report'!$F$2:$F$10003,SMALL(IF('Seeding_quantities report'!$A$2:$A$10003=C$6,ROW('Seeding_quantities report'!$A$2:$A$10003)-1,\"\"),ROWS($B$8:$B97))),\"0\"))","v":""},null,{"$f":"IF(B97=\"\",\"\",$C97+#REF!+#REF!)","v":""},{"$f":"IF(C97=\"\",\"\",$C97+#REF!+#REF!)","v":""}]
[null,{"$f":"IFERROR(INDEX('Manual Inputs'!M:M,SMALL(IF('Manual Inputs'!M:M<>\"\",ROW('Manual Inputs'!M:M)),ROW(94:94))),\"\")","v":""},{"$f":"IF(B98=\"\",\"\",IFERROR(INDEX('Seeding_quantities report'!$F$2:$F$10003,SMALL(IF('Seeding_quantities report'!$A$2:$A$10003=C$6,ROW('Seeding_quantities report'!$A$2:$A$10003)-1,\"\"),ROWS($B$8:$B98))),\"0\"))","v":""},null,{"$f":"IF(B98=\"\",\"\",$C98+#REF!+#REF!)","v":""},{"$f":"IF(C98=\"\",\"\",$C98+#REF!+#REF!)","v":""}]
[null,{"$f":"IFERROR(INDEX('Manual Inputs'!M:M,SMALL(IF('Manual Inputs'!M:M<>\"\",ROW('Manual Inputs'!M:M)),ROW(95:95))),\"\")","v":""},{"$f":"IF(B99=\"\",\"\",IFERROR(INDEX('Seeding_quantities report'!$F$2:$F$10003,SMALL(IF('Seeding_quantities report'!$A$2:$A$10003=C$6,ROW('Seeding_quantities report'!$A$2:$A$10003)-1,\"\"),ROWS($B$8:$B99))),\"0\"))","v":""},null,{"$f":"IF(B99=\"\",\"\",$C99+#REF!+#REF!)","v":""},{"$f":"IF(C99=\"\",\"\",$C99+#REF!+#REF!)","v":""}]
[null,{"$f":"IFERROR(INDEX('Manual Inputs'!M:M,SMALL(IF('Manual Inputs'!M:M<>\"\",ROW('Manual Inputs'!M:M)),ROW(96:96))),\"\")","v":""},{"$f":"IF(B100=\"\",\"\",IFERROR(INDEX('Seeding_quantities report'!$F$2:$F$10003,SMALL(IF('Seeding_quantities report'!$A$2:$A$10003=C$6,ROW('Seeding_quantities report'!$A$2:$A$10003)-1,\"\"),ROWS($B$8:$B100))),\"0\"))","v":""},null,{"$f":"IF(B100=\"\",\"\",$C100+#REF!+#REF!)","v":""},{"$f":"IF(C100=\"\",\"\",$C100+#REF!+#REF!)","v":""}]
[null,{"$f":"IFERROR(INDEX('Manual Inputs'!M:M,SMALL(IF('Manual Inputs'!M:M<>\"\",ROW('Manual Inputs'!M:M)),ROW(97:97))),\"\")","v":""},{"$f":"IF(B101=\"\",\"\",IFERROR(INDEX('Seeding_quantities report'!$F$2:$F$10003,SMALL(IF('Seeding_quantities report'!$A$2:$A$10003=C$6,ROW('Seeding_quantities report'!$A$2:$A$10003)-1,\"\"),ROWS($B$8:$B101))),\"0\"))","v":""},null,{"$f":"IF(B101=\"\",\"\",$C101+#REF!+#REF!)","v":""},{"$f":"IF(C101=\"\",\"\",$C101+#REF!+#REF!)","v":""}]
[null,{"$f":"IFERROR(INDEX('Manual Inputs'!M:M,SMALL(IF('Manual Inputs'!M:M<>\"\",ROW('Manual Inputs'!M:M)),ROW(98:98))),\"\")","v":""},{"$f":"IF(B102=\"\",\"\",IFERROR(INDEX('Seeding_quantities report'!$F$2:$F$10003,SMALL(IF('Seeding_quantities report'!$A$2:$A$10003=C$6,ROW('Seeding_quantities report'!$A$2:$A$10003)-1,\"\"),ROWS($B$8:$B102))),\"0\"))","v":""},null,{"$f":"IF(B102=\"\",\"\",$C102+#REF!+#REF!)","v":""},{"$f":"IF(C102=\"\",\"\",$C102+#REF!+#REF!)","v":""}]
[null,{"$f":"IFERROR(INDEX('Manual Inputs'!M:M,SMALL(IF('Manual Inputs'!M:M<>\"\",ROW('Manual Inputs'!M:M)),ROW(99:99))),\"\")","v":""},{"$f":"IF(B103=\"\",\"\",IFERROR(INDEX('Seeding_quantities report'!$F$2:$F$10003,SMALL(IF('Seeding_quantities report'!$A$2:$A$10003=C$6,ROW('Seeding_quantities report'!$A$2:$A$10003)-1,\"\"),ROWS($B$8:$B103))),\"0\"))","v":""},null,{"$f":"IF(B103=\"\",\"\",$C103+#REF!+#REF!)","v":""},{"$f":"IF(C103=\"\",\"\",$C103+#REF!+#REF!)","v":""}]
[null,{"$f":"IFERROR(INDEX('Manual Inputs'!M:M,SMALL(IF('Manual Inputs'!M:M<>\"\",ROW('Manual Inputs'!M:M)),ROW(100:100))),\"\")","v":""},{"$f":"IF(B104=\"\",\"\",IFERROR(INDEX('Seeding_quantities report'!$F$2:$F$10003,SMALL(IF('Seeding_quantities report'!$A$2:$A$10003=C$6,ROW('Seeding_quantities report'!$A$2:$A$10003)-1,\"\"),ROWS($B$8:$B104))),\"0\"))","v":""},null,{"$f":"IF(B104=\"\",\"\",$C104+#REF!+#REF!)","v":""},{"$f":"IF(C104=\"\",\"\",$C104+#REF!+#REF!)","v":""}]
[null,{"$f":"IFERROR(INDEX('Manual Inputs'!M:M,SMALL(IF('Manual Inputs'!M:M<>\"\",ROW('Manual Inputs'!M:M)),ROW(101:101))),\"\")","v":""},{"$f":"IF(B105=\"\",\"\",IFERROR(INDEX('Seeding_quantities report'!$F$2:$F$10003,SMALL(IF('Seeding_quantities report'!$A$2:$A$10003=C$6,ROW('Seeding_quantities report'!$A$2:$A$10003)-1,\"\"),ROWS($B$8:$B105))),\"0\"))","v":""},null,{"$f":"IF(B105=\"\",\"\",$C105+#REF!+#REF!)","v":""},{"$f":"IF(C105=\"\",\"\",$C105+#REF!+#REF!)","v":""}]
[null,{"$f":"IFERROR(INDEX('Manual Inputs'!M:M,SMALL(IF('Manual Inputs'!M:M<>\"\",ROW('Manual Inputs'!M:M)),ROW(102:102))),\"\")","v":""},{"$f":"IF(B106=\"\",\"\",IFERROR(INDEX('Seeding_quantities report'!$F$2:$F$10003,SMALL(IF('Seeding_quantities report'!$A$2:$A$10003=C$6,ROW('Seeding_quantities report'!$A$2:$A$10003)-1,\"\"),ROWS($B$8:$B106))),\"0\"))","v":""},null,{"$f":"IF(B106=\"\",\"\",$C106+#REF!+#REF!)","v":""},{"$f":"IF(C106=\"\",\"\",$C106+#REF!+#REF!)","v":""}]
[null,{"$f":"IFERROR(INDEX('Manual Inputs'!M:M,SMALL(IF('Manual Inputs'!M:M<>\"\",ROW('Manual Inputs'!M:M)),ROW(103:103))),\"\")","v":""},{"$f":"IF(B107=\"\",\"\",IFERROR(INDEX('Seeding_quantities report'!$F$2:$F$10003,SMALL(IF('Seeding_quantities report'!$A$2:$A$10003=C$6,ROW('Seeding_quantities report'!$A$2:$A$10003)-1,\"\"),ROWS($B$8:$B107))),\"0\"))","v":""},null,{"$f":"IF(B107=\"\",\"\",$C107+#REF!+#REF!)","v":""},{"$f":"IF(C107=\"\",\"\",$C107+#REF!+#REF!)","v":""}]
[null,{"$f":"IFERROR(INDEX('Manual Inputs'!M:M,SMALL(IF('Manual Inputs'!M:M<>\"\",ROW('Manual Inputs'!M:M)),ROW(104:104))),\"\")","v":""},{"$f":"IF(B108=\"\",\"\",IFERROR(INDEX('Seeding_quantities report'!$F$2:$F$10003,SMALL(IF('Seeding_quantities report'!$A$2:$A$10003=C$6,ROW('Seeding_quantities report'!$A$2:$A$10003)-1,\"\"),ROWS($B$8:$B108))),\"0\"))","v":""},null,{"$f":"IF(B108=\"\",\"\",$C108+#REF!+#REF!)","v":""},{"$f":"IF(C108=\"\",\"\",$C108+#REF!+#REF!)","v":""}]
[null,{"$f":"IFERROR(INDEX('Manual Inputs'!M:M,SMALL(IF('Manual Inputs'!M:M<>\"\",ROW('Manual Inputs'!M:M)),ROW(105:105))),\"\")","v":""},{"$f":"IF(B109=\"\",\"\",IFERROR(INDEX('Seeding_quantities report'!$F$2:$F$10003,SMALL(IF('Seeding_quantities report'!$A$2:$A$10003=C$6,ROW('Seeding_quantities report'!$A$2:$A$10003)-1,\"\"),ROWS($B$8:$B109))),\"0\"))","v":""},null,{"$f":"IF(B109=\"\",\"\",$C109+#REF!+#REF!)","v":""},{"$f":"IF(C109=\"\",\"\",$C109+#REF!+#REF!)","v":""}]
[null,{"$f":"IFERROR(INDEX('Manual Inputs'!M:M,SMALL(IF('Manual Inputs'!M:M<>\"\",ROW('Manual Inputs'!M:M)),ROW(106:106))),\"\")","v":""},{"$f":"IF(B110=\"\",\"\",IFERROR(INDEX('Seeding_quantities report'!$F$2:$F$10003,SMALL(IF('Seeding_quantities report'!$A$2:$A$10003=C$6,ROW('Seeding_quantities report'!$A$2:$A$10003)-1,\"\"),ROWS($B$8:$B110))),\"0\"))","v":""},null,{"$f":"IF(B110=\"\",\"\",$C110+#REF!+#REF!)","v":""},{"$f":"IF(C110=\"\",\"\",$C110+#REF!+#REF!)","v":""}]
[null,{"$f":"IFERROR(INDEX('Manual Inputs'!M:M,SMALL(IF('Manual Inputs'!M:M<>\"\",ROW('Manual Inputs'!M:M)),ROW(107:107))),\"\")","v":""},{"$f":"IF(B111=\"\",\"\",IFERROR(INDEX('Seeding_quantities report'!$F$2:$F$10003,SMALL(IF('Seeding_quantities report'!$A$2:$A$10003=C$6,ROW('Seeding_quantities report'!$A$2:$A$10003)-1,\"\"),ROWS($B$8:$B111))),\"0\"))","v":""},null,{"$f":"IF(B111=\"\",\"\",$C111+#REF!+#REF!)","v":""},{"$f":"IF(C111=\"\",\"\",$C111+#REF!+#REF!)","v":""}]
[null,{"$f":"IFERROR(INDEX('Manual Inputs'!M:M,SMALL(IF('Manual Inputs'!M:M<>\"\",ROW('Manual Inputs'!M:M)),ROW(108:108))),\"\")","v":""},{"$f":"IF(B112=\"\",\"\",IFERROR(INDEX('Seeding_quantities report'!$F$2:$F$10003,SMALL(IF('Seeding_quantities report'!$A$2:$A$10003=C$6,ROW('Seeding_quantities report'!$A$2:$A$10003)-1,\"\"),ROWS($B$8:$B112))),\"0\"))","v":""},null,{"$f":"IF(B112=\"\",\"\",$C112+#REF!+#REF!)","v":""},{"$f":"IF(C112=\"\",\"\",$C112+#REF!+#REF!)","v":""}]
[null,{"$f":"IFERROR(INDEX('Manual Inputs'!M:M,SMALL(IF('Manual Inputs'!M:M<>\"\",ROW('Manual Inputs'!M:M)),ROW(109:109))),\"\")","v":""},{"$f":"IF(B113=\"\",\"\",IFERROR(INDEX('Seeding_quantities report'!$F$2:$F$10003,SMALL(IF('Seeding_quantities report'!$A$2:$A$10003=C$6,ROW('Seeding_quantities report'!$A$2:$A$10003)-1,\"\"),ROWS($B$8:$B113))),\"0\"))","v":""},null,{"$f":"IF(B113=\"\",\"\",$C113+#REF!+#REF!)","v":""},{"$f":"IF(C113=\"\",\"\",$C113+#REF!+#REF!)","v":""}]
[null,{"$f":"IFERROR(INDEX('Manual Inputs'!M:M,SMALL(IF('Manual Inputs'!M:M<>\"\",ROW('Manual Inputs'!M:M)),ROW(110:110))),\"\")","v":""},{"$f":"IF(B114=\"\",\"\",IFERROR(INDEX('Seeding_quantities report'!$F$2:$F$10003,SMALL(IF('Seeding_quantities report'!$A$2:$A$10003=C$6,ROW('Seeding_quantities report'!$A$2:$A$10003)-1,\"\"),ROWS($B$8:$B114))),\"0\"))","v":""},null,{"$f":"IF(B114=\"\",\"\",$C114+#REF!+#REF!)","v":""},{"$f":"IF(C114=\"\",\"\",$C114+#REF!+#REF!)","v":""}]
[null,{"$f":"IFERROR(INDEX('Manual Inputs'!M:M,SMALL(IF('Manual Inputs'!M:M<>\"\",ROW('Manual Inputs'!M:M)),ROW(111:111))),\"\")","v":""},{"$f":"IF(B115=\"\",\"\",IFERROR(INDEX('Seeding_quantities report'!$F$2:$F$10003,SMALL(IF('Seeding_quantities report'!$A$2:$A$10003=C$6,ROW('Seeding_quantities report'!$A$2:$A$10003)-1,\"\"),ROWS($B$8:$B115))),\"0\"))","v":""},null,{"$f":"IF(B115=\"\",\"\",$C115+#REF!+#REF!)","v":""},{"$f":"IF(C115=\"\",\"\",$C115+#REF!+#REF!)","v":""}]
[null,{"$f":"IFERROR(INDEX('Manual Inputs'!M:M,SMALL(IF('Manual Inputs'!M:M<>\"\",ROW('Manual Inputs'!M:M)),ROW(112:112))),\"\")","v":""},{"$f":"IF(B116=\"\",\"\",IFERROR(INDEX('Seeding_quantities report'!$F$2:$F$10003,SMALL(IF('Seeding_quantities report'!$A$2:$A$10003=C$6,ROW('Seeding_quantities report'!$A$2:$A$10003)-1,\"\"),ROWS($B$8:$B116))),\"0\"))","v":""},null,{"$f":"IF(B116=\"\",\"\",$C116+#REF!+#REF!)","v":""},{"$f":"IF(C116=\"\",\"\",$C116+#REF!+#REF!)","v":""}]
[null,{"$f":"IFERROR(INDEX('Manual Inputs'!M:M,SMALL(IF('Manual Inputs'!M:M<>\"\",ROW('Manual Inputs'!M:M)),ROW(113:113))),\"\")","v":""},{"$f":"IF(B117=\"\",\"\",IFERROR(INDEX('Seeding_quantities report'!$F$2:$F$10003,SMALL(IF('Seeding_quantities report'!$A$2:$A$10003=C$6,ROW('Seeding_quantities report'!$A$2:$A$10003)-1,\"\"),ROWS($B$8:$B117))),\"0\"))","v":""},null,{"$f":"IF(B117=\"\",\"\",$C117+#REF!+#REF!)","v":""},{"$f":"IF(C117=\"\",\"\",$C117+#REF!+#REF!)","v":""}]
[null,{"$f":"IFERROR(INDEX('Manual Inputs'!M:M,SMALL(IF('Manual Inputs'!M:M<>\"\",ROW('Manual Inputs'!M:M)),ROW(114:114))),\"\")","v":""},{"$f":"IF(B118=\"\",\"\",IFERROR(INDEX('Seeding_quantities report'!$F$2:$F$10003,SMALL(IF('Seeding_quantities report'!$A$2:$A$10003=C$6,ROW('Seeding_quantities report'!$A$2:$A$10003)-1,\"\"),ROWS($B$8:$B118))),\"0\"))","v":""},null,{"$f":"IF(B118=\"\",\"\",$C118+#REF!+#REF!)","v":""},{"$f":"IF(C118=\"\",\"\",$C118+#REF!+#REF!)","v":""}]
[null,{"$f":"IFERROR(INDEX('Manual Inputs'!M:M,SMALL(IF('Manual Inputs'!M:M<>\"\",ROW('Manual Inputs'!M:M)),ROW(115:115))),\"\")","v":""},{"$f":"IF(B119=\"\",\"\",IFERROR(INDEX('Seeding_quantities report'!$F$2:$F$10003,SMALL(IF('Seeding_quantities report'!$A$2:$A$10003=C$6,ROW('Seeding_quantities report'!$A$2:$A$10003)-1,\"\"),ROWS($B$8:$B119))),\"0\"))","v":""},null,{"$f":"IF(B119=\"\",\"\",$C119+#REF!+#REF!)","v":""},{"$f":"IF(C119=\"\",\"\",$C119+#REF!+#REF!)","v":""}]
[null,{"$f":"IFERROR(INDEX('Manual Inputs'!M:M,SMALL(IF('Manual Inputs'!M:M<>\"\",ROW('Manual Inputs'!M:M)),ROW(116:116))),\"\")","v":""},{"$f":"IF(B120=\"\",\"\",IFERROR(INDEX('Seeding_quantities report'!$F$2:$F$10003,SMALL(IF('Seeding_quantities report'!$A$2:$A$10003=C$6,ROW('Seeding_quantities report'!$A$2:$A$10003)-1,\"\"),ROWS($B$8:$B120))),\"0\"))","v":""},null,{"$f":"IF(B120=\"\",\"\",$C120+#REF!+#REF!)","v":""},{"$f":"IF(C120=\"\",\"\",$C120+#REF!+#REF!)","v":""}]
[null,{"$f":"IFERROR(INDEX('Manual Inputs'!M:M,SMALL(IF('Manual Inputs'!M:M<>\"\",ROW('Manual Inputs'!M:M)),ROW(117:117))),\"\")","v":""},{"$f":"IF(B121=\"\",\"\",IFERROR(INDEX('Seeding_quantities report'!$F$2:$F$10003,SMALL(IF('Seeding_quantities report'!$A$2:$A$10003=C$6,ROW('Seeding_quantities report'!$A$2:$A$10003)-1,\"\"),ROWS($B$8:$B121))),\"0\"))","v":""},null,{"$f":"IF(B121=\"\",\"\",$C121+#REF!+#REF!)","v":""},{"$f":"IF(C121=\"\",\"\",$C121+#REF!+#REF!)","v":""}]
[null,{"$f":"IFERROR(INDEX('Manual Inputs'!M:M,SMALL(IF('Manual Inputs'!M:M<>\"\",ROW('Manual Inputs'!M:M)),ROW(118:118))),\"\")","v":""},{"$f":"IF(B122=\"\",\"\",IFERROR(INDEX('Seeding_quantities report'!$F$2:$F$10003,SMALL(IF('Seeding_quantities report'!$A$2:$A$10003=C$6,ROW('Seeding_quantities report'!$A$2:$A$10003)-1,\"\"),ROWS($B$8:$B122))),\"0\"))","v":""},null,{"$f":"IF(B122=\"\",\"\",$C122+#REF!+#REF!)","v":""},{"$f":"IF(C122=\"\",\"\",$C122+#REF!+#REF!)","v":""}]
[null,{"$f":"IFERROR(INDEX('Manual Inputs'!M:M,SMALL(IF('Manual Inputs'!M:M<>\"\",ROW('Manual Inputs'!M:M)),ROW(119:119))),\"\")","v":""},{"$f":"IF(B123=\"\",\"\",IFERROR(INDEX('Seeding_quantities report'!$F$2:$F$10003,SMALL(IF('Seeding_quantities report'!$A$2:$A$10003=C$6,ROW('Seeding_quantities report'!$A$2:$A$10003)-1,\"\"),ROWS($B$8:$B123))),\"0\"))","v":""},null,{"$f":"IF(B123=\"\",\"\",$C123+#REF!+#REF!)","v":""},{"$f":"IF(C123=\"\",\"\",$C123+#REF!+#REF!)","v":""}]
[null,{"$f":"IFERROR(INDEX('Manual Inputs'!M:M,SMALL(IF('Manual Inputs'!M:M<>\"\",ROW('Manual Inputs'!M:M)),ROW(120:120))),\"\")","v":""},{"$f":"IF(B124=\"\",\"\",IFERROR(INDEX('Seeding_quantities report'!$F$2:$F$10003,SMALL(IF('Seeding_quantities report'!$A$2:$A$10003=C$6,ROW('Seeding_quantities report'!$A$2:$A$10003)-1,\"\"),ROWS($B$8:$B124))),\"0\"))","v":""},null,{"$f":"IF(B124=\"\",\"\",$C124+#REF!+#REF!)","v":""},{"$f":"IF(C124=\"\",\"\",$C124+#REF!+#REF!)","v":""}]
[null,{"$f":"IFERROR(INDEX('Manual Inputs'!M:M,SMALL(IF('Manual Inputs'!M:M<>\"\",ROW('Manual Inputs'!M:M)),ROW(121:121))),\"\")","v":""},{"$f":"IF(B125=\"\",\"\",IFERROR(INDEX('Seeding_quantities report'!$F$2:$F$10003,SMALL(IF('Seeding_quantities report'!$A$2:$A$10003=C$6,ROW('Seeding_quantities report'!$A$2:$A$10003)-1,\"\"),ROWS($B$8:$B125))),\"0\"))","v":""},null,{"$f":"IF(B125=\"\",\"\",$C125+#REF!+#REF!)","v":""},{"$f":"IF(C125=\"\",\"\",$C125+#REF!+#REF!)","v":""}]
[null,{"$f":"IFERROR(INDEX('Manual Inputs'!M:M,SMALL(IF('Manual Inputs'!M:M<>\"\",ROW('Manual Inputs'!M:M)),ROW(122:122))),\"\")","v":""},{"$f":"IF(B126=\"\",\"\",IFERROR(INDEX('Seeding_quantities report'!$F$2:$F$10003,SMALL(IF('Seeding_quantities report'!$A$2:$A$10003=C$6,ROW('Seeding_quantities report'!$A$2:$A$10003)-1,\"\"),ROWS($B$8:$B126))),\"0\"))","v":""},null,{"$f":"IF(B126=\"\",\"\",$C126+#REF!+#REF!)","v":""},{"$f":"IF(C126=\"\",\"\",$C126+#REF!+#REF!)","v":""}]
[null,{"$f":"IFERROR(INDEX('Manual Inputs'!M:M,SMALL(IF('Manual Inputs'!M:M<>\"\",ROW('Manual Inputs'!M:M)),ROW(123:123))),\"\")","v":""},{"$f":"IF(B127=\"\",\"\",IFERROR(INDEX('Seeding_quantities report'!$F$2:$F$10003,SMALL(IF('Seeding_quantities report'!$A$2:$A$10003=C$6,ROW('Seeding_quantities report'!$A$2:$A$10003)-1,\"\"),ROWS($B$8:$B127))),\"0\"))","v":""},null,{"$f":"IF(B127=\"\",\"\",$C127+#REF!+#REF!)","v":""},{"$f":"IF(C127=\"\",\"\",$C127+#REF!+#REF!)","v":""}]
[null,{"$f":"IFERROR(INDEX('Manual Inputs'!M:M,SMALL(IF('Manual Inputs'!M:M<>\"\",ROW('Manual Inputs'!M:M)),ROW(124:124))),\"\")","v":""},{"$f":"IF(B128=\"\",\"\",IFERROR(INDEX('Seeding_quantities report'!$F$2:$F$10003,SMALL(IF('Seeding_quantities report'!$A$2:$A$10003=C$6,ROW('Seeding_quantities report'!$A$2:$A$10003)-1,\"\"),ROWS($B$8:$B128))),\"0\"))","v":""},null,{"$f":"IF(B128=\"\",\"\",$C128+#REF!+#REF!)","v":""},{"$f":"IF(C128=\"\",\"\",$C128+#REF!+#REF!)","v":""}]
[null,{"$f":"IFERROR(INDEX('Manual Inputs'!M:M,SMALL(IF('Manual Inputs'!M:M<>\"\",ROW('Manual Inputs'!M:M)),ROW(125:125))),\"\")","v":""},{"$f":"IF(B129=\"\",\"\",IFERROR(INDEX('Seeding_quantities report'!$F$2:$F$10003,SMALL(IF('Seeding_quantities report'!$A$2:$A$10003=C$6,ROW('Seeding_quantities report'!$A$2:$A$10003)-1,\"\"),ROWS($B$8:$B129))),\"0\"))","v":""},null,{"$f":"IF(B129=\"\",\"\",$C129+#REF!+#REF!)","v":""},{"$f":"IF(C129=\"\",\"\",$C129+#REF!+#REF!)","v":""}]
[null,{"$f":"IFERROR(INDEX('Manual Inputs'!M:M,SMALL(IF('Manual Inputs'!M:M<>\"\",ROW('Manual Inputs'!M:M)),ROW(126:126))),\"\")","v":""},{"$f":"IF(B130=\"\",\"\",IFERROR(INDEX('Seeding_quantities report'!$F$2:$F$10003,SMALL(IF('Seeding_quantities report'!$A$2:$A$10003=C$6,ROW('Seeding_quantities report'!$A$2:$A$10003)-1,\"\"),ROWS($B$8:$B130))),\"0\"))","v":""},null,{"$f":"IF(B130=\"\",\"\",$C130+#REF!+#REF!)","v":""},{"$f":"IF(C130=\"\",\"\",$C130+#REF!+#REF!)","v":""}]
[null,{"$f":"IFERROR(INDEX('Manual Inputs'!M:M,SMALL(IF('Manual Inputs'!M:M<>\"\",ROW('Manual Inputs'!M:M)),ROW(127:127))),\"\")","v":""},{"$f":"IF(B131=\"\",\"\",IFERROR(INDEX('Seeding_quantities report'!$F$2:$F$10003,SMALL(IF('Seeding_quantities report'!$A$2:$A$10003=C$6,ROW('Seeding_quantities report'!$A$2:$A$10003)-1,\"\"),ROWS($B$8:$B131))),\"0\"))","v":""},null,{"$f":"IF(B131=\"\",\"\",$C131+#REF!+#REF!)","v":""},{"$f":"IF(C131=\"\",\"\",$C131+#REF!+#REF!)","v":""}]
[null,{"$f":"IFERROR(INDEX('Manual Inputs'!M:M,SMALL(IF('Manual Inputs'!M:M<>\"\",ROW('Manual Inputs'!M:M)),ROW(128:128))),\"\")","v":""},{"$f":"IF(B132=\"\",\"\",IFERROR(INDEX('Seeding_quantities report'!$F$2:$F$10003,SMALL(IF('Seeding_quantities report'!$A$2:$A$10003=C$6,ROW('Seeding_quantities report'!$A$2:$A$10003)-1,\"\"),ROWS($B$8:$B132))),\"0\"))","v":""},null,{"$f":"IF(B132=\"\",\"\",$C132+#REF!+#REF!)","v":""},{"$f":"IF(C132=\"\",\"\",$C132+#REF!+#REF!)","v":""}]
[null,{"$f":"IFERROR(INDEX('Manual Inputs'!M:M,SMALL(IF('Manual Inputs'!M:M<>\"\",ROW('Manual Inputs'!M:M)),ROW(129:129))),\"\")","v":""},{"$f":"IF(B133=\"\",\"\",IFERROR(INDEX('Seeding_quantities report'!$F$2:$F$10003,SMALL(IF('Seeding_quantities report'!$A$2:$A$10003=C$6,ROW('Seeding_quantities report'!$A$2:$A$10003)-1,\"\"),ROWS($B$8:$B133))),\"0\"))","v":""},null,{"$f":"IF(B133=\"\",\"\",$C133+#REF!+#REF!)","v":""},{"$f":"IF(C133=\"\",\"\",$C133+#REF!+#REF!)","v":""}]
[null,{"$f":"IFERROR(INDEX('Manual Inputs'!M:M,SMALL(IF('Manual Inputs'!M:M<>\"\",ROW('Manual Inputs'!M:M)),ROW(130:130))),\"\")","v":""},{"$f":"IF(B134=\"\",\"\",IFERROR(INDEX('Seeding_quantities report'!$F$2:$F$10003,SMALL(IF('Seeding_quantities report'!$A$2:$A$10003=C$6,ROW('Seeding_quantities report'!$A$2:$A$10003)-1,\"\"),ROWS($B$8:$B134))),\"0\"))","v":""},null,{"$f":"IF(B134=\"\",\"\",$C134+#REF!+#REF!)","v":""},{"$f":"IF(C134=\"\",\"\",$C134+#REF!+#REF!)","v":""}]
[null,{"$f":"IFERROR(INDEX('Manual Inputs'!M:M,SMALL(IF('Manual Inputs'!M:M<>\"\",ROW('Manual Inputs'!M:M)),ROW(131:131))),\"\")","v":""},{"$f":"IF(B135=\"\",\"\",IFERROR(INDEX('Seeding_quantities report'!$F$2:$F$10003,SMALL(IF('Seeding_quantities report'!$A$2:$A$10003=C$6,ROW('Seeding_quantities report'!$A$2:$A$10003)-1,\"\"),ROWS($B$8:$B135))),\"0\"))","v":""},null,{"$f":"IF(B135=\"\",\"\",$C135+#REF!+#REF!)","v":""},{"$f":"IF(C135=\"\",\"\",$C135+#REF!+#REF!)","v":""}]
[null,{"$f":"IFERROR(INDEX('Manual Inputs'!M:M,SMALL(IF('Manual Inputs'!M:M<>\"\",ROW('Manual Inputs'!M:M)),ROW(132:132))),\"\")","v":""},{"$f":"IF(B136=\"\",\"\",IFERROR(INDEX('Seeding_quantities report'!$F$2:$F$10003,SMALL(IF('Seeding_quantities report'!$A$2:$A$10003=C$6,ROW('Seeding_quantities report'!$A$2:$A$10003)-1,\"\"),ROWS($B$8:$B136))),\"0\"))","v":""},null,{"$f":"IF(B136=\"\",\"\",$C136+#REF!+#REF!)","v":""},{"$f":"IF(C136=\"\",\"\",$C136+#REF!+#REF!)","v":""}]
[null,{"$f":"IFERROR(INDEX('Manual Inputs'!M:M,SMALL(IF('Manual Inputs'!M:M<>\"\",ROW('Manual Inputs'!M:M)),ROW(133:133))),\"\")","v":""},{"$f":"IF(B137=\"\",\"\",IFERROR(INDEX('Seeding_quantities report'!$F$2:$F$10003,SMALL(IF('Seeding_quantities report'!$A$2:$A$10003=C$6,ROW('Seeding_quantities report'!$A$2:$A$10003)-1,\"\"),ROWS($B$8:$B137))),\"0\"))","v":""},null,{"$f":"IF(B137=\"\",\"\",$C137+#REF!+#REF!)","v":""},{"$f":"IF(C137=\"\",\"\",$C137+#REF!+#REF!)","v":""}]
[null,{"$f":"IFERROR(INDEX('Manual Inputs'!M:M,SMALL(IF('Manual Inputs'!M:M<>\"\",ROW('Manual Inputs'!M:M)),ROW(134:134))),\"\")","v":""},{"$f":"IF(B138=\"\",\"\",IFERROR(INDEX('Seeding_quantities report'!$F$2:$F$10003,SMALL(IF('Seeding_quantities report'!$A$2:$A$10003=C$6,ROW('Seeding_quantities report'!$A$2:$A$10003)-1,\"\"),ROWS($B$8:$B138))),\"0\"))","v":""},null,{"$f":"IF(B138=\"\",\"\",$C138+#REF!+#REF!)","v":""},{"$f":"IF(C138=\"\",\"\",$C138+#REF!+#REF!)","v":""}]
[null,{"$f":"IFERROR(INDEX('Manual Inputs'!M:M,SMALL(IF('Manual Inputs'!M:M<>\"\",ROW('Manual Inputs'!M:M)),ROW(135:135))),\"\")","v":""},{"$f":"IF(B139=\"\",\"\",IFERROR(INDEX('Seeding_quantities report'!$F$2:$F$10003,SMALL(IF('Seeding_quantities report'!$A$2:$A$10003=C$6,ROW('Seeding_quantities report'!$A$2:$A$10003)-1,\"\"),ROWS($B$8:$B139))),\"0\"))","v":""},null,{"$f":"IF(B139=\"\",\"\",$C139+#REF!+#REF!)","v":""},{"$f":"IF(C139=\"\",\"\",$C139+#REF!+#REF!)","v":""}]
[null,{"$f":"IFERROR(INDEX('Manual Inputs'!M:M,SMALL(IF('Manual Inputs'!M:M<>\"\",ROW('Manual Inputs'!M:M)),ROW(136:136))),\"\")","v":""},{"$f":"IF(B140=\"\",\"\",IFERROR(INDEX('Seeding_quantities report'!$F$2:$F$10003,SMALL(IF('Seeding_quantities report'!$A$2:$A$10003=C$6,ROW('Seeding_quantities report'!$A$2:$A$10003)-1,\"\"),ROWS($B$8:$B140))),\"0\"))","v":""},null,{"$f":"IF(B140=\"\",\"\",$C140+#REF!+#REF!)","v":""},{"$f":"IF(C140=\"\",\"\",$C140+#REF!+#REF!)","v":""}]
[null,{"$f":"IFERROR(INDEX('Manual Inputs'!M:M,SMALL(IF('Manual Inputs'!M:M<>\"\",ROW('Manual Inputs'!M:M)),ROW(137:137))),\"\")","v":""},{"$f":"IF(B141=\"\",\"\",IFERROR(INDEX('Seeding_quantities report'!$F$2:$F$10003,SMALL(IF('Seeding_quantities report'!$A$2:$A$10003=C$6,ROW('Seeding_quantities report'!$A$2:$A$10003)-1,\"\"),ROWS($B$8:$B141))),\"0\"))","v":""},null,{"$f":"IF(B141=\"\",\"\",$C141+#REF!+#REF!)","v":""},{"$f":"IF(C141=\"\",\"\",$C141+#REF!+#REF!)","v":""}]
[null,{"$f":"IFERROR(INDEX('Manual Inputs'!M:M,SMALL(IF('Manual Inputs'!M:M<>\"\",ROW('Manual Inputs'!M:M)),ROW(138:138))),\"\")","v":""},{"$f":"IF(B142=\"\",\"\",IFERROR(INDEX('Seeding_quantities report'!$F$2:$F$10003,SMALL(IF('Seeding_quantities report'!$A$2:$A$10003=C$6,ROW('Seeding_quantities report'!$A$2:$A$10003)-1,\"\"),ROWS($B$8:$B142))),\"0\"))","v":""},null,{"$f":"IF(B142=\"\",\"\",$C142+#REF!+#REF!)","v":""},{"$f":"IF(C142=\"\",\"\",$C142+#REF!+#REF!)","v":""}]
[null,{"$f":"IFERROR(INDEX('Manual Inputs'!M:M,SMALL(IF('Manual Inputs'!M:M<>\"\",ROW('Manual Inputs'!M:M)),ROW(139:139))),\"\")","v":""},{"$f":"IF(B143=\"\",\"\",IFERROR(INDEX('Seeding_quantities report'!$F$2:$F$10003,SMALL(IF('Seeding_quantities report'!$A$2:$A$10003=C$6,ROW('Seeding_quantities report'!$A$2:$A$10003)-1,\"\"),ROWS($B$8:$B143))),\"0\"))","v":""},null,{"$f":"IF(B143=\"\",\"\",$C143+#REF!+#REF!)","v":""},{"$f":"IF(C143=\"\",\"\",$C143+#REF!+#REF!)","v":""}]
[null,{"$f":"IFERROR(INDEX('Manual Inputs'!M:M,SMALL(IF('Manual Inputs'!M:M<>\"\",ROW('Manual Inputs'!M:M)),ROW(140:140))),\"\")","v":""},{"$f":"IF(B144=\"\",\"\",IFERROR(INDEX('Seeding_quantities report'!$F$2:$F$10003,SMALL(IF('Seeding_quantities report'!$A$2:$A$10003=C$6,ROW('Seeding_quantities report'!$A$2:$A$10003)-1,\"\"),ROWS($B$8:$B144))),\"0\"))","v":""},null,{"$f":"IF(B144=\"\",\"\",$C144+#REF!+#REF!)","v":""},{"$f":"IF(C144=\"\",\"\",$C144+#REF!+#REF!)","v":""}]
[null,{"$f":"IFERROR(INDEX('Manual Inputs'!M:M,SMALL(IF('Manual Inputs'!M:M<>\"\",ROW('Manual Inputs'!M:M)),ROW(141:141))),\"\")","v":""},{"$f":"IF(B145=\"\",\"\",IFERROR(INDEX('Seeding_quantities report'!$F$2:$F$10003,SMALL(IF('Seeding_quantities report'!$A$2:$A$10003=C$6,ROW('Seeding_quantities report'!$A$2:$A$10003)-1,\"\"),ROWS($B$8:$B145))),\"0\"))","v":""},null,{"$f":"IF(B145=\"\",\"\",$C145+#REF!+#REF!)","v":""},{"$f":"IF(C145=\"\",\"\",$C145+#REF!+#REF!)","v":""}]
[null,{"$f":"IFERROR(INDEX('Manual Inputs'!M:M,SMALL(IF('Manual Inputs'!M:M<>\"\",ROW('Manual Inputs'!M:M)),ROW(142:142))),\"\")","v":""},{"$f":"IF(B146=\"\",\"\",IFERROR(INDEX('Seeding_quantities report'!$F$2:$F$10003,SMALL(IF('Seeding_quantities report'!$A$2:$A$10003=C$6,ROW('Seeding_quantities report'!$A$2:$A$10003)-1,\"\"),ROWS($B$8:$B146))),\"0\"))","v":""},null,{"$f":"IF(B146=\"\",\"\",$C146+#REF!+#REF!)","v":""},{"$f":"IF(C146=\"\",\"\",$C146+#REF!+#REF!)","v":""}]
[null,{"$f":"IFERROR(INDEX('Manual Inputs'!M:M,SMALL(IF('Manual Inputs'!M:M<>\"\",ROW('Manual Inputs'!M:M)),ROW(143:143))),\"\")","v":""},{"$f":"IF(B147=\"\",\"\",IFERROR(INDEX('Seeding_quantities report'!$F$2:$F$10003,SMALL(IF('Seeding_quantities report'!$A$2:$A$10003=C$6,ROW('Seeding_quantities report'!$A$2:$A$10003)-1,\"\"),ROWS($B$8:$B147))),\"0\"))","v":""},null,{"$f":"IF(B147=\"\",\"\",$C147+#REF!+#REF!)","v":""},{"$f":"IF(C147=\"\",\"\",$C147+#REF!+#REF!)","v":""}]
[null,{"$f":"IFERROR(INDEX('Manual Inputs'!M:M,SMALL(IF('Manual Inputs'!M:M<>\"\",ROW('Manual Inputs'!M:M)),ROW(144:144))),\"\")","v":""},{"$f":"IF(B148=\"\",\"\",IFERROR(INDEX('Seeding_quantities report'!$F$2:$F$10003,SMALL(IF('Seeding_quantities report'!$A$2:$A$10003=C$6,ROW('Seeding_quantities report'!$A$2:$A$10003)-1,\"\"),ROWS($B$8:$B148))),\"0\"))","v":""},null,{"$f":"IF(B148=\"\",\"\",$C148+#REF!+#REF!)","v":""},{"$f":"IF(C148=\"\",\"\",$C148+#REF!+#REF!)","v":""}]
[null,{"$f":"IFERROR(INDEX('Manual Inputs'!M:M,SMALL(IF('Manual Inputs'!M:M<>\"\",ROW('Manual Inputs'!M:M)),ROW(145:145))),\"\")","v":""},{"$f":"IF(B149=\"\",\"\",IFERROR(INDEX('Seeding_quantities report'!$F$2:$F$10003,SMALL(IF('Seeding_quantities report'!$A$2:$A$10003=C$6,ROW('Seeding_quantities report'!$A$2:$A$10003)-1,\"\"),ROWS($B$8:$B149))),\"0\"))","v":""},null,{"$f":"IF(B149=\"\",\"\",$C149+#REF!+#REF!)","v":""},{"$f":"IF(C149=\"\",\"\",$C149+#REF!+#REF!)","v":""}]
[null,{"$f":"IFERROR(INDEX('Manual Inputs'!M:M,SMALL(IF('Manual Inputs'!M:M<>\"\",ROW('Manual Inputs'!M:M)),ROW(146:146))),\"\")","v":""},{"$f":"IF(B150=\"\",\"\",IFERROR(INDEX('Seeding_quantities report'!$F$2:$F$10003,SMALL(IF('Seeding_quantities report'!$A$2:$A$10003=C$6,ROW('Seeding_quantities report'!$A$2:$A$10003)-1,\"\"),ROWS($B$8:$B150))),\"0\"))","v":""},null,{"$f":"IF(B150=\"\",\"\",$C150+#REF!+#REF!)","v":""},{"$f":"IF(C150=\"\",\"\",$C150+#REF!+#REF!)","v":""}]
[null,{"$f":"IFERROR(INDEX('Manual Inputs'!M:M,SMALL(IF('Manual Inputs'!M:M<>\"\",ROW('Manual Inputs'!M:M)),ROW(147:147))),\"\")","v":""},{"$f":"IF(B151=\"\",\"\",IFERROR(INDEX('Seeding_quantities report'!$F$2:$F$10003,SMALL(IF('Seeding_quantities report'!$A$2:$A$10003=C$6,ROW('Seeding_quantities report'!$A$2:$A$10003)-1,\"\"),ROWS($B$8:$B151))),\"0\"))","v":""},null,{"$f":"IF(B151=\"\",\"\",$C151+#REF!+#REF!)","v":""},{"$f":"IF(C151=\"\",\"\",$C151+#REF!+#REF!)","v":""}]
[null,{"$f":"IFERROR(INDEX('Manual Inputs'!M:M,SMALL(IF('Manual Inputs'!M:M<>\"\",ROW('Manual Inputs'!M:M)),ROW(148:148))),\"\")","v":""},{"$f":"IF(B152=\"\",\"\",IFERROR(INDEX('Seeding_quantities report'!$F$2:$F$10003,SMALL(IF('Seeding_quantities report'!$A$2:$A$10003=C$6,ROW('Seeding_quantities report'!$A$2:$A$10003)-1,\"\"),ROWS($B$8:$B152))),\"0\"))","v":""},null,{"$f":"IF(B152=\"\",\"\",$C152+#REF!+#REF!)","v":""},{"$f":"IF(C152=\"\",\"\",$C152+#REF!+#REF!)","v":""}]
[null,{"$f":"IFERROR(INDEX('Manual Inputs'!M:M,SMALL(IF('Manual Inputs'!M:M<>\"\",ROW('Manual Inputs'!M:M)),ROW(149:149))),\"\")","v":""},{"$f":"IF(B153=\"\",\"\",IFERROR(INDEX('Seeding_quantities report'!$F$2:$F$10003,SMALL(IF('Seeding_quantities report'!$A$2:$A$10003=C$6,ROW('Seeding_quantities report'!$A$2:$A$10003)-1,\"\"),ROWS($B$8:$B153))),\"0\"))","v":""},null,{"$f":"IF(B153=\"\",\"\",$C153+#REF!+#REF!)","v":""},{"$f":"IF(C153=\"\",\"\",$C153+#REF!+#REF!)","v":""}]
[null,{"$f":"IFERROR(INDEX('Manual Inputs'!M:M,SMALL(IF('Manual Inputs'!M:M<>\"\",ROW('Manual Inputs'!M:M)),ROW(150:150))),\"\")","v":""},{"$f":"IF(B154=\"\",\"\",IFERROR(INDEX('Seeding_quantities report'!$F$2:$F$10003,SMALL(IF('Seeding_quantities report'!$A$2:$A$10003=C$6,ROW('Seeding_quantities report'!$A$2:$A$10003)-1,\"\"),ROWS($B$8:$B154))),\"0\"))","v":""},null,{"$f":"IF(B154=\"\",\"\",$C154+#REF!+#REF!)","v":""},{"$f":"IF(C154=\"\",\"\",$C154+#REF!+#REF!)","v":""}]
[null,{"$f":"IFERROR(INDEX('Manual Inputs'!M:M,SMALL(IF('Manual Inputs'!M:M<>\"\",ROW('Manual Inputs'!M:M)),ROW(151:151))),\"\")","v":""},{"$f":"IF(B155=\"\",\"\",IFERROR(INDEX('Seeding_quantities report'!$F$2:$F$10003,SMALL(IF('Seeding_quantities report'!$A$2:$A$10003=C$6,ROW('Seeding_quantities report'!$A$2:$A$10003)-1,\"\"),ROWS($B$8:$B155))),\"0\"))","v":""},null,{"$f":"IF(B155=\"\",\"\",$C155+#REF!+#REF!)","v":""},{"$f":"IF(C155=\"\",\"\",$C155+#REF!+#REF!)","v":""}]
[null,{"$f":"IFERROR(INDEX('Manual Inputs'!M:M,SMALL(IF('Manual Inputs'!M:M<>\"\",ROW('Manual Inputs'!M:M)),ROW(152:152))),\"\")","v":""},{"$f":"IF(B156=\"\",\"\",IFERROR(INDEX('Seeding_quantities report'!$F$2:$F$10003,SMALL(IF('Seeding_quantities report'!$A$2:$A$10003=C$6,ROW('Seeding_quantities report'!$A$2:$A$10003)-1,\"\"),ROWS($B$8:$B156))),\"0\"))","v":""},null,{"$f":"IF(B156=\"\",\"\",$C156+#REF!+#REF!)","v":""},{"$f":"IF(C156=\"\",\"\",$C156+#REF!+#REF!)","v":""}]
[null,{"$f":"IFERROR(INDEX('Manual Inputs'!M:M,SMALL(IF('Manual Inputs'!M:M<>\"\",ROW('Manual Inputs'!M:M)),ROW(153:153))),\"\")","v":""},{"$f":"IF(B157=\"\",\"\",IFERROR(INDEX('Seeding_quantities report'!$F$2:$F$10003,SMALL(IF('Seeding_quantities report'!$A$2:$A$10003=C$6,ROW('Seeding_quantities report'!$A$2:$A$10003)-1,\"\"),ROWS($B$8:$B157))),\"0\"))","v":""},null,{"$f":"IF(B157=\"\",\"\",$C157+#REF!+#REF!)","v":""},{"$f":"IF(C157=\"\",\"\",$C157+#REF!+#REF!)","v":""}]
[null,{"$f":"IFERROR(INDEX('Manual Inputs'!M:M,SMALL(IF('Manual Inputs'!M:M<>\"\",ROW('Manual Inputs'!M:M)),ROW(154:154))),\"\")","v":""},{"$f":"IF(B158=\"\",\"\",IFERROR(INDEX('Seeding_quantities report'!$F$2:$F$10003,SMALL(IF('Seeding_quantities report'!$A$2:$A$10003=C$6,ROW('Seeding_quantities report'!$A$2:$A$10003)-1,\"\"),ROWS($B$8:$B158))),\"0\"))","v":""},null,{"$f":"IF(B158=\"\",\"\",$C158+#REF!+#REF!)","v":""},{"$f":"IF(C158=\"\",\"\",$C158+#REF!+#REF!)","v":""}]
[null,{"$f":"IFERROR(INDEX('Manual Inputs'!M:M,SMALL(IF('Manual Inputs'!M:M<>\"\",ROW('Manual Inputs'!M:M)),ROW(155:155))),\"\")","v":""},{"$f":"IF(B159=\"\",\"\",IFERROR(INDEX('Seeding_quantities report'!$F$2:$F$10003,SMALL(IF('Seeding_quantities report'!$A$2:$A$10003=C$6,ROW('Seeding_quantities report'!$A$2:$A$10003)-1,\"\"),ROWS($B$8:$B159))),\"0\"))","v":""},null,{"$f":"IF(B159=\"\",\"\",$C159+#REF!+#REF!)","v":""},{"$f":"IF(C159=\"\",\"\",$C159+#REF!+#REF!)","v":""}]
[null,{"$f":"IFERROR(INDEX('Manual Inputs'!M:M,SMALL(IF('Manual Inputs'!M:M<>\"\",ROW('Manual Inputs'!M:M)),ROW(156:156))),\"\")","v":""},{"$f":"IF(B160=\"\",\"\",IFERROR(INDEX('Seeding_quantities report'!$F$2:$F$10003,SMALL(IF('Seeding_quantities report'!$A$2:$A$10003=C$6,ROW('Seeding_quantities report'!$A$2:$A$10003)-1,\"\"),ROWS($B$8:$B160))),\"0\"))","v":""},null,{"$f":"IF(B160=\"\",\"\",$C160+#REF!+#REF!)","v":""},{"$f":"IF(C160=\"\",\"\",$C160+#REF!+#REF!)","v":""}]
[null,{"$f":"IFERROR(INDEX('Manual Inputs'!M:M,SMALL(IF('Manual Inputs'!M:M<>\"\",ROW('Manual Inputs'!M:M)),ROW(157:157))),\"\")","v":""},{"$f":"IF(B161=\"\",\"\",IFERROR(INDEX('Seeding_quantities report'!$F$2:$F$10003,SMALL(IF('Seeding_quantities report'!$A$2:$A$10003=C$6,ROW('Seeding_quantities report'!$A$2:$A$10003)-1,\"\"),ROWS($B$8:$B161))),\"0\"))","v":""},null,{"$f":"IF(B161=\"\",\"\",$C161+#REF!+#REF!)","v":""},{"$f":"IF(C161=\"\",\"\",$C161+#REF!+#REF!)","v":""}]
[null,{"$f":"IFERROR(INDEX('Manual Inputs'!M:M,SMALL(IF('Manual Inputs'!M:M<>\"\",ROW('Manual Inputs'!M:M)),ROW(158:158))),\"\")","v":""},{"$f":"IF(B162=\"\",\"\",IFERROR(INDEX('Seeding_quantities report'!$F$2:$F$10003,SMALL(IF('Seeding_quantities report'!$A$2:$A$10003=C$6,ROW('Seeding_quantities report'!$A$2:$A$10003)-1,\"\"),ROWS($B$8:$B162))),\"0\"))","v":""},null,{"$f":"IF(B162=\"\",\"\",$C162+#REF!+#REF!)","v":""},{"$f":"IF(C162=\"\",\"\",$C162+#REF!+#REF!)","v":""}]
[null,{"$f":"IFERROR(INDEX('Manual Inputs'!M:M,SMALL(IF('Manual Inputs'!M:M<>\"\",ROW('Manual Inputs'!M:M)),ROW(159:159))),\"\")","v":""},{"$f":"IF(B163=\"\",\"\",IFERROR(INDEX('Seeding_quantities report'!$F$2:$F$10003,SMALL(IF('Seeding_quantities report'!$A$2:$A$10003=C$6,ROW('Seeding_quantities report'!$A$2:$A$10003)-1,\"\"),ROWS($B$8:$B163))),\"0\"))","v":""},null,{"$f":"IF(B163=\"\",\"\",$C163+#REF!+#REF!)","v":""},{"$f":"IF(C163=\"\",\"\",$C163+#REF!+#REF!)","v":""}]
[null,{"$f":"IFERROR(INDEX('Manual Inputs'!M:M,SMALL(IF('Manual Inputs'!M:M<>\"\",ROW('Manual Inputs'!M:M)),ROW(160:160))),\"\")","v":""},{"$f":"IF(B164=\"\",\"\",IFERROR(INDEX('Seeding_quantities report'!$F$2:$F$10003,SMALL(IF('Seeding_quantities report'!$A$2:$A$10003=C$6,ROW('Seeding_quantities report'!$A$2:$A$10003)-1,\"\"),ROWS($B$8:$B164))),\"0\"))","v":""},null,{"$f":"IF(B164=\"\",\"\",$C164+#REF!+#REF!)","v":""},{"$f":"IF(C164=\"\",\"\",$C164+#REF!+#REF!)","v":""}]
[null,{"$f":"IFERROR(INDEX('Manual Inputs'!M:M,SMALL(IF('Manual Inputs'!M:M<>\"\",ROW('Manual Inputs'!M:M)),ROW(161:161))),\"\")","v":""},{"$f":"IF(B165=\"\",\"\",IFERROR(INDEX('Seeding_quantities report'!$F$2:$F$10003,SMALL(IF('Seeding_quantities report'!$A$2:$A$10003=C$6,ROW('Seeding_quantities report'!$A$2:$A$10003)-1,\"\"),ROWS($B$8:$B165))),\"0\"))","v":""},null,{"$f":"IF(B165=\"\",\"\",$C165+#REF!+#REF!)","v":""},{"$f":"IF(C165=\"\",\"\",$C165+#REF!+#REF!)","v":""}]
[null,{"$f":"IFERROR(INDEX('Manual Inputs'!M:M,SMALL(IF('Manual Inputs'!M:M<>\"\",ROW('Manual Inputs'!M:M)),ROW(162:162))),\"\")","v":""},{"$f":"IF(B166=\"\",\"\",IFERROR(INDEX('Seeding_quantities report'!$F$2:$F$10003,SMALL(IF('Seeding_quantities report'!$A$2:$A$10003=C$6,ROW('Seeding_quantities report'!$A$2:$A$10003)-1,\"\"),ROWS($B$8:$B166))),\"0\"))","v":""},null,{"$f":"IF(B166=\"\",\"\",$C166+#REF!+#REF!)","v":""},{"$f":"IF(C166=\"\",\"\",$C166+#REF!+#REF!)","v":""}]
[null,{"$f":"IFERROR(INDEX('Manual Inputs'!M:M,SMALL(IF('Manual Inputs'!M:M<>\"\",ROW('Manual Inputs'!M:M)),ROW(163:163))),\"\")","v":""},{"$f":"IF(B167=\"\",\"\",IFERROR(INDEX('Seeding_quantities report'!$F$2:$F$10003,SMALL(IF('Seeding_quantities report'!$A$2:$A$10003=C$6,ROW('Seeding_quantities report'!$A$2:$A$10003)-1,\"\"),ROWS($B$8:$B167))),\"0\"))","v":""},null,{"$f":"IF(B167=\"\",\"\",$C167+#REF!+#REF!)","v":""},{"$f":"IF(C167=\"\",\"\",$C167+#REF!+#REF!)","v":""}]
[null,{"$f":"IFERROR(INDEX('Manual Inputs'!M:M,SMALL(IF('Manual Inputs'!M:M<>\"\",ROW('Manual Inputs'!M:M)),ROW(164:164))),\"\")","v":""},{"$f":"IF(B168=\"\",\"\",IFERROR(INDEX('Seeding_quantities report'!$F$2:$F$10003,SMALL(IF('Seeding_quantities report'!$A$2:$A$10003=C$6,ROW('Seeding_quantities report'!$A$2:$A$10003)-1,\"\"),ROWS($B$8:$B168))),\"0\"))","v":""},null,{"$f":"IF(B168=\"\",\"\",$C168+#REF!+#REF!)","v":""},{"$f":"IF(C168=\"\",\"\",$C168+#REF!+#REF!)","v":""}]
[null,{"$f":"IFERROR(INDEX('Manual Inputs'!M:M,SMALL(IF('Manual Inputs'!M:M<>\"\",ROW('Manual Inputs'!M:M)),ROW(165:165))),\"\")","v":""},{"$f":"IF(B169=\"\",\"\",IFERROR(INDEX('Seeding_quantities report'!$F$2:$F$10003,SMALL(IF('Seeding_quantities report'!$A$2:$A$10003=C$6,ROW('Seeding_quantities report'!$A$2:$A$10003)-1,\"\"),ROWS($B$8:$B169))),\"0\"))","v":""},null,{"$f":"IF(B169=\"\",\"\",$C169+#REF!+#REF!)","v":""},{"$f":"IF(C169=\"\",\"\",$C169+#REF!+#REF!)","v":""}]
[null,{"$f":"IFERROR(INDEX('Manual Inputs'!M:M,SMALL(IF('Manual Inputs'!M:M<>\"\",ROW('Manual Inputs'!M:M)),ROW(166:166))),\"\")","v":""},{"$f":"IF(B170=\"\",\"\",IFERROR(INDEX('Seeding_quantities report'!$F$2:$F$10003,SMALL(IF('Seeding_quantities report'!$A$2:$A$10003=C$6,ROW('Seeding_quantities report'!$A$2:$A$10003)-1,\"\"),ROWS($B$8:$B170))),\"0\"))","v":""},null,{"$f":"IF(B170=\"\",\"\",$C170+#REF!+#REF!)","v":""},{"$f":"IF(C170=\"\",\"\",$C170+#REF!+#REF!)","v":""}]
[null,{"$f":"IFERROR(INDEX('Manual Inputs'!M:M,SMALL(IF('Manual Inputs'!M:M<>\"\",ROW('Manual Inputs'!M:M)),ROW(167:167))),\"\")","v":""},{"$f":"IF(B171=\"\",\"\",IFERROR(INDEX('Seeding_quantities report'!$F$2:$F$10003,SMALL(IF('Seeding_quantities report'!$A$2:$A$10003=C$6,ROW('Seeding_quantities report'!$A$2:$A$10003)-1,\"\"),ROWS($B$8:$B171))),\"0\"))","v":""},null,{"$f":"IF(B171=\"\",\"\",$C171+#REF!+#REF!)","v":""},{"$f":"IF(C171=\"\",\"\",$C171+#REF!+#REF!)","v":""}]
[null,{"$f":"IFERROR(INDEX('Manual Inputs'!M:M,SMALL(IF('Manual Inputs'!M:M<>\"\",ROW('Manual Inputs'!M:M)),ROW(168:168))),\"\")","v":""},{"$f":"IF(B172=\"\",\"\",IFERROR(INDEX('Seeding_quantities report'!$F$2:$F$10003,SMALL(IF('Seeding_quantities report'!$A$2:$A$10003=C$6,ROW('Seeding_quantities report'!$A$2:$A$10003)-1,\"\"),ROWS($B$8:$B172))),\"0\"))","v":""},null,{"$f":"IF(B172=\"\",\"\",$C172+#REF!+#REF!)","v":""},{"$f":"IF(C172=\"\",\"\",$C172+#REF!+#REF!)","v":""}]
[null,{"$f":"IFERROR(INDEX('Manual Inputs'!M:M,SMALL(IF('Manual Inputs'!M:M<>\"\",ROW('Manual Inputs'!M:M)),ROW(169:169))),\"\")","v":""},{"$f":"IF(B173=\"\",\"\",IFERROR(INDEX('Seeding_quantities report'!$F$2:$F$10003,SMALL(IF('Seeding_quantities report'!$A$2:$A$10003=C$6,ROW('Seeding_quantities report'!$A$2:$A$10003)-1,\"\"),ROWS($B$8:$B173))),\"0\"))","v":""},null,{"$f":"IF(B173=\"\",\"\",$C173+#REF!+#REF!)","v":""},{"$f":"IF(C173=\"\",\"\",$C173+#REF!+#REF!)","v":""}]
[null,{"$f":"IFERROR(INDEX('Manual Inputs'!M:M,SMALL(IF('Manual Inputs'!M:M<>\"\",ROW('Manual Inputs'!M:M)),ROW(170:170))),\"\")","v":""},{"$f":"IF(B174=\"\",\"\",IFERROR(INDEX('Seeding_quantities report'!$F$2:$F$10003,SMALL(IF('Seeding_quantities report'!$A$2:$A$10003=C$6,ROW('Seeding_quantities report'!$A$2:$A$10003)-1,\"\"),ROWS($B$8:$B174))),\"0\"))","v":""},null,{"$f":"IF(B174=\"\",\"\",$C174+#REF!+#REF!)","v":""},{"$f":"IF(C174=\"\",\"\",$C174+#REF!+#REF!)","v":""}]
[null,{"$f":"IFERROR(INDEX('Manual Inputs'!M:M,SMALL(IF('Manual Inputs'!M:M<>\"\",ROW('Manual Inputs'!M:M)),ROW(171:171))),\"\")","v":""},{"$f":"IF(B175=\"\",\"\",IFERROR(INDEX('Seeding_quantities report'!$F$2:$F$10003,SMALL(IF('Seeding_quantities report'!$A$2:$A$10003=C$6,ROW('Seeding_quantities report'!$A$2:$A$10003)-1,\"\"),ROWS($B$8:$B175))),\"0\"))","v":""},null,{"$f":"IF(B175=\"\",\"\",$C175+#REF!+#REF!)","v":""},{"$f":"IF(C175=\"\",\"\",$C175+#REF!+#REF!)","v":""}]
[null,{"$f":"IFERROR(INDEX('Manual Inputs'!M:M,SMALL(IF('Manual Inputs'!M:M<>\"\",ROW('Manual Inputs'!M:M)),ROW(172:172))),\"\")","v":""},{"$f":"IF(B176=\"\",\"\",IFERROR(INDEX('Seeding_quantities report'!$F$2:$F$10003,SMALL(IF('Seeding_quantities report'!$A$2:$A$10003=C$6,ROW('Seeding_quantities report'!$A$2:$A$10003)-1,\"\"),ROWS($B$8:$B176))),\"0\"))","v":""},null,{"$f":"IF(B176=\"\",\"\",$C176+#REF!+#REF!)","v":""},{"$f":"IF(C176=\"\",\"\",$C176+#REF!+#REF!)","v":""}]
[null,{"$f":"IFERROR(INDEX('Manual Inputs'!M:M,SMALL(IF('Manual Inputs'!M:M<>\"\",ROW('Manual Inputs'!M:M)),ROW(173:173))),\"\")","v":""},{"$f":"IF(B177=\"\",\"\",IFERROR(INDEX('Seeding_quantities report'!$F$2:$F$10003,SMALL(IF('Seeding_quantities report'!$A$2:$A$10003=C$6,ROW('Seeding_quantities report'!$A$2:$A$10003)-1,\"\"),ROWS($B$8:$B177))),\"0\"))","v":""},null,{"$f":"IF(B177=\"\",\"\",$C177+#REF!+#REF!)","v":""},{"$f":"IF(C177=\"\",\"\",$C177+#REF!+#REF!)","v":""}]
[null,{"$f":"IFERROR(INDEX('Manual Inputs'!M:M,SMALL(IF('Manual Inputs'!M:M<>\"\",ROW('Manual Inputs'!M:M)),ROW(174:174))),\"\")","v":""},{"$f":"IF(B178=\"\",\"\",IFERROR(INDEX('Seeding_quantities report'!$F$2:$F$10003,SMALL(IF('Seeding_quantities report'!$A$2:$A$10003=C$6,ROW('Seeding_quantities report'!$A$2:$A$10003)-1,\"\"),ROWS($B$8:$B178))),\"0\"))","v":""},null,{"$f":"IF(B178=\"\",\"\",$C178+#REF!+#REF!)","v":""},{"$f":"IF(C178=\"\",\"\",$C178+#REF!+#REF!)","v":""}]
[null,{"$f":"IFERROR(INDEX('Manual Inputs'!M:M,SMALL(IF('Manual Inputs'!M:M<>\"\",ROW('Manual Inputs'!M:M)),ROW(175:175))),\"\")","v":""},{"$f":"IF(B179=\"\",\"\",IFERROR(INDEX('Seeding_quantities report'!$F$2:$F$10003,SMALL(IF('Seeding_quantities report'!$A$2:$A$10003=C$6,ROW('Seeding_quantities report'!$A$2:$A$10003)-1,\"\"),ROWS($B$8:$B179))),\"0\"))","v":""},null,{"$f":"IF(B179=\"\",\"\",$C179+#REF!+#REF!)","v":""},{"$f":"IF(C179=\"\",\"\",$C179+#REF!+#REF!)","v":""}]
[null,{"$f":"IFERROR(INDEX('Manual Inputs'!M:M,SMALL(IF('Manual Inputs'!M:M<>\"\",ROW('Manual Inputs'!M:M)),ROW(176:176))),\"\")","v":""},{"$f":"IF(B180=\"\",\"\",IFERROR(INDEX('Seeding_quantities report'!$F$2:$F$10003,SMALL(IF('Seeding_quantities report'!$A$2:$A$10003=C$6,ROW('Seeding_quantities report'!$A$2:$A$10003)-1,\"\"),ROWS($B$8:$B180))),\"0\"))","v":""},null,{"$f":"IF(B180=\"\",\"\",$C180+#REF!+#REF!)","v":""},{"$f":"IF(C180=\"\",\"\",$C180+#REF!+#REF!)","v":""}]
[null,{"$f":"IFERROR(INDEX('Manual Inputs'!M:M,SMALL(IF('Manual Inputs'!M:M<>\"\",ROW('Manual Inputs'!M:M)),ROW(177:177))),\"\")","v":""},{"$f":"IF(B181=\"\",\"\",IFERROR(INDEX('Seeding_quantities report'!$F$2:$F$10003,SMALL(IF('Seeding_quantities report'!$A$2:$A$10003=C$6,ROW('Seeding_quantities report'!$A$2:$A$10003)-1,\"\"),ROWS($B$8:$B181))),\"0\"))","v":""},null,{"$f":"IF(B181=\"\",\"\",$C181+#REF!+#REF!)","v":""},{"$f":"IF(C181=\"\",\"\",$C181+#REF!+#REF!)","v":""}]
[null,{"$f":"IFERROR(INDEX('Manual Inputs'!M:M,SMALL(IF('Manual Inputs'!M:M<>\"\",ROW('Manual Inputs'!M:M)),ROW(178:178))),\"\")","v":""},{"$f":"IF(B182=\"\",\"\",IFERROR(INDEX('Seeding_quantities report'!$F$2:$F$10003,SMALL(IF('Seeding_quantities report'!$A$2:$A$10003=C$6,ROW('Seeding_quantities report'!$A$2:$A$10003)-1,\"\"),ROWS($B$8:$B182))),\"0\"))","v":""},null,{"$f":"IF(B182=\"\",\"\",$C182+#REF!+#REF!)","v":""},{"$f":"IF(C182=\"\",\"\",$C182+#REF!+#REF!)","v":""}]
[null,{"$f":"IFERROR(INDEX('Manual Inputs'!M:M,SMALL(IF('Manual Inputs'!M:M<>\"\",ROW('Manual Inputs'!M:M)),ROW(179:179))),\"\")","v":""},{"$f":"IF(B183=\"\",\"\",IFERROR(INDEX('Seeding_quantities report'!$F$2:$F$10003,SMALL(IF('Seeding_quantities report'!$A$2:$A$10003=C$6,ROW('Seeding_quantities report'!$A$2:$A$10003)-1,\"\"),ROWS($B$8:$B183))),\"0\"))","v":""},null,{"$f":"IF(B183=\"\",\"\",$C183+#REF!+#REF!)","v":""},{"$f":"IF(C183=\"\",\"\",$C183+#REF!+#REF!)","v":""}]
[null,{"$f":"IFERROR(INDEX('Manual Inputs'!M:M,SMALL(IF('Manual Inputs'!M:M<>\"\",ROW('Manual Inputs'!M:M)),ROW(180:180))),\"\")","v":""},{"$f":"IF(B184=\"\",\"\",IFERROR(INDEX('Seeding_quantities report'!$F$2:$F$10003,SMALL(IF('Seeding_quantities report'!$A$2:$A$10003=C$6,ROW('Seeding_quantities report'!$A$2:$A$10003)-1,\"\"),ROWS($B$8:$B184))),\"0\"))","v":""},null,{"$f":"IF(B184=\"\",\"\",$C184+#REF!+#REF!)","v":""},{"$f":"IF(C184=\"\",\"\",$C184+#REF!+#REF!)","v":""}]
[null,{"$f":"IFERROR(INDEX('Manual Inputs'!M:M,SMALL(IF('Manual Inputs'!M:M<>\"\",ROW('Manual Inputs'!M:M)),ROW(181:181))),\"\")","v":""},{"$f":"IF(B185=\"\",\"\",IFERROR(INDEX('Seeding_quantities report'!$F$2:$F$10003,SMALL(IF('Seeding_quantities report'!$A$2:$A$10003=C$6,ROW('Seeding_quantities report'!$A$2:$A$10003)-1,\"\"),ROWS($B$8:$B185))),\"0\"))","v":""},null,{"$f":"IF(B185=\"\",\"\",$C185+#REF!+#REF!)","v":""},{"$f":"IF(C185=\"\",\"\",$C185+#REF!+#REF!)","v":""}]
[null,{"$f":"IFERROR(INDEX('Manual Inputs'!M:M,SMALL(IF('Manual Inputs'!M:M<>\"\",ROW('Manual Inputs'!M:M)),ROW(182:182))),\"\")","v":""},{"$f":"IF(B186=\"\",\"\",IFERROR(INDEX('Seeding_quantities report'!$F$2:$F$10003,SMALL(IF('Seeding_quantities report'!$A$2:$A$10003=C$6,ROW('Seeding_quantities report'!$A$2:$A$10003)-1,\"\"),ROWS($B$8:$B186))),\"0\"))","v":""},null,{"$f":"IF(B186=\"\",\"\",$C186+#REF!+#REF!)","v":""},{"$f":"IF(C186=\"\",\"\",$C186+#REF!+#REF!)","v":""}]
[null,{"$f":"IFERROR(INDEX('Manual Inputs'!M:M,SMALL(IF('Manual Inputs'!M:M<>\"\",ROW('Manual Inputs'!M:M)),ROW(183:183))),\"\")","v":""},{"$f":"IF(B187=\"\",\"\",IFERROR(INDEX('Seeding_quantities report'!$F$2:$F$10003,SMALL(IF('Seeding_quantities report'!$A$2:$A$10003=C$6,ROW('Seeding_quantities report'!$A$2:$A$10003)-1,\"\"),ROWS($B$8:$B187))),\"0\"))","v":""},null,{"$f":"IF(B187=\"\",\"\",$C187+#REF!+#REF!)","v":""},{"$f":"IF(C187=\"\",\"\",$C187+#REF!+#REF!)","v":""}]
[null,{"$f":"IFERROR(INDEX('Manual Inputs'!M:M,SMALL(IF('Manual Inputs'!M:M<>\"\",ROW('Manual Inputs'!M:M)),ROW(184:184))),\"\")","v":""},{"$f":"IF(B188=\"\",\"\",IFERROR(INDEX('Seeding_quantities report'!$F$2:$F$10003,SMALL(IF('Seeding_quantities report'!$A$2:$A$10003=C$6,ROW('Seeding_quantities report'!$A$2:$A$10003)-1,\"\"),ROWS($B$8:$B188))),\"0\"))","v":""},null,{"$f":"IF(B188=\"\",\"\",$C188+#REF!+#REF!)","v":""},{"$f":"IF(C188=\"\",\"\",$C188+#REF!+#REF!)","v":""}]
[null,{"$f":"IFERROR(INDEX('Manual Inputs'!M:M,SMALL(IF('Manual Inputs'!M:M<>\"\",ROW('Manual Inputs'!M:M)),ROW(185:185))),\"\")","v":""},{"$f":"IF(B189=\"\",\"\",IFERROR(INDEX('Seeding_quantities report'!$F$2:$F$10003,SMALL(IF('Seeding_quantities report'!$A$2:$A$10003=C$6,ROW('Seeding_quantities report'!$A$2:$A$10003)-1,\"\"),ROWS($B$8:$B189))),\"0\"))","v":""},null,{"$f":"IF(B189=\"\",\"\",$C189+#REF!+#REF!)","v":""},{"$f":"IF(C189=\"\",\"\",$C189+#REF!+#REF!)","v":""}]
[null,{"$f":"IFERROR(INDEX('Manual Inputs'!M:M,SMALL(IF('Manual Inputs'!M:M<>\"\",ROW('Manual Inputs'!M:M)),ROW(186:186))),\"\")","v":""},{"$f":"IF(B190=\"\",\"\",IFERROR(INDEX('Seeding_quantities report'!$F$2:$F$10003,SMALL(IF('Seeding_quantities report'!$A$2:$A$10003=C$6,ROW('Seeding_quantities report'!$A$2:$A$10003)-1,\"\"),ROWS($B$8:$B190))),\"0\"))","v":""},null,{"$f":"IF(B190=\"\",\"\",$C190+#REF!+#REF!)","v":""},{"$f":"IF(C190=\"\",\"\",$C190+#REF!+#REF!)","v":""}]
[null,{"$f":"IFERROR(INDEX('Manual Inputs'!M:M,SMALL(IF('Manual Inputs'!M:M<>\"\",ROW('Manual Inputs'!M:M)),ROW(187:187))),\"\")","v":""},{"$f":"IF(B191=\"\",\"\",IFERROR(INDEX('Seeding_quantities report'!$F$2:$F$10003,SMALL(IF('Seeding_quantities report'!$A$2:$A$10003=C$6,ROW('Seeding_quantities report'!$A$2:$A$10003)-1,\"\"),ROWS($B$8:$B191))),\"0\"))","v":""},null,{"$f":"IF(B191=\"\",\"\",$C191+#REF!+#REF!)","v":""},{"$f":"IF(C191=\"\",\"\",$C191+#REF!+#REF!)","v":""}]
[null,{"$f":"IFERROR(INDEX('Manual Inputs'!M:M,SMALL(IF('Manual Inputs'!M:M<>\"\",ROW('Manual Inputs'!M:M)),ROW(188:188))),\"\")","v":""},{"$f":"IF(B192=\"\",\"\",IFERROR(INDEX('Seeding_quantities report'!$F$2:$F$10003,SMALL(IF('Seeding_quantities report'!$A$2:$A$10003=C$6,ROW('Seeding_quantities report'!$A$2:$A$10003)-1,\"\"),ROWS($B$8:$B192))),\"0\"))","v":""},null,{"$f":"IF(B192=\"\",\"\",$C192+#REF!+#REF!)","v":""},{"$f":"IF(C192=\"\",\"\",$C192+#REF!+#REF!)","v":""}]
[null,{"$f":"IFERROR(INDEX('Manual Inputs'!M:M,SMALL(IF('Manual Inputs'!M:M<>\"\",ROW('Manual Inputs'!M:M)),ROW(189:189))),\"\")","v":""},{"$f":"IF(B193=\"\",\"\",IFERROR(INDEX('Seeding_quantities report'!$F$2:$F$10003,SMALL(IF('Seeding_quantities report'!$A$2:$A$10003=C$6,ROW('Seeding_quantities report'!$A$2:$A$10003)-1,\"\"),ROWS($B$8:$B193))),\"0\"))","v":""},null,{"$f":"IF(B193=\"\",\"\",$C193+#REF!+#REF!)","v":""},{"$f":"IF(C193=\"\",\"\",$C193+#REF!+#REF!)","v":""}]
[null,{"$f":"IFERROR(INDEX('Manual Inputs'!M:M,SMALL(IF('Manual Inputs'!M:M<>\"\",ROW('Manual Inputs'!M:M)),ROW(190:190))),\"\")","v":""},{"$f":"IF(B194=\"\",\"\",IFERROR(INDEX('Seeding_quantities report'!$F$2:$F$10003,SMALL(IF('Seeding_quantities report'!$A$2:$A$10003=C$6,ROW('Seeding_quantities report'!$A$2:$A$10003)-1,\"\"),ROWS($B$8:$B194))),\"0\"))","v":""},null,{"$f":"IF(B194=\"\",\"\",$C194+#REF!+#REF!)","v":""},{"$f":"IF(C194=\"\",\"\",$C194+#REF!+#REF!)","v":""}]
[null,{"$f":"IFERROR(INDEX('Manual Inputs'!M:M,SMALL(IF('Manual Inputs'!M:M<>\"\",ROW('Manual Inputs'!M:M)),ROW(191:191))),\"\")","v":""},{"$f":"IF(B195=\"\",\"\",IFERROR(INDEX('Seeding_quantities report'!$F$2:$F$10003,SMALL(IF('Seeding_quantities report'!$A$2:$A$10003=C$6,ROW('Seeding_quantities report'!$A$2:$A$10003)-1,\"\"),ROWS($B$8:$B195))),\"0\"))","v":""},null,{"$f":"IF(B195=\"\",\"\",$C195+#REF!+#REF!)","v":""},{"$f":"IF(C195=\"\",\"\",$C195+#REF!+#REF!)","v":""}]
[null,{"$f":"IFERROR(INDEX('Manual Inputs'!M:M,SMALL(IF('Manual Inputs'!M:M<>\"\",ROW('Manual Inputs'!M:M)),ROW(192:192))),\"\")","v":""},{"$f":"IF(B196=\"\",\"\",IFERROR(INDEX('Seeding_quantities report'!$F$2:$F$10003,SMALL(IF('Seeding_quantities report'!$A$2:$A$10003=C$6,ROW('Seeding_quantities report'!$A$2:$A$10003)-1,\"\"),ROWS($B$8:$B196))),\"0\"))","v":""},null,{"$f":"IF(B196=\"\",\"\",$C196+#REF!+#REF!)","v":""},{"$f":"IF(C196=\"\",\"\",$C196+#REF!+#REF!)","v":""}]
[null,{"$f":"IFERROR(INDEX('Manual Inputs'!M:M,SMALL(IF('Manual Inputs'!M:M<>\"\",ROW('Manual Inputs'!M:M)),ROW(193:193))),\"\")","v":""},{"$f":"IF(B197=\"\",\"\",IFERROR(INDEX('Seeding_quantities report'!$F$2:$F$10003,SMALL(IF('Seeding_quantities report'!$A$2:$A$10003=C$6,ROW('Seeding_quantities report'!$A$2:$A$10003)-1,\"\"),ROWS($B$8:$B197))),\"0\"))","v":""},null,{"$f":"IF(B197=\"\",\"\",$C197+#REF!+#REF!)","v":""},{"$f":"IF(C197=\"\",\"\",$C197+#REF!+#REF!)","v":""}]
[null,{"$f":"IFERROR(INDEX('Manual Inputs'!M:M,SMALL(IF('Manual Inputs'!M:M<>\"\",ROW('Manual Inputs'!M:M)),ROW(194:194))),\"\")","v":""},{"$f":"IF(B198=\"\",\"\",IFERROR(INDEX('Seeding_quantities report'!$F$2:$F$10003,SMALL(IF('Seeding_quantities report'!$A$2:$A$10003=C$6,ROW('Seeding_quantities report'!$A$2:$A$10003)-1,\"\"),ROWS($B$8:$B198))),\"0\"))","v":""},null,{"$f":"IF(B198=\"\",\"\",$C198+#REF!+#REF!)","v":""},{"$f":"IF(C198=\"\",\"\",$C198+#REF!+#REF!)","v":""}]
[null,{"$f":"IFERROR(INDEX('Manual Inputs'!M:M,SMALL(IF('Manual Inputs'!M:M<>\"\",ROW('Manual Inputs'!M:M)),ROW(195:195))),\"\")","v":""},{"$f":"IF(B199=\"\",\"\",IFERROR(INDEX('Seeding_quantities report'!$F$2:$F$10003,SMALL(IF('Seeding_quantities report'!$A$2:$A$10003=C$6,ROW('Seeding_quantities report'!$A$2:$A$10003)-1,\"\"),ROWS($B$8:$B199))),\"0\"))","v":""},null,{"$f":"IF(B199=\"\",\"\",$C199+#REF!+#REF!)","v":""},{"$f":"IF(C199=\"\",\"\",$C199+#REF!+#REF!)","v":""}]
[null,{"$f":"IFERROR(INDEX('Manual Inputs'!M:M,SMALL(IF('Manual Inputs'!M:M<>\"\",ROW('Manual Inputs'!M:M)),ROW(196:196))),\"\")","v":""},{"$f":"IF(B200=\"\",\"\",IFERROR(INDEX('Seeding_quantities report'!$F$2:$F$10003,SMALL(IF('Seeding_quantities report'!$A$2:$A$10003=C$6,ROW('Seeding_quantities report'!$A$2:$A$10003)-1,\"\"),ROWS($B$8:$B200))),\"0\"))","v":""},null,{"$f":"IF(B200=\"\",\"\",$C200+#REF!+#REF!)","v":""},{"$f":"IF(C200=\"\",\"\",$C200+#REF!+#REF!)","v":""}]
[null,{"$f":"IFERROR(INDEX('Manual Inputs'!M:M,SMALL(IF('Manual Inputs'!M:M<>\"\",ROW('Manual Inputs'!M:M)),ROW(197:197))),\"\")","v":""},{"$f":"IF(B201=\"\",\"\",IFERROR(INDEX('Seeding_quantities report'!$F$2:$F$10003,SMALL(IF('Seeding_quantities report'!$A$2:$A$10003=C$6,ROW('Seeding_quantities report'!$A$2:$A$10003)-1,\"\"),ROWS($B$8:$B201))),\"0\"))","v":""},null,{"$f":"IF(B201=\"\",\"\",$C201+#REF!+#REF!)","v":""},{"$f":"IF(C201=\"\",\"\",$C201+#REF!+#REF!)","v":""}]
[null,{"$f":"IFERROR(INDEX('Manual Inputs'!M:M,SMALL(IF('Manual Inputs'!M:M<>\"\",ROW('Manual Inputs'!M:M)),ROW(198:198))),\"\")","v":""},{"$f":"IF(B202=\"\",\"\",IFERROR(INDEX('Seeding_quantities report'!$F$2:$F$10003,SMALL(IF('Seeding_quantities report'!$A$2:$A$10003=C$6,ROW('Seeding_quantities report'!$A$2:$A$10003)-1,\"\"),ROWS($B$8:$B202))),\"0\"))","v":""},null,{"$f":"IF(B202=\"\",\"\",$C202+#REF!+#REF!)","v":""},{"$f":"IF(C202=\"\",\"\",$C202+#REF!+#REF!)","v":""}]
[null,{"$f":"IFERROR(INDEX('Manual Inputs'!M:M,SMALL(IF('Manual Inputs'!M:M<>\"\",ROW('Manual Inputs'!M:M)),ROW(199:199))),\"\")","v":""},{"$f":"IF(B203=\"\",\"\",IFERROR(INDEX('Seeding_quantities report'!$F$2:$F$10003,SMALL(IF('Seeding_quantities report'!$A$2:$A$10003=C$6,ROW('Seeding_quantities report'!$A$2:$A$10003)-1,\"\"),ROWS($B$8:$B203))),\"0\"))","v":""},null,{"$f":"IF(B203=\"\",\"\",$C203+#REF!+#REF!)","v":""},{"$f":"IF(C203=\"\",\"\",$C203+#REF!+#REF!)","v":""}]
[null,{"$f":"IFERROR(INDEX('Manual Inputs'!M:M,SMALL(IF('Manual Inputs'!M:M<>\"\",ROW('Manual Inputs'!M:M)),ROW(200:200))),\"\")","v":""},{"$f":"IF(B204=\"\",\"\",IFERROR(INDEX('Seeding_quantities report'!$F$2:$F$10003,SMALL(IF('Seeding_quantities report'!$A$2:$A$10003=C$6,ROW('Seeding_quantities report'!$A$2:$A$10003)-1,\"\"),ROWS($B$8:$B204))),\"0\"))","v":""},null,{"$f":"IF(B204=\"\",\"\",$C204+#REF!+#REF!)","v":""},{"$f":"IF(C204=\"\",\"\",$C204+#REF!+#REF!)","v":""}]
[null,{"$f":"IFERROR(INDEX('Manual Inputs'!M:M,SMALL(IF('Manual Inputs'!M:M<>\"\",ROW('Manual Inputs'!M:M)),ROW(201:201))),\"\")","v":""},{"$f":"IF(B205=\"\",\"\",IFERROR(INDEX('Seeding_quantities report'!$F$2:$F$10003,SMALL(IF('Seeding_quantities report'!$A$2:$A$10003=C$6,ROW('Seeding_quantities report'!$A$2:$A$10003)-1,\"\"),ROWS($B$8:$B205))),\"0\"))","v":""},null,{"$f":"IF(B205=\"\",\"\",$C205+#REF!+#REF!)","v":""},{"$f":"IF(C205=\"\",\"\",$C205+#REF!+#REF!)","v":""}]
[null,{"$f":"IFERROR(INDEX('Manual Inputs'!M:M,SMALL(IF('Manual Inputs'!M:M<>\"\",ROW('Manual Inputs'!M:M)),ROW(202:202))),\"\")","v":""},{"$f":"IF(B206=\"\",\"\",IFERROR(INDEX('Seeding_quantities report'!$F$2:$F$10003,SMALL(IF('Seeding_quantities report'!$A$2:$A$10003=C$6,ROW('Seeding_quantities report'!$A$2:$A$10003)-1,\"\"),ROWS($B$8:$B206))),\"0\"))","v":""},null,{"$f":"IF(B206=\"\",\"\",$C206+#REF!+#REF!)","v":""},{"$f":"IF(C206=\"\",\"\",$C206+#REF!+#REF!)","v":""}]
[null,{"$f":"IFERROR(INDEX('Manual Inputs'!M:M,SMALL(IF('Manual Inputs'!M:M<>\"\",ROW('Manual Inputs'!M:M)),ROW(203:203))),\"\")","v":""},{"$f":"IF(B207=\"\",\"\",IFERROR(INDEX('Seeding_quantities report'!$F$2:$F$10003,SMALL(IF('Seeding_quantities report'!$A$2:$A$10003=C$6,ROW('Seeding_quantities report'!$A$2:$A$10003)-1,\"\"),ROWS($B$8:$B207))),\"0\"))","v":""},null,{"$f":"IF(B207=\"\",\"\",$C207+#REF!+#REF!)","v":""},{"$f":"IF(C207=\"\",\"\",$C207+#REF!+#REF!)","v":""}]
[null,{"$f":"IFERROR(INDEX('Manual Inputs'!M:M,SMALL(IF('Manual Inputs'!M:M<>\"\",ROW('Manual Inputs'!M:M)),ROW(204:204))),\"\")","v":""},{"$f":"IF(B208=\"\",\"\",IFERROR(INDEX('Seeding_quantities report'!$F$2:$F$10003,SMALL(IF('Seeding_quantities report'!$A$2:$A$10003=C$6,ROW('Seeding_quantities report'!$A$2:$A$10003)-1,\"\"),ROWS($B$8:$B208))),\"0\"))","v":""},null,{"$f":"IF(B208=\"\",\"\",$C208+#REF!+#REF!)","v":""},{"$f":"IF(C208=\"\",\"\",$C208+#REF!+#REF!)","v":""}]
[null,{"$f":"IFERROR(INDEX('Manual Inputs'!M:M,SMALL(IF('Manual Inputs'!M:M<>\"\",ROW('Manual Inputs'!M:M)),ROW(205:205))),\"\")","v":""},{"$f":"IF(B209=\"\",\"\",IFERROR(INDEX('Seeding_quantities report'!$F$2:$F$10003,SMALL(IF('Seeding_quantities report'!$A$2:$A$10003=C$6,ROW('Seeding_quantities report'!$A$2:$A$10003)-1,\"\"),ROWS($B$8:$B209))),\"0\"))","v":""},null,{"$f":"IF(B209=\"\",\"\",$C209+#REF!+#REF!)","v":""},{"$f":"IF(C209=\"\",\"\",$C209+#REF!+#REF!)","v":""}]
[null,{"$f":"IFERROR(INDEX('Manual Inputs'!M:M,SMALL(IF('Manual Inputs'!M:M<>\"\",ROW('Manual Inputs'!M:M)),ROW(206:206))),\"\")","v":""},{"$f":"IF(B210=\"\",\"\",IFERROR(INDEX('Seeding_quantities report'!$F$2:$F$10003,SMALL(IF('Seeding_quantities report'!$A$2:$A$10003=C$6,ROW('Seeding_quantities report'!$A$2:$A$10003)-1,\"\"),ROWS($B$8:$B210))),\"0\"))","v":""},null,{"$f":"IF(B210=\"\",\"\",$C210+#REF!+#REF!)","v":""},{"$f":"IF(C210=\"\",\"\",$C210+#REF!+#REF!)","v":""}]
[null,{"$f":"IFERROR(INDEX('Manual Inputs'!M:M,SMALL(IF('Manual Inputs'!M:M<>\"\",ROW('Manual Inputs'!M:M)),ROW(207:207))),\"\")","v":""},{"$f":"IF(B211=\"\",\"\",IFERROR(INDEX('Seeding_quantities report'!$F$2:$F$10003,SMALL(IF('Seeding_quantities report'!$A$2:$A$10003=C$6,ROW('Seeding_quantities report'!$A$2:$A$10003)-1,\"\"),ROWS($B$8:$B211))),\"0\"))","v":""},null,{"$f":"IF(B211=\"\",\"\",$C211+#REF!+#REF!)","v":""},{"$f":"IF(C211=\"\",\"\",$C211+#REF!+#REF!)","v":""}]
[null,{"$f":"IFERROR(INDEX('Manual Inputs'!M:M,SMALL(IF('Manual Inputs'!M:M<>\"\",ROW('Manual Inputs'!M:M)),ROW(208:208))),\"\")","v":""},{"$f":"IF(B212=\"\",\"\",IFERROR(INDEX('Seeding_quantities report'!$F$2:$F$10003,SMALL(IF('Seeding_quantities report'!$A$2:$A$10003=C$6,ROW('Seeding_quantities report'!$A$2:$A$10003)-1,\"\"),ROWS($B$8:$B212))),\"0\"))","v":""},null,{"$f":"IF(B212=\"\",\"\",$C212+#REF!+#REF!)","v":""},{"$f":"IF(C212=\"\",\"\",$C212+#REF!+#REF!)","v":""}]
[null,{"$f":"IFERROR(INDEX('Manual Inputs'!M:M,SMALL(IF('Manual Inputs'!M:M<>\"\",ROW('Manual Inputs'!M:M)),ROW(209:209))),\"\")","v":""},{"$f":"IF(B213=\"\",\"\",IFERROR(INDEX('Seeding_quantities report'!$F$2:$F$10003,SMALL(IF('Seeding_quantities report'!$A$2:$A$10003=C$6,ROW('Seeding_quantities report'!$A$2:$A$10003)-1,\"\"),ROWS($B$8:$B213))),\"0\"))","v":""},null,{"$f":"IF(B213=\"\",\"\",$C213+#REF!+#REF!)","v":""},{"$f":"IF(C213=\"\",\"\",$C213+#REF!+#REF!)","v":""}]
[null,{"$f":"IFERROR(INDEX('Manual Inputs'!M:M,SMALL(IF('Manual Inputs'!M:M<>\"\",ROW('Manual Inputs'!M:M)),ROW(210:210))),\"\")","v":""},{"$f":"IF(B214=\"\",\"\",IFERROR(INDEX('Seeding_quantities report'!$F$2:$F$10003,SMALL(IF('Seeding_quantities report'!$A$2:$A$10003=C$6,ROW('Seeding_quantities report'!$A$2:$A$10003)-1,\"\"),ROWS($B$8:$B214))),\"0\"))","v":""},null,{"$f":"IF(B214=\"\",\"\",$C214+#REF!+#REF!)","v":""},{"$f":"IF(C214=\"\",\"\",$C214+#REF!+#REF!)","v":""}]
[null,{"$f":"IFERROR(INDEX('Manual Inputs'!M:M,SMALL(IF('Manual Inputs'!M:M<>\"\",ROW('Manual Inputs'!M:M)),ROW(211:211))),\"\")","v":""},{"$f":"IF(B215=\"\",\"\",IFERROR(INDEX('Seeding_quantities report'!$F$2:$F$10003,SMALL(IF('Seeding_quantities report'!$A$2:$A$10003=C$6,ROW('Seeding_quantities report'!$A$2:$A$10003)-1,\"\"),ROWS($B$8:$B215))),\"0\"))","v":""},null,{"$f":"IF(B215=\"\",\"\",$C215+#REF!+#REF!)","v":""},{"$f":"IF(C215=\"\",\"\",$C215+#REF!+#REF!)","v":""}]
[null,{"$f":"IFERROR(INDEX('Manual Inputs'!M:M,SMALL(IF('Manual Inputs'!M:M<>\"\",ROW('Manual Inputs'!M:M)),ROW(212:212))),\"\")","v":""},{"$f":"IF(B216=\"\",\"\",IFERROR(INDEX('Seeding_quantities report'!$F$2:$F$10003,SMALL(IF('Seeding_quantities report'!$A$2:$A$10003=C$6,ROW('Seeding_quantities report'!$A$2:$A$10003)-1,\"\"),ROWS($B$8:$B216))),\"0\"))","v":""},null,{"$f":"IF(B216=\"\",\"\",$C216+#REF!+#REF!)","v":""},{"$f":"IF(C216=\"\",\"\",$C216+#REF!+#REF!)","v":""}]
[null,{"$f":"IFERROR(INDEX('Manual Inputs'!M:M,SMALL(IF('Manual Inputs'!M:M<>\"\",ROW('Manual Inputs'!M:M)),ROW(213:213))),\"\")","v":""},{"$f":"IF(B217=\"\",\"\",IFERROR(INDEX('Seeding_quantities report'!$F$2:$F$10003,SMALL(IF('Seeding_quantities report'!$A$2:$A$10003=C$6,ROW('Seeding_quantities report'!$A$2:$A$10003)-1,\"\"),ROWS($B$8:$B217))),\"0\"))","v":""},null,{"$f":"IF(B217=\"\",\"\",$C217+#REF!+#REF!)","v":""},{"$f":"IF(C217=\"\",\"\",$C217+#REF!+#REF!)","v":""}]
[null,{"$f":"IFERROR(INDEX('Manual Inputs'!M:M,SMALL(IF('Manual Inputs'!M:M<>\"\",ROW('Manual Inputs'!M:M)),ROW(214:214))),\"\")","v":""},{"$f":"IF(B218=\"\",\"\",IFERROR(INDEX('Seeding_quantities report'!$F$2:$F$10003,SMALL(IF('Seeding_quantities report'!$A$2:$A$10003=C$6,ROW('Seeding_quantities report'!$A$2:$A$10003)-1,\"\"),ROWS($B$8:$B218))),\"0\"))","v":""},null,{"$f":"IF(B218=\"\",\"\",$C218+#REF!+#REF!)","v":""},{"$f":"IF(C218=\"\",\"\",$C218+#REF!+#REF!)","v":""}]
[null,{"$f":"IFERROR(INDEX('Manual Inputs'!M:M,SMALL(IF('Manual Inputs'!M:M<>\"\",ROW('Manual Inputs'!M:M)),ROW(215:215))),\"\")","v":""},{"$f":"IF(B219=\"\",\"\",IFERROR(INDEX('Seeding_quantities report'!$F$2:$F$10003,SMALL(IF('Seeding_quantities report'!$A$2:$A$10003=C$6,ROW('Seeding_quantities report'!$A$2:$A$10003)-1,\"\"),ROWS($B$8:$B219))),\"0\"))","v":""},null,{"$f":"IF(B219=\"\",\"\",$C219+#REF!+#REF!)","v":""},{"$f":"IF(C219=\"\",\"\",$C219+#REF!+#REF!)","v":""}]
[null,{"$f":"IFERROR(INDEX('Manual Inputs'!M:M,SMALL(IF('Manual Inputs'!M:M<>\"\",ROW('Manual Inputs'!M:M)),ROW(216:216))),\"\")","v":""},{"$f":"IF(B220=\"\",\"\",IFERROR(INDEX('Seeding_quantities report'!$F$2:$F$10003,SMALL(IF('Seeding_quantities report'!$A$2:$A$10003=C$6,ROW('Seeding_quantities report'!$A$2:$A$10003)-1,\"\"),ROWS($B$8:$B220))),\"0\"))","v":""},null,{"$f":"IF(B220=\"\",\"\",$C220+#REF!+#REF!)","v":""},{"$f":"IF(C220=\"\",\"\",$C220+#REF!+#REF!)","v":""}]
[null,{"$f":"IFERROR(INDEX('Manual Inputs'!M:M,SMALL(IF('Manual Inputs'!M:M<>\"\",ROW('Manual Inputs'!M:M)),ROW(217:217))),\"\")","v":""},{"$f":"IF(B221=\"\",\"\",IFERROR(INDEX('Seeding_quantities report'!$F$2:$F$10003,SMALL(IF('Seeding_quantities report'!$A$2:$A$10003=C$6,ROW('Seeding_quantities report'!$A$2:$A$10003)-1,\"\"),ROWS($B$8:$B221))),\"0\"))","v":""},null,{"$f":"IF(B221=\"\",\"\",$C221+#REF!+#REF!)","v":""},{"$f":"IF(C221=\"\",\"\",$C221+#REF!+#REF!)","v":""}]
[null,{"$f":"IFERROR(INDEX('Manual Inputs'!M:M,SMALL(IF('Manual Inputs'!M:M<>\"\",ROW('Manual Inputs'!M:M)),ROW(218:218))),\"\")","v":""},{"$f":"IF(B222=\"\",\"\",IFERROR(INDEX('Seeding_quantities report'!$F$2:$F$10003,SMALL(IF('Seeding_quantities report'!$A$2:$A$10003=C$6,ROW('Seeding_quantities report'!$A$2:$A$10003)-1,\"\"),ROWS($B$8:$B222))),\"0\"))","v":""},null,{"$f":"IF(B222=\"\",\"\",$C222+#REF!+#REF!)","v":""},{"$f":"IF(C222=\"\",\"\",$C222+#REF!+#REF!)","v":""}]
[null,{"$f":"IFERROR(INDEX('Manual Inputs'!M:M,SMALL(IF('Manual Inputs'!M:M<>\"\",ROW('Manual Inputs'!M:M)),ROW(219:219))),\"\")","v":""},{"$f":"IF(B223=\"\",\"\",IFERROR(INDEX('Seeding_quantities report'!$F$2:$F$10003,SMALL(IF('Seeding_quantities report'!$A$2:$A$10003=C$6,ROW('Seeding_quantities report'!$A$2:$A$10003)-1,\"\"),ROWS($B$8:$B223))),\"0\"))","v":""},null,{"$f":"IF(B223=\"\",\"\",$C223+#REF!+#REF!)","v":""},{"$f":"IF(C223=\"\",\"\",$C223+#REF!+#REF!)","v":""}]
[null,{"$f":"IFERROR(INDEX('Manual Inputs'!M:M,SMALL(IF('Manual Inputs'!M:M<>\"\",ROW('Manual Inputs'!M:M)),ROW(220:220))),\"\")","v":""},{"$f":"IF(B224=\"\",\"\",IFERROR(INDEX('Seeding_quantities report'!$F$2:$F$10003,SMALL(IF('Seeding_quantities report'!$A$2:$A$10003=C$6,ROW('Seeding_quantities report'!$A$2:$A$10003)-1,\"\"),ROWS($B$8:$B224))),\"0\"))","v":""},null,{"$f":"IF(B224=\"\",\"\",$C224+#REF!+#REF!)","v":""},{"$f":"IF(C224=\"\",\"\",$C224+#REF!+#REF!)","v":""}]
[null,{"$f":"IFERROR(INDEX('Manual Inputs'!M:M,SMALL(IF('Manual Inputs'!M:M<>\"\",ROW('Manual Inputs'!M:M)),ROW(221:221))),\"\")","v":""},{"$f":"IF(B225=\"\",\"\",IFERROR(INDEX('Seeding_quantities report'!$F$2:$F$10003,SMALL(IF('Seeding_quantities report'!$A$2:$A$10003=C$6,ROW('Seeding_quantities report'!$A$2:$A$10003)-1,\"\"),ROWS($B$8:$B225))),\"0\"))","v":""},null,{"$f":"IF(B225=\"\",\"\",$C225+#REF!+#REF!)","v":""},{"$f":"IF(C225=\"\",\"\",$C225+#REF!+#REF!)","v":""}]
[null,{"$f":"IFERROR(INDEX('Manual Inputs'!M:M,SMALL(IF('Manual Inputs'!M:M<>\"\",ROW('Manual Inputs'!M:M)),ROW(222:222))),\"\")","v":""},{"$f":"IF(B226=\"\",\"\",IFERROR(INDEX('Seeding_quantities report'!$F$2:$F$10003,SMALL(IF('Seeding_quantities report'!$A$2:$A$10003=C$6,ROW('Seeding_quantities report'!$A$2:$A$10003)-1,\"\"),ROWS($B$8:$B226))),\"0\"))","v":""},null,{"$f":"IF(B226=\"\",\"\",$C226+#REF!+#REF!)","v":""},{"$f":"IF(C226=\"\",\"\",$C226+#REF!+#REF!)","v":""}]
[null,{"$f":"IFERROR(INDEX('Manual Inputs'!M:M,SMALL(IF('Manual Inputs'!M:M<>\"\",ROW('Manual Inputs'!M:M)),ROW(223:223))),\"\")","v":""},{"$f":"IF(B227=\"\",\"\",IFERROR(INDEX('Seeding_quantities report'!$F$2:$F$10003,SMALL(IF('Seeding_quantities report'!$A$2:$A$10003=C$6,ROW('Seeding_quantities report'!$A$2:$A$10003)-1,\"\"),ROWS($B$8:$B227))),\"0\"))","v":""},null,{"$f":"IF(B227=\"\",\"\",$C227+#REF!+#REF!)","v":""},{"$f":"IF(C227=\"\",\"\",$C227+#REF!+#REF!)","v":""}]
[null,{"$f":"IFERROR(INDEX('Manual Inputs'!M:M,SMALL(IF('Manual Inputs'!M:M<>\"\",ROW('Manual Inputs'!M:M)),ROW(224:224))),\"\")","v":""},{"$f":"IF(B228=\"\",\"\",IFERROR(INDEX('Seeding_quantities report'!$F$2:$F$10003,SMALL(IF('Seeding_quantities report'!$A$2:$A$10003=C$6,ROW('Seeding_quantities report'!$A$2:$A$10003)-1,\"\"),ROWS($B$8:$B228))),\"0\"))","v":""},null,{"$f":"IF(B228=\"\",\"\",$C228+#REF!+#REF!)","v":""},{"$f":"IF(C228=\"\",\"\",$C228+#REF!+#REF!)","v":""}]
[null,{"$f":"IFERROR(INDEX('Manual Inputs'!M:M,SMALL(IF('Manual Inputs'!M:M<>\"\",ROW('Manual Inputs'!M:M)),ROW(225:225))),\"\")","v":""},{"$f":"IF(B229=\"\",\"\",IFERROR(INDEX('Seeding_quantities report'!$F$2:$F$10003,SMALL(IF('Seeding_quantities report'!$A$2:$A$10003=C$6,ROW('Seeding_quantities report'!$A$2:$A$10003)-1,\"\"),ROWS($B$8:$B229))),\"0\"))","v":""},null,{"$f":"IF(B229=\"\",\"\",$C229+#REF!+#REF!)","v":""},{"$f":"IF(C229=\"\",\"\",$C229+#REF!+#REF!)","v":""}]
[null,{"$f":"IFERROR(INDEX('Manual Inputs'!M:M,SMALL(IF('Manual Inputs'!M:M<>\"\",ROW('Manual Inputs'!M:M)),ROW(226:226))),\"\")","v":""},{"$f":"IF(B230=\"\",\"\",IFERROR(INDEX('Seeding_quantities report'!$F$2:$F$10003,SMALL(IF('Seeding_quantities report'!$A$2:$A$10003=C$6,ROW('Seeding_quantities report'!$A$2:$A$10003)-1,\"\"),ROWS($B$8:$B230))),\"0\"))","v":""},null,{"$f":"IF(B230=\"\",\"\",$C230+#REF!+#REF!)","v":""},{"$f":"IF(C230=\"\",\"\",$C230+#REF!+#REF!)","v":""}]
[null,{"$f":"IFERROR(INDEX('Manual Inputs'!M:M,SMALL(IF('Manual Inputs'!M:M<>\"\",ROW('Manual Inputs'!M:M)),ROW(227:227))),\"\")","v":""},{"$f":"IF(B231=\"\",\"\",IFERROR(INDEX('Seeding_quantities report'!$F$2:$F$10003,SMALL(IF('Seeding_quantities report'!$A$2:$A$10003=C$6,ROW('Seeding_quantities report'!$A$2:$A$10003)-1,\"\"),ROWS($B$8:$B231))),\"0\"))","v":""},null,{"$f":"IF(B231=\"\",\"\",$C231+#REF!+#REF!)","v":""},{"$f":"IF(C231=\"\",\"\",$C231+#REF!+#REF!)","v":""}]
[null,{"$f":"IFERROR(INDEX('Manual Inputs'!M:M,SMALL(IF('Manual Inputs'!M:M<>\"\",ROW('Manual Inputs'!M:M)),ROW(228:228))),\"\")","v":""},{"$f":"IF(B232=\"\",\"\",IFERROR(INDEX('Seeding_quantities report'!$F$2:$F$10003,SMALL(IF('Seeding_quantities report'!$A$2:$A$10003=C$6,ROW('Seeding_quantities report'!$A$2:$A$10003)-1,\"\"),ROWS($B$8:$B232))),\"0\"))","v":""},null,{"$f":"IF(B232=\"\",\"\",$C232+#REF!+#REF!)","v":""},{"$f":"IF(C232=\"\",\"\",$C232+#REF!+#REF!)","v":""}]
[null,{"$f":"IFERROR(INDEX('Manual Inputs'!M:M,SMALL(IF('Manual Inputs'!M:M<>\"\",ROW('Manual Inputs'!M:M)),ROW(229:229))),\"\")","v":""},{"$f":"IF(B233=\"\",\"\",IFERROR(INDEX('Seeding_quantities report'!$F$2:$F$10003,SMALL(IF('Seeding_quantities report'!$A$2:$A$10003=C$6,ROW('Seeding_quantities report'!$A$2:$A$10003)-1,\"\"),ROWS($B$8:$B233))),\"0\"))","v":""},null,{"$f":"IF(B233=\"\",\"\",$C233+#REF!+#REF!)","v":""},{"$f":"IF(C233=\"\",\"\",$C233+#REF!+#REF!)","v":""}]
[null,{"$f":"IFERROR(INDEX('Manual Inputs'!M:M,SMALL(IF('Manual Inputs'!M:M<>\"\",ROW('Manual Inputs'!M:M)),ROW(230:230))),\"\")","v":""},{"$f":"IF(B234=\"\",\"\",IFERROR(INDEX('Seeding_quantities report'!$F$2:$F$10003,SMALL(IF('Seeding_quantities report'!$A$2:$A$10003=C$6,ROW('Seeding_quantities report'!$A$2:$A$10003)-1,\"\"),ROWS($B$8:$B234))),\"0\"))","v":""},null,{"$f":"IF(B234=\"\",\"\",$C234+#REF!+#REF!)","v":""},{"$f":"IF(C234=\"\",\"\",$C234+#REF!+#REF!)","v":""}]
[null,{"$f":"IFERROR(INDEX('Manual Inputs'!M:M,SMALL(IF('Manual Inputs'!M:M<>\"\",ROW('Manual Inputs'!M:M)),ROW(231:231))),\"\")","v":""},{"$f":"IF(B235=\"\",\"\",IFERROR(INDEX('Seeding_quantities report'!$F$2:$F$10003,SMALL(IF('Seeding_quantities report'!$A$2:$A$10003=C$6,ROW('Seeding_quantities report'!$A$2:$A$10003)-1,\"\"),ROWS($B$8:$B235))),\"0\"))","v":""},null,{"$f":"IF(B235=\"\",\"\",$C235+#REF!+#REF!)","v":""},{"$f":"IF(C235=\"\",\"\",$C235+#REF!+#REF!)","v":""}]
[null,{"$f":"IFERROR(INDEX('Manual Inputs'!M:M,SMALL(IF('Manual Inputs'!M:M<>\"\",ROW('Manual Inputs'!M:M)),ROW(232:232))),\"\")","v":""},{"$f":"IF(B236=\"\",\"\",IFERROR(INDEX('Seeding_quantities report'!$F$2:$F$10003,SMALL(IF('Seeding_quantities report'!$A$2:$A$10003=C$6,ROW('Seeding_quantities report'!$A$2:$A$10003)-1,\"\"),ROWS($B$8:$B236))),\"0\"))","v":""},null,{"$f":"IF(B236=\"\",\"\",$C236+#REF!+#REF!)","v":""},{"$f":"IF(C236=\"\",\"\",$C236+#REF!+#REF!)","v":""}]
[null,{"$f":"IFERROR(INDEX('Manual Inputs'!M:M,SMALL(IF('Manual Inputs'!M:M<>\"\",ROW('Manual Inputs'!M:M)),ROW(233:233))),\"\")","v":""},{"$f":"IF(B237=\"\",\"\",IFERROR(INDEX('Seeding_quantities report'!$F$2:$F$10003,SMALL(IF('Seeding_quantities report'!$A$2:$A$10003=C$6,ROW('Seeding_quantities report'!$A$2:$A$10003)-1,\"\"),ROWS($B$8:$B237))),\"0\"))","v":""},null,{"$f":"IF(B237=\"\",\"\",$C237+#REF!+#REF!)","v":""},{"$f":"IF(C237=\"\",\"\",$C237+#REF!+#REF!)","v":""}]
[null,{"$f":"IFERROR(INDEX('Manual Inputs'!M:M,SMALL(IF('Manual Inputs'!M:M<>\"\",ROW('Manual Inputs'!M:M)),ROW(234:234))),\"\")","v":""},{"$f":"IF(B238=\"\",\"\",IFERROR(INDEX('Seeding_quantities report'!$F$2:$F$10003,SMALL(IF('Seeding_quantities report'!$A$2:$A$10003=C$6,ROW('Seeding_quantities report'!$A$2:$A$10003)-1,\"\"),ROWS($B$8:$B238))),\"0\"))","v":""},null,{"$f":"IF(B238=\"\",\"\",$C238+#REF!+#REF!)","v":""},{"$f":"IF(C238=\"\",\"\",$C238+#REF!+#REF!)","v":""}]
[null,{"$f":"IFERROR(INDEX('Manual Inputs'!M:M,SMALL(IF('Manual Inputs'!M:M<>\"\",ROW('Manual Inputs'!M:M)),ROW(235:235))),\"\")","v":""},{"$f":"IF(B239=\"\",\"\",IFERROR(INDEX('Seeding_quantities report'!$F$2:$F$10003,SMALL(IF('Seeding_quantities report'!$A$2:$A$10003=C$6,ROW('Seeding_quantities report'!$A$2:$A$10003)-1,\"\"),ROWS($B$8:$B239))),\"0\"))","v":""},null,{"$f":"IF(B239=\"\",\"\",$C239+#REF!+#REF!)","v":""},{"$f":"IF(C239=\"\",\"\",$C239+#REF!+#REF!)","v":""}]
[null,{"$f":"IFERROR(INDEX('Manual Inputs'!M:M,SMALL(IF('Manual Inputs'!M:M<>\"\",ROW('Manual Inputs'!M:M)),ROW(236:236))),\"\")","v":""},{"$f":"IF(B240=\"\",\"\",IFERROR(INDEX('Seeding_quantities report'!$F$2:$F$10003,SMALL(IF('Seeding_quantities report'!$A$2:$A$10003=C$6,ROW('Seeding_quantities report'!$A$2:$A$10003)-1,\"\"),ROWS($B$8:$B240))),\"0\"))","v":""},null,{"$f":"IF(B240=\"\",\"\",$C240+#REF!+#REF!)","v":""},{"$f":"IF(C240=\"\",\"\",$C240+#REF!+#REF!)","v":""}]

{"sheet":"Summary","index":6,"n_rows":116,"n_cols":13,"rows_kept":116,"cut":false,"hidden":false,"merged":[[2,11,2,14],[38,2,38,6],[112,0,112,2],[5,3,5,6],[6,2,7,2],[6,3,7,5],[6,6,7,6],[107,0,107,2],[69,2,69,6],[100,2,100,6],[102,0,102,2],[7,0,7,1],[4,3,4,6]]}
[null,null,null,null,null,"Pay Item File:","N:\\CFL-DPIT\\Excel\\Payitems14.csv"]
[null,null,null,null,null,null,null,"Leave this column HIDDEN!!! Do not delete"]
["Check Column - do not delete",null,null,null,null,null,null,{"$f":"IF(ISERROR(VLOOKUP(H2,Data!$A:$C,2,FALSE)),\"\",VLOOKUP(H2,Data!$A:$C,2,FALSE))","v":""},null,null,null,"Do not manually add columns to the spreadsheet.  The macro will become inoperable if columns are added to the left of the remarks column."]
[]
[null,null,null,"CLEARING AND GRUBBING SUMMARY",null,null,null,null,null,null,null,"*Remember to Merge and Center the Title over the entire table"]
[null,null,null,"Item Number",null,null,null,{"$f":"H2","v":"Leave this column HIDDEN!!! Do not delete"}]
[null,null,"Schedule","Station to Station",null,null,"Side",{"$f":"IF(ISBLANK(H2),\"\",LOOKUP(H2,'[1]FP14 Pay Items'!$A$1:$A$65536,'[1]FP14 Pay Items'!$D$1:$D$65536))","v":"FUNDING RECLASSIFICATION"},"Remarks"]
[null,null,null,null,null,null,null,{"$f":"IF(ISBLANK(H2),\"\",LOOKUP(H2,'[1]FP14 Pay Items'!$A$1:$A$65536,'[1]FP14 Pay Items'!$E$1:$E$65536))","v":"LPSM"}]
[]
[]
[]
[]
[]
[]
[]
[]
[]
[]
[]
[null,{"$f":"IF(A21=\"\",\"\",+A21)","v":""}]
[null,"",null,{"$f":"IF(Clearing!J21=\"\",\"\",INDIRECT(CONCATENATE(Clearing!$J$8,\"!\",\"A\",Clearing!J21)))","v":""},{"$f":"IF(D21=\"\",\"\",\"-\")","v":""},{"$f":"IF(Clearing!J21=\"\",\"\",INDIRECT(CONCATENATE(Clearing!$J$8,\"!\",\"A\",Clearing!K21)))","v":""}]
[null,"",null,{"$f":"IF(Clearing!J22=\"\",\"\",INDIRECT(CONCATENATE(Clearing!$J$8,\"!\",\"A\",Clearing!J22)))","v":""},{"$f":"IF(D22=\"\",\"\",\"-\")","v":""},{"$f":"IF(Clearing!J22=\"\",\"\",INDIRECT(CONCATENATE(Clearing!$J$8,\"!\",\"A\",Clearing!K22)))","v":""}]
[null,"",null,{"$f":"IF(L23=\"\",\"\",INDIRECT(CONCATENATE(Clearing!$J$8,\"!\",\"A\",L23)))","v":""},{"$f":"IF(D23=\"\",\"\",\"-\")","v":""},{"$f":"IF(L23=\"\",\"\",INDIRECT(CONCATENATE(Clearing!$J$8,\"!\",\"A\",M23)))","v":""}]
[null,"",null,null,null,null,null,null,null,null,null,null,{"$f":"IF(L25=\"\",\"\",+L25)","v":""}]
[null,""]
[null,""]
[null,""]
[null,""]
[null,""]
[null,""]
[null,""]
[null,""]
[null,""]
[null,""]
[null,""]
[null,""]
[null,""]
[]
[null,null,{"$f":"IF(Data!$G$2=1,IF(Data!$G$2=1,\"TOTAL\",IF(Data!$G$2=2,\"SCHEDULE A TOTAL\",IF(Data!$G$2=3,\"SCHEDULE A TOTAL\",\"SCHEDULE A TOTAL\"))),IF(Data!$G$2=2,\"SCHEDULE A TOTALS\",IF(Data!$G$2=3,\"SCHEDULE A TOTALS\",\"SCHEDULE A TOTALS\")))","v":"TOTAL"},null,null,null,null,{"$f":"IF(H$8=\"LPSM\",\"ALL\",SUM(H$9:H$38))","v":"ALL"}]
[]
[]
[]
[]
[]
[]
[]
[]
[]
[]
[]
[]
[]
[]
[]
[]
[]
[]
[]
[]
[]
[]
[]
[]
[]
[]
[]
[]
[]
[]
[null,null,{"$f":"IF(Data!$D$2=1,IF($N$1=1,\"TOTAL\",IF(N32=2,\"SCHEDULE B TOTAL\",IF($N$1=3,\"SCHEDULE B TOTAL\",\"SCHEDULE B TOTAL\"))),IF($N$1=1,\"TOTALS\",IF($N$1=2,\"SCHEDULE B TOTALS\",IF($N$1=3,\"SCHEDULE B TOTALS\",\"SCHEDULE B TOTALS\"))))","v":"SCHEDULE B TOTALS"},null,null,null,null,{"$f":"IF(H$8=\"LPSM\",\"ALL\",SUM(H$40:H$69)+H$39)","v":"ALL"}]
[]
[]
[]
[]
[]
[]
[]
[]
[]
[]
[]
[]
[]
[]
[]
[]
[]
[]
[]
[]
[]
[]
[]
[]
[]
[]
[]
[]
[]
[]
[null,null,{"$f":"IF(Data!$D$2=1,IF($N$1=1,\"TOTAL\",IF($N$1=2,\"SCHEDULE C TOTAL\",IF($N$1=3,\"SCHEDULE C TOTAL\",\"SCHEDULE C TOTAL\"))),IF($N$1=1,\"TOTALS\",IF($N$1=2,\"SCHEDULE C TOTALS\",IF($N$1=3,\"SCHEDULE C TOTALS\",\"SCHEDULE C TOTALS\"))))","v":"SCHEDULE C TOTALS"},null,null,null,null,{"$f":"IF(H$8=\"LPSM\",\"ALL\",SUM(H$71:H$100)+H$70)","v":"ALL"}]
[]
[{"$f":"IF(Data!$G$2=1,\" \",IF(Data!$G$2=2,\"Schedule A\",IF(Data!$G$2=3,\"Schedule A\")))","v":" "},null,null,"Rounding %"]
[null,null,null,"Round up"]
[null,null,null,"Bid Schedule",null,null,null,{"$f":"IF(H$8=\"each\",H$39,IF(H$8=\"LPSM\",\"LPSM\",IF(H$104=0,ROUND((H$39*(1+H$103)),0),CEILING(H$39*(1+H$103),H$104))))","v":"LPSM"}]
[null,null,null,"Allowance",null,null,null,{"$f":"IF(H$8=\"LPSM\",\"--\",H$105-H$39)","v":"--"}]
[]
[{"$f":"IF(Data!$G$2=1,\" \",IF(Data!$G$2=2,\"Schedule B\",IF(Data!$G$2=3,\"Schedule B\")))","v":" "},null,null,{"$f":"IF(Data!$G$2=1, \"\", \"Rounding %\")","v":""}]
[null,null,null,{"$f":"IF(Data!$G$2=1, \" \", \"Round up\")","v":" "}]
[null,null,null,{"$f":"IF(Data!$G$2=1, \" \", \"Bid Schedule\")","v":" "},null,null,null,{"$f":"IF(Data!G2=1,\"\",IF(H$8=\"each\",H$70,IF(H$8=\"LPSM\",\"LPSM\",IF(H$109=0,ROUND((H$70*(1+H$108)),0),CEILING(H$70*(1+H$108),H$109)))))","v":""}]
[null,null,null,{"$f":"IF(Data!$G$2=1, \" \", \"Allowance\")","v":" "},null,null,null,{"$f":"IF(Data!G2=1,\"\",IF(H$8=\"LPSM\",\"--\",H$110-H$70))","v":""}]
[]
[{"$f":"IF(Data!$G$2=1,\" \",IF(Data!$G$2=2,\" \",IF(Data!$G$2=3,\"Schedule C\")))","v":" "},null,null,{"$f":"IF(Data!$G$2=1, \"\", IF(Data!$G$2=2, \"\", \"Rounding %\"))","v":""}]
[null,null,null,{"$f":"IF(Data!$G$2=1, \" \", IF(Data!$G$2=2, \"\", \"Round up\"))","v":" "}]
[null,null,null,{"$f":"IF(Data!$G$2=1, \" \", IF(Data!$G$2=2, \"\", \"Bid Schedule\"))","v":" "},null,null,null,{"$f":"IF(Data!G2=1,\"\",IF(H$8=\"each\",H$101,IF(H$8=\"LPSM\",\"LPSM\",IF(H$114=0,ROUND((H$101*(1+H$113)),0),CEILING(H$101*(1+H$113),H$114)))))","v":""}]
[null,null,null,{"$f":"IF(Data!$G$2=1, \" \", IF(Data!$G$2=2, \"\", \"Allowance\"))","v":" "},null,null,null,{"$f":"IF(Data!G2=1,\"\",IF(H$8=\"LPSM\",\"--\",H$115-H$101))","v":""}]

{"sheet":"Data","index":7,"n_rows":3,"n_cols":7,"rows_kept":3,"cut":false,"hidden":false,"merged":[]}
["Pay Item Number","Description","Unit","Num Items",null,"Sides","Schedules"]
[null,null,null,{"$f":"COUNTA(A:A)-1","v":0},null,"RT",1]
[null,null,null,null,null,"LT"]

{"sheet":"Clearing Calculations","index":8,"n_rows":25,"n_cols":11,"rows_kept":25,"cut":false,"hidden":false,"merged":[[0,5,0,6],[0,7,0,8],[0,9,0,10]]}
["Station: ","Offset","Offset","Feature","Feature","With Rounding",null,"Additonal Clearing",null,"Total Clearing"]
[null,"LT","RT",null,null,"LT","RT","LT","RT","LT","RT"]
[{"$f":"_xlfn._xlws.FILTER('Clearing Cross Section Report'!B:B,'Clearing Cross Section Report'!A:A='Clearing Calculations'!A1)","v":{"$error":"#VALUE!"}},{"$f":"ABS(_xlfn._xlws.FILTER('Clearing Cross Section Report'!B:B,'Clearing Cross Section Report'!A:A='Clearing Calculations'!B1))","v":{"$error":"#VALUE!"}},{"$f":"ABS(_xlfn._xlws.FILTER('Clearing Cross Section Report'!C:C,'Clearing Cross Section Report'!A:A='Clearing Calculations'!B1))","v":{"$error":"#VALUE!"}},{"$f":"_xlfn._xlws.FILTER('Clearing Cross Section Report'!B:B,'Clearing Cross Section Report'!A:A='Clearing Calculations'!D1)","v":{"$error":"#VALUE!"}},{"$f":"_xlfn._xlws.FILTER('Clearing Cross Section Report'!C:C,'Clearing Cross Section Report'!A:A='Clearing Calculations'!E1)","v":{"$error":"#VALUE!"}},{"$f":"IF(ISBLANK(A3),\"\",IF(ISNUMBER(SEARCH(\"cut\",E3,10)),'Manual Inputs'!$C$5,\"0\"))","v":"0"},{"$f":"IF(ISBLANK(B3),\"\",IF(ISNUMBER(SEARCH(\"cut\",E3,10)),'Manual Inputs'!$C$5,\"0\"))","v":"0"},{"$f":"IF(ISBLANK(A3),\"\",IF(ISNUMBER(SEARCH(\"cut\",D3,10)),'Manual Inputs'!$C$7,IF(ISNUMBER(SEARCH(\"fill\",D3,10)),'Manual Inputs'!$C$9,\"0\")))","v":"0"},{"$f":"IF(ISBLANK(A3),\"\",IF(ISNUMBER(SEARCH(\"cut\",E3,10)),'Manual Inputs'!$C$7,IF(ISNUMBER(SEARCH(\"fill\",E3,10)),'Manual Inputs'!$C$9,\"0\")))","v":"0"},{"$f":"IF(ISBLANK(A3),\"\",IF((B3+F3+H3)>'Manual Inputs'!$C$11,(B3+F3+H3),'Manual Inputs'!$C$11))","v":{"$error":"#VALUE!"}},{"$f":"IF(ISBLANK(A3),\"\",IF((C3+G3+I3)>'Manual Inputs'!$C$11,(C3+G3+I3),'Manual Inputs'!$C$11))","v":{"$error":"#VALUE!"}}]
[null,null,null,null,null,{"$f":"IF(ISBLANK(A4),\"\",IF(ISNUMBER(SEARCH(\"cut\",D4,10)),'Manual Inputs'!$C$5,\"0\"))","v":""},{"$f":"IF(ISBLANK(B4),\"\",IF(ISNUMBER(SEARCH(\"cut\",E4,10)),'Manual Inputs'!$C$5,\"0\"))","v":""},{"$f":"IF(ISBLANK(A4),\"\",IF(ISNUMBER(SEARCH(\"cut\",D4,10)),'Manual Inputs'!$C$7,IF(ISNUMBER(SEARCH(\"fill\",D4,10)),'Manual Inputs'!$C$9,\"0\")))","v":""},{"$f":"IF(ISBLANK(A4),\"\",IF(ISNUMBER(SEARCH(\"cut\",E4,10)),'Manual Inputs'!$C$7,IF(ISNUMBER(SEARCH(\"fill\",E4,10)),'Manual Inputs'!$C$9,\"0\")))","v":""},{"$f":"IF(ISBLANK(A4),\"\",IF((B4+F4+H4)>'Manual Inputs'!$C$11,(B4+F4+H4),'Manual Inputs'!$C$11))","v":""},{"$f":"IF(ISBLANK(A4),\"\",IF((C4+G4+I4)>'Manual Inputs'!$C$11,(C4+G4+I4),'Manual Inputs'!$C$11))","v":""}]
[null,null,null,null,null,{"$f":"IF(ISBLANK(A5),\"\",IF(ISNUMBER(SEARCH(\"cut\",D5,10)),'Manual Inputs'!$C$5,\"0\"))","v":""},{"$f":"IF(ISBLANK(B5),\"\",IF(ISNUMBER(SEARCH(\"cut\",E5,10)),'Manual Inputs'!$C$5,\"0\"))","v":""},{"$f":"IF(ISBLANK(A5),\"\",IF(ISNUMBER(SEARCH(\"cut\",D5,10)),'Manual Inputs'!$C$7,IF(ISNUMBER(SEARCH(\"fill\",D5,10)),'Manual Inputs'!$C$9,\"0\")))","v":""},{"$f":"IF(ISBLANK(A5),\"\",IF(ISNUMBER(SEARCH(\"cut\",E5,10)),'Manual Inputs'!$C$7,IF(ISNUMBER(SEARCH(\"fill\",E5,10)),'Manual Inputs'!$C$9,\"0\")))","v":""},{"$f":"IF(ISBLANK(A5),\"\",IF((B5+F5+H5)>'Manual Inputs'!$C$11,(B5+F5+H5),'Manual Inputs'!$C$11))","v":""},{"$f":"IF(ISBLANK(A5),\"\",IF((C5+G5+I5)>'Manual Inputs'!$C$11,(C5+G5+I5),'Manual Inputs'!$C$11))","v":""}]
[null,null,null,null,null,{"$f":"IF(ISBLANK(A6),\"\",IF(ISNUMBER(SEARCH(\"cut\",D6,10)),'Manual Inputs'!$C$5,\"0\"))","v":""},{"$f":"IF(ISBLANK(B6),\"\",IF(ISNUMBER(SEARCH(\"cut\",E6,10)),'Manual Inputs'!$C$5,\"0\"))","v":""},{"$f":"IF(ISBLANK(A6),\"\",IF(ISNUMBER(SEARCH(\"cut\",D6,10)),'Manual Inputs'!$C$7,IF(ISNUMBER(SEARCH(\"fill\",D6,10)),'Manual Inputs'!$C$9,\"0\")))","v":""},{"$f":"IF(ISBLANK(A6),\"\",IF(ISNUMBER(SEARCH(\"cut\",E6,10)),'Manual Inputs'!$C$7,IF(ISNUMBER(SEARCH(\"fill\",E6,10)),'Manual Inputs'!$C$9,\"0\")))","v":""},{"$f":"IF(ISBLANK(A6),\"\",IF((B6+F6+H6)>'Manual Inputs'!$C$11,(B6+F6+H6),'Manual Inputs'!$C$11))","v":""},{"$f":"IF(ISBLANK(A6),\"\",IF((C6+G6+I6)>'Manual Inputs'!$C$11,(C6+G6+I6),'Manual Inputs'!$C$11))","v":""}]
[null,null,null,null,null,{"$f":"IF(ISBLANK(A7),\"\",IF(ISNUMBER(SEARCH(\"cut\",D7,10)),'Manual Inputs'!$C$5,\"0\"))","v":""},{"$f":"IF(ISBLANK(B7),\"\",IF(ISNUMBER(SEARCH(\"cut\",E7,10)),'Manual Inputs'!$C$5,\"0\"))","v":""},{"$f":"IF(ISBLANK(A7),\"\",IF(ISNUMBER(SEARCH(\"cut\",D7,10)),'Manual Inputs'!$C$7,IF(ISNUMBER(SEARCH(\"fill\",D7,10)),'Manual Inputs'!$C$9,\"0\")))","v":""},{"$f":"IF(ISBLANK(A7),\"\",IF(ISNUMBER(SEARCH(\"cut\",E7,10)),'Manual Inputs'!$C$7,IF(ISNUMBER(SEARCH(\"fill\",E7,10)),'Manual Inputs'!$C$9,\"0\")))","v":""},{"$f":"IF(ISBLANK(A7),\"\",IF((B7+F7+H7)>'Manual Inputs'!$C$11,(B7+F7+H7),'Manual Inputs'!$C$11))","v":""},{"$f":"IF(ISBLANK(A7),\"\",IF((C7+G7+I7)>'Manual Inputs'!$C$11,(C7+G7+I7),'Manual Inputs'!$C$11))","v":""}]
[null,null,null,null,null,{"$f":"IF(ISBLANK(A8),\"\",IF(ISNUMBER(SEARCH(\"cut\",D8,10)),'Manual Inputs'!$C$5,\"0\"))","v":""},{"$f":"IF(ISBLANK(B8),\"\",IF(ISNUMBER(SEARCH(\"cut\",E8,10)),'Manual Inputs'!$C$5,\"0\"))","v":""},{"$f":"IF(ISBLANK(A8),\"\",IF(ISNUMBER(SEARCH(\"cut\",D8,10)),'Manual Inputs'!$C$7,IF(ISNUMBER(SEARCH(\"fill\",D8,10)),'Manual Inputs'!$C$9,\"0\")))","v":""},{"$f":"IF(ISBLANK(A8),\"\",IF(ISNUMBER(SEARCH(\"cut\",E8,10)),'Manual Inputs'!$C$7,IF(ISNUMBER(SEARCH(\"fill\",E8,10)),'Manual Inputs'!$C$9,\"0\")))","v":""},{"$f":"IF(ISBLANK(A8),\"\",IF((B8+F8+H8)>'Manual Inputs'!$C$11,(B8+F8+H8),'Manual Inputs'!$C$11))","v":""},{"$f":"IF(ISBLANK(A8),\"\",IF((C8+G8+I8)>'Manual Inputs'!$C$11,(C8+G8+I8),'Manual Inputs'!$C$11))","v":""}]
[null,null,null,null,null,{"$f":"IF(ISBLANK(A9),\"\",IF(ISNUMBER(SEARCH(\"cut\",D9,10)),'Manual Inputs'!$C$5,\"0\"))","v":""},{"$f":"IF(ISBLANK(B9),\"\",IF(ISNUMBER(SEARCH(\"cut\",E9,10)),'Manual Inputs'!$C$5,\"0\"))","v":""},{"$f":"IF(ISBLANK(A9),\"\",IF(ISNUMBER(SEARCH(\"cut\",D9,10)),'Manual Inputs'!$C$7,IF(ISNUMBER(SEARCH(\"fill\",D9,10)),'Manual Inputs'!$C$9,\"0\")))","v":""},{"$f":"IF(ISBLANK(A9),\"\",IF(ISNUMBER(SEARCH(\"cut\",E9,10)),'Manual Inputs'!$C$7,IF(ISNUMBER(SEARCH(\"fill\",E9,10)),'Manual Inputs'!$C$9,\"0\")))","v":""},{"$f":"IF(ISBLANK(A9),\"\",IF((B9+F9+H9)>'Manual Inputs'!$C$11,(B9+F9+H9),'Manual Inputs'!$C$11))","v":""},{"$f":"IF(ISBLANK(A9),\"\",IF((C9+G9+I9)>'Manual Inputs'!$C$11,(C9+G9+I9),'Manual Inputs'!$C$11))","v":""}]
[null,null,null,null,null,{"$f":"IF(ISBLANK(A10),\"\",IF(ISNUMBER(SEARCH(\"cut\",D10,10)),'Manual Inputs'!$C$5,\"0\"))","v":""},{"$f":"IF(ISBLANK(B10),\"\",IF(ISNUMBER(SEARCH(\"cut\",E10,10)),'Manual Inputs'!$C$5,\"0\"))","v":""},{"$f":"IF(ISBLANK(A10),\"\",IF(ISNUMBER(SEARCH(\"cut\",D10,10)),'Manual Inputs'!$C$7,IF(ISNUMBER(SEARCH(\"fill\",D10,10)),'Manual Inputs'!$C$9,\"0\")))","v":""},{"$f":"IF(ISBLANK(A10),\"\",IF(ISNUMBER(SEARCH(\"cut\",E10,10)),'Manual Inputs'!$C$7,IF(ISNUMBER(SEARCH(\"fill\",E10,10)),'Manual Inputs'!$C$9,\"0\")))","v":""},{"$f":"IF(ISBLANK(A10),\"\",IF((B10+F10+H10)>'Manual Inputs'!$C$11,(B10+F10+H10),'Manual Inputs'!$C$11))","v":""},{"$f":"IF(ISBLANK(A10),\"\",IF((C10+G10+I10)>'Manual Inputs'!$C$11,(C10+G10+I10),'Manual Inputs'!$C$11))","v":""}]
[null,null,null,null,null,{"$f":"IF(ISBLANK(A11),\"\",IF(ISNUMBER(SEARCH(\"cut\",D11,10)),'Manual Inputs'!$C$5,\"0\"))","v":""},{"$f":"IF(ISBLANK(B11),\"\",IF(ISNUMBER(SEARCH(\"cut\",E11,10)),'Manual Inputs'!$C$5,\"0\"))","v":""},{"$f":"IF(ISBLANK(A11),\"\",IF(ISNUMBER(SEARCH(\"cut\",D11,10)),'Manual Inputs'!$C$7,IF(ISNUMBER(SEARCH(\"fill\",D11,10)),'Manual Inputs'!$C$9,\"0\")))","v":""},{"$f":"IF(ISBLANK(A11),\"\",IF(ISNUMBER(SEARCH(\"cut\",E11,10)),'Manual Inputs'!$C$7,IF(ISNUMBER(SEARCH(\"fill\",E11,10)),'Manual Inputs'!$C$9,\"0\")))","v":""},{"$f":"IF(ISBLANK(A11),\"\",IF((B11+F11+H11)>'Manual Inputs'!$C$11,(B11+F11+H11),'Manual Inputs'!$C$11))","v":""},{"$f":"IF(ISBLANK(A11),\"\",IF((C11+G11+I11)>'Manual Inputs'!$C$11,(C11+G11+I11),'Manual Inputs'!$C$11))","v":""}]
[null,null,null,null,null,{"$f":"IF(ISBLANK(A12),\"\",IF(ISNUMBER(SEARCH(\"cut\",D12,10)),'Manual Inputs'!$C$5,\"0\"))","v":""},{"$f":"IF(ISBLANK(B12),\"\",IF(ISNUMBER(SEARCH(\"cut\",E12,10)),'Manual Inputs'!$C$5,\"0\"))","v":""},{"$f":"IF(ISBLANK(A12),\"\",IF(ISNUMBER(SEARCH(\"cut\",D12,10)),'Manual Inputs'!$C$7,IF(ISNUMBER(SEARCH(\"fill\",D12,10)),'Manual Inputs'!$C$9,\"0\")))","v":""},{"$f":"IF(ISBLANK(A12),\"\",IF(ISNUMBER(SEARCH(\"cut\",E12,10)),'Manual Inputs'!$C$7,IF(ISNUMBER(SEARCH(\"fill\",E12,10)),'Manual Inputs'!$C$9,\"0\")))","v":""},{"$f":"IF(ISBLANK(A12),\"\",IF((B12+F12+H12)>'Manual Inputs'!$C$11,(B12+F12+H12),'Manual Inputs'!$C$11))","v":""},{"$f":"IF(ISBLANK(A12),\"\",IF((C12+G12+I12)>'Manual Inputs'!$C$11,(C12+G12+I12),'Manual Inputs'!$C$11))","v":""}]
[null,null,null,null,null,{"$f":"IF(ISBLANK(A13),\"\",IF(ISNUMBER(SEARCH(\"cut\",D13,10)),'Manual Inputs'!$C$5,\"0\"))","v":""},{"$f":"IF(ISBLANK(B13),\"\",IF(ISNUMBER(SEARCH(\"cut\",E13,10)),'Manual Inputs'!$C$5,\"0\"))","v":""},{"$f":"IF(ISBLANK(A13),\"\",IF(ISNUMBER(SEARCH(\"cut\",D13,10)),'Manual Inputs'!$C$7,IF(ISNUMBER(SEARCH(\"fill\",D13,10)),'Manual Inputs'!$C$9,\"0\")))","v":""},{"$f":"IF(ISBLANK(A13),\"\",IF(ISNUMBER(SEARCH(\"cut\",E13,10)),'Manual Inputs'!$C$7,IF(ISNUMBER(SEARCH(\"fill\",E13,10)),'Manual Inputs'!$C$9,\"0\")))","v":""},{"$f":"IF(ISBLANK(A13),\"\",IF((B13+F13+H13)>'Manual Inputs'!$C$11,(B13+F13+H13),'Manual Inputs'!$C$11))","v":""},{"$f":"IF(ISBLANK(A13),\"\",IF((C13+G13+I13)>'Manual Inputs'!$C$11,(C13+G13+I13),'Manual Inputs'!$C$11))","v":""}]
[null,null,null,null,null,{"$f":"IF(ISBLANK(A14),\"\",IF(ISNUMBER(SEARCH(\"cut\",D14,10)),'Manual Inputs'!$C$5,\"0\"))","v":""},{"$f":"IF(ISBLANK(B14),\"\",IF(ISNUMBER(SEARCH(\"cut\",E14,10)),'Manual Inputs'!$C$5,\"0\"))","v":""},{"$f":"IF(ISBLANK(A14),\"\",IF(ISNUMBER(SEARCH(\"cut\",D14,10)),'Manual Inputs'!$C$7,IF(ISNUMBER(SEARCH(\"fill\",D14,10)),'Manual Inputs'!$C$9,\"0\")))","v":""},{"$f":"IF(ISBLANK(A14),\"\",IF(ISNUMBER(SEARCH(\"cut\",E14,10)),'Manual Inputs'!$C$7,IF(ISNUMBER(SEARCH(\"fill\",E14,10)),'Manual Inputs'!$C$9,\"0\")))","v":""},{"$f":"IF(ISBLANK(A14),\"\",IF((B14+F14+H14)>'Manual Inputs'!$C$11,(B14+F14+H14),'Manual Inputs'!$C$11))","v":""},{"$f":"IF(ISBLANK(A14),\"\",IF((C14+G14+I14)>'Manual Inputs'!$C$11,(C14+G14+I14),'Manual Inputs'!$C$11))","v":""}]
[null,null,null,null,null,{"$f":"IF(ISBLANK(A15),\"\",IF(ISNUMBER(SEARCH(\"cut\",D15,10)),'Manual Inputs'!$C$5,\"0\"))","v":""},{"$f":"IF(ISBLANK(B15),\"\",IF(ISNUMBER(SEARCH(\"cut\",E15,10)),'Manual Inputs'!$C$5,\"0\"))","v":""},{"$f":"IF(ISBLANK(A15),\"\",IF(ISNUMBER(SEARCH(\"cut\",D15,10)),'Manual Inputs'!$C$7,IF(ISNUMBER(SEARCH(\"fill\",D15,10)),'Manual Inputs'!$C$9,\"0\")))","v":""},{"$f":"IF(ISBLANK(A15),\"\",IF(ISNUMBER(SEARCH(\"cut\",E15,10)),'Manual Inputs'!$C$7,IF(ISNUMBER(SEARCH(\"fill\",E15,10)),'Manual Inputs'!$C$9,\"0\")))","v":""},{"$f":"IF(ISBLANK(A15),\"\",IF((B15+F15+H15)>'Manual Inputs'!$C$11,(B15+F15+H15),'Manual Inputs'!$C$11))","v":""},{"$f":"IF(ISBLANK(A15),\"\",IF((C15+G15+I15)>'Manual Inputs'!$C$11,(C15+G15+I15),'Manual Inputs'!$C$11))","v":""}]
[null,null,null,null,null,{"$f":"IF(ISBLANK(A16),\"\",IF(ISNUMBER(SEARCH(\"cut\",D16,10)),'Manual Inputs'!$C$5,\"0\"))","v":""},{"$f":"IF(ISBLANK(B16),\"\",IF(ISNUMBER(SEARCH(\"cut\",E16,10)),'Manual Inputs'!$C$5,\"0\"))","v":""},{"$f":"IF(ISBLANK(A16),\"\",IF(ISNUMBER(SEARCH(\"cut\",D16,10)),'Manual Inputs'!$C$7,IF(ISNUMBER(SEARCH(\"fill\",D16,10)),'Manual Inputs'!$C$9,\"0\")))","v":""},{"$f":"IF(ISBLANK(A16),\"\",IF(ISNUMBER(SEARCH(\"cut\",E16,10)),'Manual Inputs'!$C$7,IF(ISNUMBER(SEARCH(\"fill\",E16,10)),'Manual Inputs'!$C$9,\"0\")))","v":""},{"$f":"IF(ISBLANK(A16),\"\",IF((B16+F16+H16)>'Manual Inputs'!$C$11,(B16+F16+H16),'Manual Inputs'!$C$11))","v":""},{"$f":"IF(ISBLANK(A16),\"\",IF((C16+G16+I16)>'Manual Inputs'!$C$11,(C16+G16+I16),'Manual Inputs'!$C$11))","v":""}]
[null,null,null,null,null,{"$f":"IF(ISBLANK(A17),\"\",IF(ISNUMBER(SEARCH(\"cut\",D17,10)),'Manual Inputs'!$C$5,\"0\"))","v":""},{"$f":"IF(ISBLANK(B17),\"\",IF(ISNUMBER(SEARCH(\"cut\",E17,10)),'Manual Inputs'!$C$5,\"0\"))","v":""},{"$f":"IF(ISBLANK(A17),\"\",IF(ISNUMBER(SEARCH(\"cut\",D17,10)),'Manual Inputs'!$C$7,IF(ISNUMBER(SEARCH(\"fill\",D17,10)),'Manual Inputs'!$C$9,\"0\")))","v":""},{"$f":"IF(ISBLANK(A17),\"\",IF(ISNUMBER(SEARCH(\"cut\",E17,10)),'Manual Inputs'!$C$7,IF(ISNUMBER(SEARCH(\"fill\",E17,10)),'Manual Inputs'!$C$9,\"0\")))","v":""},{"$f":"IF(ISBLANK(A17),\"\",IF((B17+F17+H17)>'Manual Inputs'!$C$11,(B17+F17+H17),'Manual Inputs'!$C$11))","v":""},{"$f":"IF(ISBLANK(A17),\"\",IF((C17+G17+I17)>'Manual Inputs'!$C$11,(C17+G17+I17),'Manual Inputs'!$C$11))","v":""}]
[null,null,null,null,null,{"$f":"IF(ISBLANK(A18),\"\",IF(ISNUMBER(SEARCH(\"cut\",D18,10)),'Manual Inputs'!$C$5,\"0\"))","v":""},{"$f":"IF(ISBLANK(B18),\"\",IF(ISNUMBER(SEARCH(\"cut\",E18,10)),'Manual Inputs'!$C$5,\"0\"))","v":""},{"$f":"IF(ISBLANK(A18),\"\",IF(ISNUMBER(SEARCH(\"cut\",D18,10)),'Manual Inputs'!$C$7,IF(ISNUMBER(SEARCH(\"fill\",D18,10)),'Manual Inputs'!$C$9,\"0\")))","v":""},{"$f":"IF(ISBLANK(A18),\"\",IF(ISNUMBER(SEARCH(\"cut\",E18,10)),'Manual Inputs'!$C$7,IF(ISNUMBER(SEARCH(\"fill\",E18,10)),'Manual Inputs'!$C$9,\"0\")))","v":""},{"$f":"IF(ISBLANK(A18),\"\",IF((B18+F18+H18)>'Manual Inputs'!$C$11,(B18+F18+H18),'Manual Inputs'!$C$11))","v":""},{"$f":"IF(ISBLANK(A18),\"\",IF((C18+G18+I18)>'Manual Inputs'!$C$11,(C18+G18+I18),'Manual Inputs'!$C$11))","v":""}]
[null,null,null,null,null,{"$f":"IF(ISBLANK(A19),\"\",IF(ISNUMBER(SEARCH(\"cut\",D19,10)),'Manual Inputs'!$C$5,\"0\"))","v":""},{"$f":"IF(ISBLANK(B19),\"\",IF(ISNUMBER(SEARCH(\"cut\",E19,10)),'Manual Inputs'!$C$5,\"0\"))","v":""},{"$f":"IF(ISBLANK(A19),\"\",IF(ISNUMBER(SEARCH(\"cut\",D19,10)),'Manual Inputs'!$C$7,IF(ISNUMBER(SEARCH(\"fill\",D19,10)),'Manual Inputs'!$C$9,\"0\")))","v":""},{"$f":"IF(ISBLANK(A19),\"\",IF(ISNUMBER(SEARCH(\"cut\",E19,10)),'Manual Inputs'!$C$7,IF(ISNUMBER(SEARCH(\"fill\",E19,10)),'Manual Inputs'!$C$9,\"0\")))","v":""},{"$f":"IF(ISBLANK(A19),\"\",IF((B19+F19+H19)>'Manual Inputs'!$C$11,(B19+F19+H19),'Manual Inputs'!$C$11))","v":""},{"$f":"IF(ISBLANK(A19),\"\",IF((C19+G19+I19)>'Manual Inputs'!$C$11,(C19+G19+I19),'Manual Inputs'!$C$11))","v":""}]
[null,null,null,null,null,{"$f":"IF(ISBLANK(A20),\"\",IF(ISNUMBER(SEARCH(\"cut\",D20,10)),'Manual Inputs'!$C$5,\"0\"))","v":""},{"$f":"IF(ISBLANK(B20),\"\",IF(ISNUMBER(SEARCH(\"cut\",E20,10)),'Manual Inputs'!$C$5,\"0\"))","v":""},{"$f":"IF(ISBLANK(A20),\"\",IF(ISNUMBER(SEARCH(\"cut\",D20,10)),'Manual Inputs'!$C$7,IF(ISNUMBER(SEARCH(\"fill\",D20,10)),'Manual Inputs'!$C$9,\"0\")))","v":""},{"$f":"IF(ISBLANK(A20),\"\",IF(ISNUMBER(SEARCH(\"cut\",E20,10)),'Manual Inputs'!$C$7,IF(ISNUMBER(SEARCH(\"fill\",E20,10)),'Manual Inputs'!$C$9,\"0\")))","v":""},{"$f":"IF(ISBLANK(A20),\"\",IF((B20+F20+H20)>'Manual Inputs'!$C$11,(B20+F20+H20),'Manual Inputs'!$C$11))","v":""},{"$f":"IF(ISBLANK(A20),\"\",IF((C20+G20+I20)>'Manual Inputs'!$C$11,(C20+G20+I20),'Manual Inputs'!$C$11))","v":""}]
[null,null,null,null,null,{"$f":"IF(ISBLANK(A21),\"\",IF(ISNUMBER(SEARCH(\"cut\",D21,10)),'Manual Inputs'!$C$5,\"0\"))","v":""},{"$f":"IF(ISBLANK(B21),\"\",IF(ISNUMBER(SEARCH(\"cut\",E21,10)),'Manual Inputs'!$C$5,\"0\"))","v":""},{"$f":"IF(ISBLANK(A21),\"\",IF(ISNUMBER(SEARCH(\"cut\",D21,10)),'Manual Inputs'!$C$7,IF(ISNUMBER(SEARCH(\"fill\",D21,10)),'Manual Inputs'!$C$9,\"0\")))","v":""},{"$f":"IF(ISBLANK(A21),\"\",IF(ISNUMBER(SEARCH(\"cut\",E21,10)),'Manual Inputs'!$C$7,IF(ISNUMBER(SEARCH(\"fill\",E21,10)),'Manual Inputs'!$C$9,\"0\")))","v":""},{"$f":"IF(ISBLANK(A21),\"\",IF((B21+F21+H21)>'Manual Inputs'!$C$11,(B21+F21+H21),'Manual Inputs'!$C$11))","v":""},{"$f":"IF(ISBLANK(A21),\"\",IF((C21+G21+I21)>'Manual Inputs'!$C$11,(C21+G21+I21),'Manual Inputs'!$C$11))","v":""}]
[null,null,null,null,null,{"$f":"IF(ISBLANK(A22),\"\",IF(ISNUMBER(SEARCH(\"cut\",D22,10)),'Manual Inputs'!$C$5,\"0\"))","v":""},{"$f":"IF(ISBLANK(B22),\"\",IF(ISNUMBER(SEARCH(\"cut\",E22,10)),'Manual Inputs'!$C$5,\"0\"))","v":""},{"$f":"IF(ISBLANK(A22),\"\",IF(ISNUMBER(SEARCH(\"cut\",D22,10)),'Manual Inputs'!$C$7,IF(ISNUMBER(SEARCH(\"fill\",D22,10)),'Manual Inputs'!$C$9,\"0\")))","v":""},{"$f":"IF(ISBLANK(A22),\"\",IF(ISNUMBER(SEARCH(\"cut\",E22,10)),'Manual Inputs'!$C$7,IF(ISNUMBER(SEARCH(\"fill\",E22,10)),'Manual Inputs'!$C$9,\"0\")))","v":""},{"$f":"IF(ISBLANK(A22),\"\",IF((B22+F22+H22)>'Manual Inputs'!$C$11,(B22+F22+H22),'Manual Inputs'!$C$11))","v":""},{"$f":"IF(ISBLANK(A22),\"\",IF((C22+G22+I22)>'Manual Inputs'!$C$11,(C22+G22+I22),'Manual Inputs'!$C$11))","v":""}]
[null,null,null,null,null,{"$f":"IF(ISBLANK(A23),\"\",IF(ISNUMBER(SEARCH(\"cut\",D23,10)),'Manual Inputs'!$C$5,\"0\"))","v":""},{"$f":"IF(ISBLANK(B23),\"\",IF(ISNUMBER(SEARCH(\"cut\",E23,10)),'Manual Inputs'!$C$5,\"0\"))","v":""},{"$f":"IF(ISBLANK(A23),\"\",IF(ISNUMBER(SEARCH(\"cut\",D23,10)),'Manual Inputs'!$C$7,IF(ISNUMBER(SEARCH(\"fill\",D23,10)),'Manual Inputs'!$C$9,\"0\")))","v":""},{"$f":"IF(ISBLANK(A23),\"\",IF(ISNUMBER(SEARCH(\"cut\",E23,10)),'Manual Inputs'!$C$7,IF(ISNUMBER(SEARCH(\"fill\",E23,10)),'Manual Inputs'!$C$9,\"0\")))","v":""},{"$f":"IF(ISBLANK(A23),\"\",IF((B23+F23+H23)>'Manual Inputs'!$C$11,(B23+F23+H23),'Manual Inputs'!$C$11))","v":""},{"$f":"IF(ISBLANK(A23),\"\",IF((C23+G23+I23)>'Manual Inputs'!$C$11,(C23+G23+I23),'Manual Inputs'!$C$11))","v":""}]
[null,null,null,null,null,{"$f":"IF(ISBLANK(A24),\"\",IF(ISNUMBER(SEARCH(\"cut\",D24,10)),'Manual Inputs'!$C$5,\"0\"))","v":""},{"$f":"IF(ISBLANK(B24),\"\",IF(ISNUMBER(SEARCH(\"cut\",E24,10)),'Manual Inputs'!$C$5,\"0\"))","v":""},{"$f":"IF(ISBLANK(A24),\"\",IF(ISNUMBER(SEARCH(\"cut\",D24,10)),'Manual Inputs'!$C$7,IF(ISNUMBER(SEARCH(\"fill\",D24,10)),'Manual Inputs'!$C$9,\"0\")))","v":""},{"$f":"IF(ISBLANK(A24),\"\",IF(ISNUMBER(SEARCH(\"cut\",E24,10)),'Manual Inputs'!$C$7,IF(ISNUMBER(SEARCH(\"fill\",E24,10)),'Manual Inputs'!$C$9,\"0\")))","v":""},{"$f":"IF(ISBLANK(A24),\"\",IF((B24+F24+H24)>'Manual Inputs'!$C$11,(B24+F24+H24),'Manual Inputs'!$C$11))","v":""},{"$f":"IF(ISBLANK(A24),\"\",IF((C24+G24+I24)>'Manual Inputs'!$C$11,(C24+G24+I24),'Manual Inputs'!$C$11))","v":""}]
[null,null,null,null,null,{"$f":"IF(ISBLANK(A25),\"\",IF(ISNUMBER(SEARCH(\"cut\",D25,10)),'Manual Inputs'!$C$5,\"0\"))","v":""},{"$f":"IF(ISBLANK(B25),\"\",IF(ISNUMBER(SEARCH(\"cut\",E25,10)),'Manual Inputs'!$C$5,\"0\"))","v":""},{"$f":"IF(ISBLANK(A25),\"\",IF(ISNUMBER(SEARCH(\"cut\",D25,10)),'Manual Inputs'!$C$7,IF(ISNUMBER(SEARCH(\"fill\",D25,10)),'Manual Inputs'!$C$9,\"0\")))","v":""},{"$f":"IF(ISBLANK(A25),\"\",IF(ISNUMBER(SEARCH(\"cut\",E25,10)),'Manual Inputs'!$C$7,IF(ISNUMBER(SEARCH(\"fill\",E25,10)),'Manual Inputs'!$C$9,\"0\")))","v":""},{"$f":"IF(ISBLANK(A25),\"\",IF((B25+F25+H25)>'Manual Inputs'!$C$11,(B25+F25+H25),'Manual Inputs'!$C$11))","v":""},{"$f":"IF(ISBLANK(A25),\"\",IF((C25+G25+I25)>'Manual Inputs'!$C$11,(C25+G25+I25),'Manual Inputs'!$C$11))","v":""}]